{"text_format":"1","workbook":"xlsx","n_sheets":16,"sheets":["Macros Required","Welcome","Input","Sensitivity Analysis","Valuation Analysis","Expected Results","Optimistic Results","Pessimistic Results","Forecast Revenue Chart","Forecast Return Chart","Operating Surplus Chart","Surplus & Return % Chart","Instructions","Terms and Conditions","Worksheet","Scratch"],"not_rendered":{"charts":8,"images":12,"macros":1,"external_links":0,"defined_names":20,"comments":3,"pivot_tables":0},"unopened":[{"sheet":"Forecast Revenue Chart","index":8,"reason":"not_a_worksheet"},{"sheet":"Forecast Return Chart","index":9,"reason":"not_a_worksheet"},{"sheet":"Operating Surplus Chart","index":10,"reason":"not_a_worksheet"},{"sheet":"Surplus & Return % Chart","index":11,"reason":"not_a_worksheet"}],"bounds":{"document_bytes":16777216,"sheet_cells":100000,"rows_first":2000,"rows_last":500,"rows_between":2000,"halvings":0,"cell_chars":16384,"cell_head_chars":4096},"cells_cut":0,"cells_raw":0,"read":"whole","date_system":"1900"}

{"sheet":"Macros Required","index":0,"n_rows":18,"n_cols":2,"rows_kept":18,"cut":false,"hidden":true,"merged":[]}
[]
[null,{"$f":"\"Macros Required - \" & 'Terms and Conditions'!B3","v":"Macros Required - Business Valuation Model Excel 50"}]
[]
[null,"This software uses macros and has been digitally signed."]
[]
[null," Macros must be enabled for the software to function."]
[]
[null,"To adjust macro security levels from Excel go Tools, Macro, Security, Security Level. It is recommended that you select Security Level as Medium. When you open software with macros and Security Level is set as Medium you are presented with a message advising that the software contains macros with a prompt to Disable or Enable Macros "]
[]
[null,"If macros are disabled you cannot access the Input Sheet."]
{"$rows_left_out":9}
{"sheet":"Welcome","index":1,"n_rows":31,"n_cols":2,"rows_kept":31,"cut":false,"hidden":false,"merged":[]}
[]
[null,{"$f":"\"Welcome\"","v":"Welcome"}]
[null,{"$f":"'Terms and Conditions'!B3","v":"Business Valuation Model Excel 50"}]
[]
[null,"Initial input is in blue cells on the Input Sheet. Use the tabs at the bottom of the window to select the Input Sheet. Non-input cells are protected to maintain formula integrity. "]
[null,{"$f":"'Terms and Conditions'!B4","v":"Software licensed to"}]
[null,{"$f":"'Terms and Conditions'!B5","v":"Not Licensed, Evaluation Mode."}]
[null,{"$f":"'Terms and Conditions'!B6","v":"Inputs for Current Performance values (gray cells) are limited to Example Business data."}]
[null,{"$f":"'Terms and Conditions'!B7","v":"Payment is required to Register this software and enable all inputs."}]
[null,{"$f":"'Terms and Conditions'!B12","v":"For Software Support and additional Business Support Software visit:"}]
{"$rows_left_out":22}
{"sheet":"Input","index":2,"n_rows":87,"n_cols":6,"rows_kept":87,"cut":false,"hidden":false,"merged":[[14,4,14,5],[8,3,8,5],[11,1,11,5],[10,2,10,4],[12,3,12,5],[8,1,8,2],[1,3,1,5],[2,3,2,5],[4,1,4,5],[5,1,5,5],[6,1,6,5],[50,1,50,2],[50,3,50,5],[29,4,29,5],[20,4,20,5],[21,4,21,5],[35,1,35,2],[30,4,30,5],[22,4,22,5],[24,4,24,5],[25,4,25,5],[15,4,15,5],[27,4,27,5],[28,4,28,5],[47,3,47,5],[31,4,31,5],[32,4,32,5],[35,3,35,5],[26,4,26,5],[18,4,18,5],[19,4,19,5],[23,4,23,5],[16,4,16,5],[17,4,17,5],[59,4,59,5],[52,3,52,5],[53,3,53,5],[54,3,54,5],[55,3,55,5],[56,3,56,5],[57,3,57,5],[58,3,58,5],[63,3,63,5],[80,1,80,5],[81,1,81,5],[82,1,82,5],[60,3,60,5],[62,1,62,5],[75,1,75,5],[64,1,64,5],[83,1,83,5],[76,1,76,5],[77,1,77,5],[78,1,78,5],[79,1,79,5]]}
[]
[]
[]
[]
[null,{"$f":" \"Input - \" & 'Terms and Conditions'!B3","v":"Input - Business Valuation Model Excel 50"}]
[null,"Blue cells allow input. View comments by positioning your mouse over the red marker cell or click the hyperlink for the"]
[null,"Instruction Sheet"]
[]
[null,"Current Operating Performance Data",null,"This section reviews current business performance for a full year."]
[]
{"$rows_left_out":78}
{"sheet":"Sensitivity Analysis","index":3,"n_rows":29,"n_cols":7,"rows_kept":29,"cut":false,"hidden":false,"merged":[[33,1,33,6],[34,1,34,6],[35,1,35,6],[36,1,36,6],[29,1,29,6],[30,1,30,6],[31,1,31,6],[32,1,32,6],[1,2,1,6],[2,2,2,6],[4,1,4,6],[5,1,5,6],[28,1,28,6],[25,1,25,6],[6,5,7,6],[6,1,6,3],[7,1,7,3]]}
[]
[]
[]
[]
[null,{"$f":" \"Sensitivity Analysis - \" & 'Terms and Conditions'!B3","v":"Sensitivity Analysis - Business Valuation Model Excel 50"}]
[null,"To test the sensitivity of your forecast input adjustment percentages in the blue cells. Green cells provide Optimistic results, yellow cells Expected, and tan cells Pessimistic. An Output Summary is provided at the bottom of this sheet."]
[null,"Optimistic, improve the variation of all Relative Indicators by",null,null,0.2,"Go to Valuation"]
[null,"Pessimistic, degrade the variation of all Relative Indicators by",null,null,0.2]
[null,null,"Current Year","Year 1","Year 2","Year 3","3 Year Average"]
[null,{"$f":"+Worksheet!B5","v":"Business Revenue"}]
{"$rows_left_out":20}
{"sheet":"Valuation Analysis","index":4,"n_rows":33,"n_cols":7,"rows_kept":33,"cut":false,"hidden":false,"merged":[[37,1,37,6],[38,1,38,6],[39,1,39,6],[40,1,40,6],[33,1,33,6],[34,1,34,6],[35,1,35,6],[36,1,36,6],[30,3,30,5],[11,2,11,5],[27,1,27,6],[32,1,32,6],[13,1,13,2],[13,4,13,6],[26,3,26,6],[23,3,23,6],[24,5,25,5],[24,3,25,4],[8,4,8,5],[8,2,8,3],[1,2,1,6],[2,2,2,6],[4,1,4,6],[5,1,5,6]]}
[]
[]
[]
[]
[null,{"$f":" \"Valuation Analysis - \" & 'Terms and Conditions'!B3","v":"Valuation Analysis - Business Valuation Model Excel 50"}]
[null,"Input your desired Return on Investment to generate a Valuation. To Update the Return calculations input your Valuation and click the Update Button. All input is in the blue cells. Green cells provide Optimistic results, yellow cells Expected, and tan cells Pessimistic. An Output Summary is provided at the bottom of this sheet."]
[]
[null,"Finance is currently set at","Interest",{"$f":"IF(Input!C15=Input!B86,Input!C29,Input!D29)","v":0},"Amount",{"$f":"+Input!C60","v":0}]
[null,"(Set Interest & Amount to 0 for initial Valuation)","Adjust Interest Cost",null,"Adjust Finance Amount"]
[]
{"$rows_left_out":24}
{"sheet":"Expected Results","index":5,"n_rows":56,"n_cols":7,"rows_kept":56,"cut":false,"hidden":false,"merged":[[63,1,63,6],[58,1,58,6],[59,1,59,6],[60,1,60,6],[61,1,61,6],[1,1,1,6],[55,1,55,6],[56,1,56,6],[57,1,57,6],[62,1,62,6]]}
[]
[null,{"$f":" \"Expected Results - \" & 'Terms and Conditions'!B3","v":"Expected Results - Business Valuation Model Excel 50"}]
[null,{"$f":"Worksheet!B2","v":"Expected Forecast"}]
[null,{"$f":"Worksheet!B3","v":"Example Business"}]
[null,null,"Current Year","Year 1","Year 2","Year 3","3 Year Average"]
[null,{"$f":"Worksheet!B5","v":"Business Revenue"},{"$f":"Worksheet!C5","v":500000},{"$f":"Worksheet!D5","v":560679.61165048543},{"$f":"Worksheet!E5","v":588713.59223300975},{"$f":"Worksheet!F5","v":625128.8659793816},{"$f":"Worksheet!G5","v":591507.35662095889}]
[null,{"$f":"Worksheet!B6","v":"Expenses"}]
[null,{"$f":"Worksheet!B7","v":"Variable Costs"}]
[null,{"$f":"Worksheet!B8","v":"Materials & Supplies"},{"$f":"Worksheet!C8","v":10000},{"$f":"Worksheet!D8","v":11431.331888019608},{"$f":"Worksheet!E8","v":12002.898482420587},{"$f":"Worksheet!F8","v":12745.345811230112},{"$f":"Worksheet!G8","v":12059.858727223434}]
[null,{"$f":"Worksheet!B9","v":"% Revenue"},{"$f":"Worksheet!C9","v":0.02},{"$f":"Worksheet!D9","v":2.0388349514563111E-2},{"$f":"Worksheet!E9","v":2.0388349514563107E-2},{"$f":"Worksheet!F9","v":2.0388349514563111E-2},{"$f":"Worksheet!G9","v":2.0388349514563107E-2}]
{"$rows_left_out":47}
{"sheet":"Optimistic Results","index":6,"n_rows":56,"n_cols":7,"rows_kept":56,"cut":false,"hidden":false,"merged":[[63,1,63,6],[58,1,58,6],[59,1,59,6],[60,1,60,6],[61,1,61,6],[1,1,1,6],[55,1,55,6],[56,1,56,6],[57,1,57,6],[62,1,62,6]]}
[]
[null,{"$f":" \"Optimistic Results - \" & 'Terms and Conditions'!B3","v":"Optimistic Results - Business Valuation Model Excel 50"}]
[null,{"$f":"Worksheet!J2","v":"Optimistic Forecast improved by"},{"$f":"Worksheet!K2","v":0.2}]
[null,{"$f":"Worksheet!J3","v":"Example Business"}]
[null,null,{"$f":"Worksheet!K4","v":"Current Year"},{"$f":"Worksheet!L4","v":"Year 1"},{"$f":"Worksheet!M4","v":"Year 2"},{"$f":"Worksheet!N4","v":"Year 3"},{"$f":"Worksheet!O4","v":"3 Year Average"}]
[null,{"$f":"Worksheet!J5","v":"Business Revenue"},{"$f":"Worksheet!K5","v":500000},{"$f":"Worksheet!L5","v":579687.5},{"$f":"Worksheet!M5","v":614468.75},{"$f":"Worksheet!N5","v":660362.68153526972},{"$f":"Worksheet!O5","v":618172.9771784232}]
[null,{"$f":"Worksheet!J6","v":"Expenses"}]
[null,{"$f":"Worksheet!J7","v":"Variable Costs"}]
[null,{"$f":"Worksheet!J8","v":"Materials & Supplies"},{"$f":"Worksheet!K8","v":10000},{"$f":"Worksheet!L8","v":11750.422297297297},{"$f":"Worksheet!M8","v":12337.943412162162},{"$f":"Worksheet!N8","v":13259.449559128632},{"$f":"Worksheet!O8","v":12449.271756196031}]
[null,{"$f":"Worksheet!J9","v":"% Revenue"},{"$f":"Worksheet!K9","v":0.02},{"$f":"Worksheet!L9","v":2.0270270270270268E-2},{"$f":"Worksheet!M9","v":2.0079041305456399E-2},{"$f":"Worksheet!N9","v":2.0079041305456402E-2},{"$f":"Worksheet!O9","v":2.013881585866022E-2}]
{"$rows_left_out":47}
{"sheet":"Pessimistic Results","index":7,"n_rows":56,"n_cols":7,"rows_kept":56,"cut":false,"hidden":false,"merged":[[63,1,63,6],[58,1,58,6],[59,1,59,6],[60,1,60,6],[61,1,61,6],[1,1,1,6],[55,1,55,6],[56,1,56,6],[57,1,57,6],[62,1,62,6]]}
[]
[null,{"$f":" \"Pessimistic Results - \" & 'Terms and Conditions'!B3","v":"Pessimistic Results - Business Valuation Model Excel 50"}]
[null,{"$f":"Worksheet!Q2","v":"Pessimistic Forecast degraded by"},{"$f":"Worksheet!R2","v":0.2}]
[null,{"$f":"Worksheet!Q3","v":"Example Business"}]
[null,null,{"$f":"Worksheet!R4","v":"Current Year"},{"$f":"Worksheet!S4","v":"Year 1"},{"$f":"Worksheet!T4","v":"Year 2"},{"$f":"Worksheet!U4","v":"Year 3"},{"$f":"Worksheet!V4","v":"3 Year Average"}]
[null,{"$f":"Worksheet!Q5","v":"Business Revenue"},{"$f":"Worksheet!R5","v":500000},{"$f":"Worksheet!S5","v":542084.94208494201},{"$f":"Worksheet!T5","v":563768.33976833976},{"$f":"Worksheet!U5","v":591494.65156022529},{"$f":"Worksheet!V5","v":565782.6444711691}]
[null,{"$f":"Worksheet!Q6","v":"Expenses"}]
[null,{"$f":"Worksheet!Q7","v":"Variable Costs"}]
[null,{"$f":"Worksheet!Q8","v":"Materials & Supplies"},{"$f":"Worksheet!R8","v":10000},{"$f":"Worksheet!S8","v":11116.97635135135},{"$f":"Worksheet!T8","v":11672.82516891892},{"$f":"Worksheet!U8","v":12246.898537882147},{"$f":"Worksheet!V8","v":11678.90001938414}]
[null,{"$f":"Worksheet!Q9","v":"% Revenue"},{"$f":"Worksheet!R9","v":0.02},{"$f":"Worksheet!S9","v":2.05078125E-2},{"$f":"Worksheet!T9","v":2.0705003004807696E-2},{"$f":"Worksheet!U9","v":2.0705003004807699E-2},{"$f":"Worksheet!V9","v":2.0642025932591627E-2}]
{"$rows_left_out":47}
{"sheet":"Instructions","index":12,"n_rows":81,"n_cols":4,"rows_kept":81,"cut":false,"hidden":false,"merged":[[85,1,85,3],[86,1,86,3],[87,1,87,3],[88,1,88,3],[81,1,81,3],[82,1,82,3],[83,1,83,3],[84,1,84,3],[1,1,1,3],[80,1,80,3],[7,1,7,3],[2,1,2,3],[69,1,69,3],[8,1,8,3],[70,1,70,3]]}
[]
[null,{"$f":" \"Instructions - \" & 'Terms and Conditions'!B3","v":"Instructions - Business Valuation Model Excel 50"}]
[null,"Overview"]
[null,"Outline",null,"The Business Valuation Model is designed to provide an economical, efficient and effective means to assess the value of a business.  The forecast input should be based on your subjective views.  These  are translated into quantifiable values for model operation.  There is no need to provide \"perfect\" answers.  Use your industry knowledge to make informed estimates.  The goal is to provide a streamline tool to indicate possible outcomes.  A recent business taxation return will assist in determining values for the Performance section. The Business Valuation Model combines Relative Indicators for future performance with basic financial data (Revenue, Variable Costs, and Fixed Costs) to value the business. This valuation method can be used for business purchase, sale, or establishment. It is compact, easy to use, and requires minimal inputs. Outputs include a 3 Year Forecast, Sensitivity Analysis, Investment Return, and calculated Business Valuation in tabular and graphical form."]
[]
[null,"Contact Details",null,"For questions, suggestions, support or additional business software please visit:"]
[null,null,null,"http://www.bizpeponline.com/"]
[null,"Input"]
[null,"All input is on the Input & Analysis Sheets. Click the tab or hyperlinks to access. Blue cells allow input."]
[null,{"$f":"+Input!B9","v":"Current Operating Performance Data"},null,"This section reviews the current performance of your business for a full year period. It is designed to assess the level of expenses that vary with your sales (Variable Costs) and those that don't (Fixed Costs).  It also allocates a realistic labor cost for the owners effort.  The focus is on cash flow excluding assets and  taxation.  Broad expense categories are provided.  Labels in blue cells can be adjusted however they should reflect the original label type to ensure formula are applied correctly. Values can be based on the previous years tax return adjusted for current trading.  Inputs do not have to be perfect but should reasonably reflect business operation."]
{"$rows_left_out":72}
{"sheet":"Terms and Conditions","index":13,"n_rows":125,"n_cols":2,"rows_kept":125,"cut":false,"hidden":false,"merged":[]}
[]
[null,"Terms and Conditions"]
[null,"Business Valuation Model Excel 50"]
[null,"Software licensed to"]
[null,"Not Licensed, Evaluation Mode."]
[null,"Inputs for Current Performance values (gray cells) are limited to Example Business data."]
[null,"Payment is required to Register this software and enable all inputs."]
[null,"by"]
[null,"Bizpep"]
[null,"Copyright © Bizpep 2010 - www.bizpeponline.com."]
{"$rows_left_out":116}
{"sheet":"Worksheet","index":14,"n_rows":99,"n_cols":22,"rows_kept":99,"cut":false,"hidden":true,"merged":[[47,16,47,20],[48,16,48,19],[69,16,69,18],[48,1,48,4],[47,1,47,5],[69,1,69,3],[47,9,47,13],[48,9,48,12],[69,9,69,11]]}
[]
[null,"Expected Forecast",null,null,null,null,null,null,null,"Optimistic Forecast improved by",{"$f":"+'Sensitivity Analysis'!E7","v":0.2},null,null,null,null,null,"Pessimistic Forecast degraded by",{"$f":"+'Sensitivity Analysis'!E8","v":0.2}]
[null,{"$f":"+Input!C11","v":"Example Business"},null,null,null,null,null,null,null,{"$f":"+$B3","v":"Example Business"},null,null,null,null,null,null,{"$f":"+$B3","v":"Example Business"}]
[null,"Expected",{"$f":"+C50","v":"Current Year"},{"$f":"+D50","v":"Year 1"},{"$f":"+E50","v":"Year 2"},{"$f":"+F50","v":"Year 3"},{"$f":"+G85","v":"3 Year Average"},null,null,"Optimistic",{"$f":"+K50","v":"Current Year"},{"$f":"+L50","v":"Year 1"},{"$f":"+M50","v":"Year 2"},{"$f":"+N50","v":"Year 3"},{"$f":"+O85","v":"3 Year Average"},null,"Pessimistic",{"$f":"+R50","v":"Current Year"},{"$f":"+S50","v":"Year 1"},{"$f":"+T50","v":"Year 2"},{"$f":"+U50","v":"Year 3"},{"$f":"+V85","v":"3 Year Average"}]
[null,{"$f":"+Input!B13","v":"Business Revenue"},{"$f":"+Input!C13","v":500000},{"$f":"+C5*D52*D56/D51","v":560679.61165048543},{"$f":"+D5*E52*E56/E51","v":588713.59223300975},{"$f":"+E5*F52*F56/F51","v":625128.8659793816},{"$f":"AVERAGE(D5:F5)","v":591507.35662095889},null,null,{"$f":"+$B5","v":"Business Revenue"},{"$f":"+C5","v":500000},{"$f":"+K5*L52*L56/L51","v":579687.5},{"$f":"+L5*M52*M56/M51","v":614468.75},{"$f":"+M5*N52*N56/N51","v":660362.68153526972},{"$f":"AVERAGE(L5:N5)","v":618172.9771784232},null,{"$f":"+$B5","v":"Business Revenue"},{"$f":"+C5","v":500000},{"$f":"+R5*S52*S56/S51","v":542084.94208494201},{"$f":"+S5*T52*T56/T51","v":563768.33976833976},{"$f":"+T5*U52*U56/U51","v":591494.65156022529},{"$f":"AVERAGE(S5:U5)","v":565782.6444711691}]
[null,{"$f":"+Input!B15","v":"Expenses"},null,null,null,null,null,null,null,{"$f":"+$B6","v":"Expenses"},null,null,null,null,null,null,{"$f":"+$B6","v":"Expenses"}]
[null,{"$f":"+Input!B16","v":"Variable Costs"},null,null,null,null,null,null,null,"Variable Costs",null,null,null,null,null,null,"Variable Costs"]
[null,{"$f":"+Input!B17","v":"Materials & Supplies"},{"$f":"IF(Input!C$15=Input!B$86,Input!C$17,Input!D$17)","v":10000},{"$f":"+D5*$C9*$D53/D57","v":11431.331888019608},{"$f":"+E5*$C9*$D53*$E53/D57/E57","v":12002.898482420587},{"$f":"+F5*$C9*$D53*$E53*F53/D57/E57/F57","v":12745.345811230112},{"$f":"AVERAGE(D8:F8)","v":12059.858727223434},null,null,"Materials & Supplies",{"$f":"+C8","v":10000},{"$f":"+L5*$C9*$D53/L57","v":11750.422297297297},{"$f":"+M5*$C9*$D53*$E53/L57/M57","v":12337.943412162162},{"$f":"+N5*$C9*$D53*$E53*N53/L57/M57/N57","v":13259.449559128632},{"$f":"AVERAGE(L8:N8)","v":12449.271756196031},null,"Materials & Supplies",{"$f":"+C8","v":10000},{"$f":"+S5*$C9*$D53/S57","v":11116.97635135135},{"$f":"+T5*$C9*$D53*$E53/S57/T57","v":11672.82516891892},{"$f":"+U5*$C9*$D53*$E53*U53/S57/T57/U57","v":12246.898537882147},{"$f":"AVERAGE(S8:U8)","v":11678.90001938414}]
[null,"% Revenue",{"$f":"+C8/C$5","v":0.02},{"$f":"+D8/D5","v":2.0388349514563111E-2},{"$f":"+E8/E5","v":2.0388349514563107E-2},{"$f":"+F8/F5","v":2.0388349514563111E-2},{"$f":"+G8/G5","v":2.0388349514563107E-2},null,null,"% Revenue",{"$f":"+K8/K$5","v":0.02},{"$f":"+L8/L5","v":2.0270270270270268E-2},{"$f":"+M8/M5","v":2.0079041305456399E-2},{"$f":"+N8/N5","v":2.0079041305456402E-2},{"$f":"+O8/O5","v":2.013881585866022E-2},null,"% Revenue",{"$f":"+R8/R$5","v":0.02},{"$f":"+S8/S5","v":2.05078125E-2},{"$f":"+T8/T5","v":2.0705003004807696E-2},{"$f":"+U8/U5","v":2.0705003004807699E-2},{"$f":"+V8/V5","v":2.0642025932591627E-2}]
[null,{"$f":"+Input!B18","v":"Labor excluding Owner"},{"$f":"IF(Input!C$15=Input!B$86,Input!C$18,Input!D$18)","v":200000},{"$f":"+D$5*($C11+$C13)*D54/D57-D12","v":222477.96682062396},{"$f":"+E$5*($C11+$C13)*D54*E54/D57/E57-E12","v":229085.76170759567},{"$f":"+F$5*($C11+$C13)*D54*E54*F54/D57/E57/F57-F12","v":258404.25030321415},{"$f":"AVERAGE(D10:F10)","v":236655.99294381126},null,null,"Labor excluding Owner",{"$f":"+C10","v":200000},{"$f":"+L$5*($C11+$C13)*L54/L57-L12","v":230170.39695945947},{"$f":"+M$5*($C11+$C13)*L54*M54/L57/M57-M12","v":235320.77756314661},{"$f":"+N$5*($C11+$C13)*L54*M54*N54/L57/M57/N57-N12","v":265969.27342111943},{"$f":"AVERAGE(L10:N10)","v":243820.14931457516},null,"Labor excluding Owner",{"$f":"+C10","v":200000},{"$f":"+S$5*($C11+$C13)*S54/S57-S12","v":214900.33783783778},{"$f":"+T$5*($C11+$C13)*S54*T54/S57/T57-T12","v":222879.78046240841},{"$f":"+U$5*($C11+$C13)*S54*T54*U54/S57/T57/U57-U12","v":250882.66180386988},{"$f":"AVERAGE(S10:U10)","v":229554.26003470537}]
{"$rows_left_out":90}
{"sheet":"Scratch","index":15,"n_rows":25,"n_cols":2,"rows_kept":25,"cut":false,"hidden":true,"merged":[]}
[]
[]
[]
[]
[]
[]
[]
[]
[]
[]
{"$rows_left_out":15}