{"text_format":"1","workbook":"xlsx","n_sheets":6,"sheets":["Dashboard","Calculation","Pivottwo ","Pivotone","mapping","Data"],"not_rendered":{"charts":4,"images":0,"macros":0,"external_links":0,"defined_names":7,"comments":0,"pivot_tables":2},"unopened":[],"bounds":{"document_bytes":16777216,"sheet_cells":100000,"rows_first":2000,"rows_last":500,"rows_between":2000,"halvings":0,"cell_chars":16384,"cell_head_chars":4096},"cells_cut":0,"cells_raw":0,"read":"whole","date_system":"1900"}

{"sheet":"Dashboard","index":0,"n_rows":58,"n_cols":18,"rows_kept":58,"cut":false,"hidden":false,"merged":[[33,7,33,8],[34,5,34,6],[34,7,34,8],[36,5,36,6],[36,7,36,8],[35,5,35,6],[35,7,35,8],[31,5,31,6],[31,7,31,8],[36,9,36,10],[37,9,37,10],[26,9,26,10],[27,9,27,10],[28,9,28,10],[29,9,29,10],[30,9,30,10],[31,9,31,10],[35,9,35,10],[37,5,37,6],[37,7,37,8],[32,5,32,6],[32,7,32,8],[33,5,33,6],[44,14,44,15],[4,2,4,17],[24,2,25,6],[32,9,32,10],[33,9,33,10],[34,9,34,10],[26,5,26,6],[26,7,26,8],[27,5,27,6],[27,7,27,8],[28,5,28,6],[28,7,28,8],[29,5,29,6],[29,7,29,8],[30,5,30,6],[30,7,30,8],[40,12,40,17],[48,14,49,15],[48,16,49,16],[48,12,49,13],[48,17,49,17],[45,12,45,13],[45,14,45,15],[46,12,46,13],[46,14,46,15],[47,12,47,13],[47,14,47,15],[42,14,42,15],[42,12,42,13],[43,12,43,13],[43,14,43,15],[44,12,44,13]]}
[]
[]
[]
[]
[null,null,"Excel Salary survey Data"]
[]
[]
[]
[]
[]
[]
[]
[]
[]
[]
[]
[]
[]
[]
[]
{"$rows_left_out":39}
{"sheet":"Calculation","index":1,"n_rows":75,"n_cols":23,"rows_kept":75,"cut":false,"hidden":false,"merged":[[20,14,20,15],[20,3,20,4],[20,5,20,6],[20,7,20,8],[20,9,20,10],[20,11,20,12]]}
[]
[]
[]
[]
[]
[]
[]
[]
[]
[]
[]
[]
[]
[]
[]
[]
[]
[]
[]
[]
{"$rows_left_out":56}
{"sheet":"Pivottwo ","index":2,"n_rows":15,"n_cols":7,"rows_kept":15,"cut":false,"hidden":false,"merged":[]}
[]
[]
["Count of Salary in USD","Column Labels"]
["Row Labels","1 or 2 hours a day","2 to 3 hours per day","4 to 6 hours a day","All the 8 hours baby, all the 8!","Excel ?!? What Excel?","Grand Total"]
["Accountant",4,34,58,39,null,135]
["Analyst",57,137,329,215,5,743]
["Consultant",12,26,27,25,null,90]
["Controller",2,15,36,14,null,67]
["CXO or Top Mgmt.",10,22,32,11,null,75]
["Engineer",14,26,26,8,null,74]
["Manager",65,166,215,110,2,558]
["Misc.",2,1,3,1,null,7]
["Reporting",4,12,26,41,null,83]
["Specialist",4,12,23,12,null,51]
["Grand Total",174,451,775,476,7,1883]

{"sheet":"Pivotone","index":3,"n_rows":15,"n_cols":7,"rows_kept":15,"cut":false,"hidden":false,"merged":[]}
[]
[]
["Sum of Salary in USD","Column Labels"]
["Row Labels","1 or 2 hours a day","2 to 3 hours per day","4 to 6 hours a day","All the 8 hours baby, all the 8!","Excel ?!? What Excel?","Grand Total"]
["Accountant",87201.973098284434,1278065.8949842113,4035501.3172119451,1915750.2932257301,null,7316519.4785201708]
["Analyst",2497698.7669547582,6654434.1169609893,15695244.701194942,9234925.4212033991,315453.67055368022,34397756.676867768]
["Consultant",547484.92330488062,1674624.0220708929,1675134.3922084388,1768322.6523190467,null,5665565.9899032591]
["Controller",74995.482820131787,1162435.932117051,2279259.2560399813,845272.57374912687,null,4361963.2447262909]
["CXO or Top Mgmt.",793531.50650823419,2653298.7099546315,2958563.5388856176,889546.91605107766,null,7294940.6713995608]
["Engineer",494929.79465060291,1733476.7135923521,1271639.3638250576,326875.33334995405,null,3826921.2054179665]
["Manager",3739019.2132787476,7971864.7966886163,10244727.03731575,3897827.2704607206,87000,25940438.317743834]
["Misc.",164461,41712.231189497601,94493.108336241959,21000,null,321666.33952573955]
["Reporting",52287.46251433537,353950.80337453313,465160.39769449411,753256.49460161524,null,1624655.1581849777]
["Specialist",200779.22926577728,629289.40973428939,1133296.254799901,1087096.5391808571,null,3050461.4329808247]
["Grand Total",8652389.3523957524,24153152.630667061,39853019.367512368,20739873.494141527,402453.67055368022,93800888.515270397]

{"sheet":"mapping","index":4,"n_rows":137,"n_cols":13,"rows_kept":137,"cut":false,"hidden":false,"merged":[[0,1,0,2]]}
[null,"Mapping Sheet",null,null,null,null,"Source: Xrates on 6/21/2012","and xe.com"]
[null,"Currency Mapping",null,null,null,null,null,null,null,null,null,"Country Mapping"]
[null,"Currency","in USD",null,null,null,"Value of 1 American Dollar",null,null,null,null,"Actual","Mapping"]
[null,"USD",1,null,null,null,"     Argentine Peso ",4.4927299999999999,"ARS",null,null,"USA","USA"]
[null,"EUR",{"$f":"1/INDEX($H$4:$H$64,MATCH(tblXrate[[#This Row],[Currency]],$I$4:$I$64,0))","v":1.2703994389916078},null,null,null,"     Australian Dollar ",0.98047899999999999,"AUD",null,null,"India","India"]
[null,"PKR",{"$f":"1/INDEX($H$4:$H$64,MATCH(tblXrate[[#This Row],[Currency]],$I$4:$I$64,0))","v":1.0614088716799131E-2},null,null,null,"     Botswana Pula ",7.6569700000000003,"BWP",null,null,"UK","UK"]
[null,"INR",{"$f":"1/INDEX($H$4:$H$64,MATCH(tblXrate[[#This Row],[Currency]],$I$4:$I$64,0))","v":1.7807916687442568E-2},null,null,null,"     Brazilian Real ",2.0231400000000002,"BRL",null,null,"Australia","Australia"]
[null,"GBP",{"$f":"1/INDEX($H$4:$H$64,MATCH(tblXrate[[#This Row],[Currency]],$I$4:$I$64,0))","v":1.5761782720672841},null,null,null,"     British Pound ",0.63444599999999995,"GBP",null,null,"Canada","Canada"]
[null,"AUD",{"$f":"1/INDEX($H$4:$H$64,MATCH(tblXrate[[#This Row],[Currency]],$I$4:$I$64,0))","v":1.0199096564026358},null,null,null,"     Brunei dollar ",1.2686999999999999,"BND",null,null,"Pakistan","Pakistan"]
[null,"CAD",{"$f":"1/INDEX($H$4:$H$64,MATCH(tblXrate[[#This Row],[Currency]],$I$4:$I$64,0))","v":0.98336152303032687},null,null,null,"     Bulgarian Lev ",1.53952,"BGN",null,null,"South Africa","South Africa"]
[null,"PHP",{"$f":"1/INDEX($H$4:$H$64,MATCH(tblXrate[[#This Row],[Currency]],$I$4:$I$64,0))","v":2.3705052257787702E-2},null,null,null,"     Canadian Dollar ",1.01692,"CAD",null,null,"Germany","Germany"]
[null,"AED",{"$f":"1/INDEX($H$4:$H$64,MATCH(tblXrate[[#This Row],[Currency]],$I$4:$I$64,0))","v":0.27221921268759308},null,null,null,"     Chilean Peso ",497.26799999999997,"CLP",null,null,"UAE","UAE"]
[null,"MXN",{"$f":"1/INDEX($H$4:$H$64,MATCH(tblXrate[[#This Row],[Currency]],$I$4:$I$64,0))","v":7.3046552567951561E-2},null,null,null,"     Chinese Yuan ",6.3609099999999996,"CNY",null,null,"Brazil","Brazil"]
[null,"SEK",{"$f":"1/INDEX($H$4:$H$64,MATCH(tblXrate[[#This Row],[Currency]],$I$4:$I$64,0))","v":0.14365525038391866},null,null,null,"     Colombian Peso ",1769.79,"COP",null,null,"Netherlands","Netherlands"]
[null,"BDT",{"$f":"1/INDEX($H$4:$H$64,MATCH(tblXrate[[#This Row],[Currency]],$I$4:$I$64,0))","v":1.2220845340313881E-2},null,null,null,"     Croatian Kuna ",5.9367099999999997,"HRK",null,null,"Singapore","Singapore"]
[null,"COSTARICAN",{"$f":"1/INDEX($H$4:$H$64,MATCH(tblXrate[[#This Row],[Currency]],$I$4:$I$64,0))","v":2.0078305391024996E-3},null,null,null,"     Danish Krone ",5.8512300000000002,"DKK",null,null,"Philippines","Philippines"]
[null,"ZAR",{"$f":"1/INDEX($H$4:$H$64,MATCH(tblXrate[[#This Row],[Currency]],$I$4:$I$64,0))","v":0.12192177986291114},null,null,null,"     Euro ",0.78715400000000002,"EUR",null,null,"Portugal","Portugal"]
[null,"NZD",{"$f":"1/INDEX($H$4:$H$64,MATCH(tblXrate[[#This Row],[Currency]],$I$4:$I$64,0))","v":0.79758809360493876},null,null,null,"     Hong Kong Dollar ",7.7588900000000001,"HKD",null,null,"Spain","Spain"]
[null,"CNY",{"$f":"1/INDEX($H$4:$H$64,MATCH(tblXrate[[#This Row],[Currency]],$I$4:$I$64,0))","v":0.15721021048875083},null,null,null,"     Hungarian Forint ",225.874,"HUF",null,null,"New Zealand","New Zealand"]
[null,"EGYPT",{"$f":"1/INDEX($H$4:$H$64,MATCH(tblXrate[[#This Row],[Currency]],$I$4:$I$64,0))","v":0.16526194017517765},null,null,null,"     Iceland Krona ",124.697,"ISK",null,null,"Russia","Russia"]
{"$rows_left_out":118}
{"sheet":"Data","index":5,"n_rows":1890,"n_cols":14,"rows_kept":1890,"cut":false,"hidden":false,"merged":[[0,1,0,4]]}
[null,"Excel Salary Survey Data",null,null,null,null,12]
[]
[null,"Note: Experience data is not available for first few hundred rows."]
[]
[null,"Unique ID","Timestamp","Your Salary","clean Salary (in local currency)","Currency","Salary in USD","Your Job Title","Job Type","Where do you work","clean Country","How many hours of a day you work on Excel","Years of Experience","Original clean Country"]
[null,"ID0708","2012-05-26T14:04:35","Rs 10000",120000,"INR",{"$f":"Data!$E591*VLOOKUP(Data!$F591,tblXrate[],2,FALSE)","v":3480},"Intern","Analyst","India",{"$f":"VLOOKUP(Data!$J591,tblCountries[[Actual]:[Mapping]],2,FALSE)","v":"Pakistan"},"1 or 2 hours a day",0,"India"]
[null,"ID0711","2012-05-26T14:14:35",400000,400000,"INR",{"$f":"Data!$E594*VLOOKUP(Data!$F594,tblXrate[],2,FALSE)","v":21369.500024931083},"Consultant","Consultant","India",{"$f":"VLOOKUP(Data!$J594,tblCountries[[Actual]:[Mapping]],2,FALSE)","v":"India"},"4 to 6 hours a day",0,"India"]
[null,"ID0816","2012-05-26T22:23:38",516000,516000,"INR",{"$f":"Data!$E678*VLOOKUP(Data!$F678,tblXrate[],2,FALSE)","v":96891.417358250401},"Management Trainee","Manager","India",{"$f":"VLOOKUP(Data!$J678,tblCountries[[Actual]:[Mapping]],2,FALSE)","v":"Australia"},"4 to 6 hours a day",0,"India"]
[null,"ID0998","2012-05-28T09:41:04",204000,204000,"INR",{"$f":"Data!$E802*VLOOKUP(Data!$F802,tblXrate[],2,FALSE)","v":20571},"Retired Government Officer, having knowledge in excel.","Manager","India",{"$f":"VLOOKUP(Data!$J802,tblCountries[[Actual]:[Mapping]],2,FALSE)","v":"Albania"},"4 to 6 hours a day",0,"India"]
[null,"ID1072","2012-05-28T14:56:27",15600,15600,"GBP",{"$f":"Data!$E858*VLOOKUP(Data!$F858,tblXrate[],2,FALSE)","v":65000},"business data analyst","Analyst","UK",{"$f":"VLOOKUP(Data!$J858,tblCountries[[Actual]:[Mapping]],2,FALSE)","v":"USA"},"All the 8 hours baby, all the 8!",0,"UK"]
[null,"ID1454","2012-05-30T13:21:06",500000,500000,"INR",{"$f":"Data!$E1157*VLOOKUP(Data!$F1157,tblXrate[],2,FALSE)","v":14400},"Project Management","Manager","India",{"$f":"VLOOKUP(Data!$J1157,tblCountries[[Actual]:[Mapping]],2,FALSE)","v":"Bulgaria"},"2 to 3 hours per day",0,"India"]
[null,"ID1756","2012-06-08T15:43:16","INR800000",800000,"INR",{"$f":"Data!$E1389*VLOOKUP(Data!$F1389,tblXrate[],2,FALSE)","v":85087},"MANAGER","Manager","India",{"$f":"VLOOKUP(Data!$J1389,tblCountries[[Actual]:[Mapping]],2,FALSE)","v":"USA"},"2 to 3 hours per day",0,"India"]
[null,"ID1757","2012-06-08T15:45:14",800000,800000,"INR",{"$f":"Data!$E1390*VLOOKUP(Data!$F1390,tblXrate[],2,FALSE)","v":50000},"MANAGER","Manager","India",{"$f":"VLOOKUP(Data!$J1390,tblCountries[[Actual]:[Mapping]],2,FALSE)","v":"USA"},"2 to 3 hours per day",0,"India"]
[null,"ID1777","2012-06-10T04:16:05",500000,500000,"INR",{"$f":"Data!$E1406*VLOOKUP(Data!$F1406,tblXrate[],2,FALSE)","v":41301.183967273726},"equity research trainee","Analyst","India",{"$f":"VLOOKUP(Data!$J1406,tblCountries[[Actual]:[Mapping]],2,FALSE)","v":"Canada"},"All the 8 hours baby, all the 8!",0,"India"]
[null,"ID1841","2012-06-14T04:22:36",40000,40000,"USD",{"$f":"Data!$E1462*VLOOKUP(Data!$F1462,tblXrate[],2,FALSE)","v":90000},"Rates Analyst","Analyst","USA",{"$f":"VLOOKUP(Data!$J1462,tblCountries[[Actual]:[Mapping]],2,FALSE)","v":"USA"},"2 to 3 hours per day",0,"USA"]
[null,"ID1850","2012-06-15T01:10:09",37500,37500,"USD",{"$f":"Data!$E1468*VLOOKUP(Data!$F1468,tblXrate[],2,FALSE)","v":58000},"consultant","Consultant","India",{"$f":"VLOOKUP(Data!$J1468,tblCountries[[Actual]:[Mapping]],2,FALSE)","v":"Canada"},"All the 8 hours baby, all the 8!",0,"India"]
[null,"ID1535","2012-05-31T10:54:48",1000,12000,"USD",{"$f":"Data!$E1818*VLOOKUP(Data!$F1818,tblXrate[],2,FALSE)","v":26000},"Associate Analyst","Analyst","MYS","Other Countries","2 to 3 hours per day",0,"MYS"]
[null,"ID1324","2012-05-29T15:49:41",314000,314000,"INR",{"$f":"Data!$E1046*VLOOKUP(Data!$F1046,tblXrate[],2,FALSE)","v":95856},"relationship manager","Manager","India",{"$f":"VLOOKUP(Data!$J1046,tblCountries[[Actual]:[Mapping]],2,FALSE)","v":"USA"},"1 or 2 hours a day",0.1,"India"]
[null,"ID1832","2012-06-13T17:22:47",15000,15000,"USD",{"$f":"Data!$E1453*VLOOKUP(Data!$F1453,tblXrate[],2,FALSE)","v":45000},"senior associate","Analyst","India",{"$f":"VLOOKUP(Data!$J1453,tblCountries[[Actual]:[Mapping]],2,FALSE)","v":"USA"},"2 to 3 hours per day",0.3,"India"]
[null,"ID1859","2012-06-15T15:07:11",700,8400,"USD",{"$f":"Data!$E1876*VLOOKUP(Data!$F1876,tblXrate[],2,FALSE)","v":108000},"Analyst","Analyst","Baltic","Other Countries","All the 8 hours baby, all the 8!",0.3,"Baltic"]
{"$rows_left_out":1870}