{"text_format":"1","workbook":"xlsx","n_sheets":6,"sheets":["Dashboard","Calculation","Pivottwo ","Pivotone","mapping","Data"],"not_rendered":{"charts":4,"images":0,"macros":0,"external_links":0,"defined_names":7,"comments":0,"pivot_tables":2},"unopened":[],"bounds":{"document_bytes":16777216,"sheet_cells":100000,"rows_first":2000,"rows_last":500,"rows_between":2000,"halvings":0,"cell_chars":16384,"cell_head_chars":4096},"cells_cut":0,"cells_raw":0,"read":"whole","date_system":"1900"}

{"sheet":"Dashboard","index":0,"n_rows":58,"n_cols":18,"rows_kept":58,"cut":false,"hidden":false,"merged":[[33,7,33,8],[34,5,34,6],[34,7,34,8],[36,5,36,6],[36,7,36,8],[35,5,35,6],[35,7,35,8],[31,5,31,6],[31,7,31,8],[36,9,36,10],[37,9,37,10],[26,9,26,10],[27,9,27,10],[28,9,28,10],[29,9,29,10],[30,9,30,10],[31,9,31,10],[35,9,35,10],[37,5,37,6],[37,7,37,8],[32,5,32,6],[32,7,32,8],[33,5,33,6],[44,14,44,15],[4,2,4,17],[24,2,25,6],[32,9,32,10],[33,9,33,10],[34,9,34,10],[26,5,26,6],[26,7,26,8],[27,5,27,6],[27,7,27,8],[28,5,28,6],[28,7,28,8],[29,5,29,6],[29,7,29,8],[30,5,30,6],[30,7,30,8],[40,12,40,17],[48,14,49,15],[48,16,49,16],[48,12,49,13],[48,17,49,17],[45,12,45,13],[45,14,45,15],[46,12,46,13],[46,14,46,15],[47,12,47,13],[47,14,47,15],[42,14,42,15],[42,12,42,13],[43,12,43,13],[43,14,43,15],[44,12,44,13]]}
[]
[]
[]
[]
[null,null,"Excel Salary survey Data"]
[]
[]
[]
[]
[]
[]
[]
[]
[]
[]
[]
[]
[]
[]
[]
[]
[]
[]
[]
[null,null,"Select to know Job type wise Excel Use & Salary thereof",null,null,null,null,2]
[]
[null,null,null,null,null,"Salary in US $",null,"Employee Numbers",null,"Average/Employee"]
[null,null,null,"Analyst",null,{"$f":"GETPIVOTDATA(\"Salary in USD\",Pivotone!$A$3,\"Job Type\",$D28,\"How many hours of a day you work on Excel\",Calculation!$V$28)","v":9234925.4212033991},null,{"$f":"GETPIVOTDATA(\"Count of Salary in USD\",'Pivottwo '!A3,\"Job Type\",$D28,\"How many hours of a day you work on Excel\",Calculation!$V$28)","v":215},null,{"$f":"IF(H28=0,0,F28/H28)","v":42953.141493969299}]
[null,null,null,"Controller",null,{"$f":"GETPIVOTDATA(\"Salary in USD\",Pivotone!$A$3,\"Job Type\",$D29,\"How many hours of a day you work on Excel\",Calculation!$V$28)","v":845272.57374912687},null,{"$f":"GETPIVOTDATA(\"Count of Salary in USD\",'Pivottwo '!A4,\"Job Type\",$D29,\"How many hours of a day you work on Excel\",Calculation!$V$28)","v":14},null,{"$f":"IF(H29=0,0,F29/H29)","v":60376.61241065192}]
[null,null,null,"Engineer",null,{"$f":"GETPIVOTDATA(\"Salary in USD\",Pivotone!$A$3,\"Job Type\",$D30,\"How many hours of a day you work on Excel\",Calculation!$V$28)","v":326875.33334995405},null,{"$f":"GETPIVOTDATA(\"Count of Salary in USD\",'Pivottwo '!A5,\"Job Type\",$D30,\"How many hours of a day you work on Excel\",Calculation!$V$28)","v":8},null,40859.416668744256]
[null,null,null,"Manager",null,{"$f":"GETPIVOTDATA(\"Salary in USD\",Pivotone!$A$3,\"Job Type\",$D31,\"How many hours of a day you work on Excel\",Calculation!$V$28)","v":3897827.2704607206},null,{"$f":"GETPIVOTDATA(\"Count of Salary in USD\",'Pivottwo '!A6,\"Job Type\",$D31,\"How many hours of a day you work on Excel\",Calculation!$V$28)","v":110},null,35434.793367824735]
[null,null,null,"CXO or Top Mgmt.",null,{"$f":"GETPIVOTDATA(\"Salary in USD\",Pivotone!$A$3,\"Job Type\",$D32,\"How many hours of a day you work on Excel\",Calculation!$V$28)","v":889546.91605107766},null,{"$f":"GETPIVOTDATA(\"Count of Salary in USD\",'Pivottwo '!A7,\"Job Type\",$D32,\"How many hours of a day you work on Excel\",Calculation!$V$28)","v":11},null,80867.901459188884]
[null,null,null,"Accountant",null,{"$f":"GETPIVOTDATA(\"Salary in USD\",Pivotone!$A$3,\"Job Type\",$D33,\"How many hours of a day you work on Excel\",Calculation!$V$28)","v":1915750.2932257301},null,{"$f":"GETPIVOTDATA(\"Count of Salary in USD\",'Pivottwo '!A8,\"Job Type\",$D33,\"How many hours of a day you work on Excel\",Calculation!$V$28)","v":39},null,49121.802390403333]
[null,null,null,"Specialist",null,{"$f":"GETPIVOTDATA(\"Salary in USD\",Pivotone!$A$3,\"Job Type\",$D34,\"How many hours of a day you work on Excel\",Calculation!$V$28)","v":1087096.5391808571},null,{"$f":"GETPIVOTDATA(\"Count of Salary in USD\",'Pivottwo '!A9,\"Job Type\",$D34,\"How many hours of a day you work on Excel\",Calculation!$V$28)","v":12},null,90591.378265071427]
[null,null,null,"Reporting",null,{"$f":"GETPIVOTDATA(\"Salary in USD\",Pivotone!$A$3,\"Job Type\",$D35,\"How many hours of a day you work on Excel\",Calculation!$V$28)","v":753256.49460161524},null,{"$f":"GETPIVOTDATA(\"Count of Salary in USD\",'Pivottwo '!A10,\"Job Type\",$D35,\"How many hours of a day you work on Excel\",Calculation!$V$28)","v":41},null,18372.109624429639]
[null,null,null,"Consultant",null,{"$f":"GETPIVOTDATA(\"Salary in USD\",Pivotone!$A$3,\"Job Type\",$D36,\"How many hours of a day you work on Excel\",Calculation!$V$28)","v":1768322.6523190467},null,{"$f":"GETPIVOTDATA(\"Count of Salary in USD\",'Pivottwo '!A11,\"Job Type\",$D36,\"How many hours of a day you work on Excel\",Calculation!$V$28)","v":25},null,70732.90609276187]
[null,null,null,"Misc.",null,{"$f":"GETPIVOTDATA(\"Salary in USD\",Pivotone!$A$3,\"Job Type\",$D37,\"How many hours of a day you work on Excel\",Calculation!$V$28)","v":21000},null,{"$f":"GETPIVOTDATA(\"Count of Salary in USD\",'Pivottwo '!A12,\"Job Type\",$D37,\"How many hours of a day you work on Excel\",Calculation!$V$28)","v":1},null,21000]
[null,null,null,"TOTAL",null,{"$f":"SUM(F28:G37)","v":20739873.49414153},null,{"$f":"SUM(H28:I37)","v":476},null,{"$f":"F38/H38","v":43571.16280281834}]
[]
[]
[null,null,null,null,null,null,null,null,null,null,null,null,"Salary by Experience - in Lac US $"]
[]
[null,null,null,null,null,null,null,null,null,null,null,null,"Criteria",null,"No. of Employees",null,"Lac USD ","Avg"]
[null,null,null,null,null,null,null,null,null,null,null,null,"Blank **",null,{"$f":"Calculation!D69","v":548},null,{"$f":"Calculation!F69/100000","v":190.24434610467571},{"$f":"Q44*100000/O44","v":34716.121551948127}]
[null,null,null,null,null,null,null,null,null,null,null,null,{"$f":"Calculation!E70","v":"Less than 5"},null,{"$f":"Calculation!D70","v":420},null,{"$f":"Calculation!F70/100000","v":218.65036922382544},{"$f":"Q45*100000/O45","v":52059.611719958441}]
[null,null,null,null,null,null,null,null,null,null,null,null,{"$f":"Calculation!E71","v":">=5 but < 10"},null,{"$f":"Calculation!D71","v":417},null,{"$f":"Calculation!F71/100000","v":229.90083110363443},55132.093789840386]
[null,null,null,null,null,null,null,null,null,null,null,null,{"$f":"Calculation!E72","v":">=10 but < 20"},null,{"$f":"Calculation!D72","v":355},null,{"$f":"Calculation!F72/100000","v":222.38165307099104},62642.719174927057]
[null,null,null,null,null,null,null,null,null,null,null,null,{"$f":"Calculation!E73","v":"> than 20"},null,{"$f":"Calculation!D73","v":143},null,{"$f":"Calculation!F73/100000","v":76.831685649576784},53728.451503200551]
[null,null,null,null,null,null,null,null,null,null,null,null,null,null,{"$f":"SUM(O44:P48)","v":1883},null,{"$f":"SUM(Q44:Q48)","v":938.00888515270333}]
[]
[]
[null,null,"Observations :"]
[]
[null,null,"  Analysts & Manager category consist of 69% in Numbers but get only 65% share of total Salary payout."]
[null,null,"  ** Experience data of 543 Employees is yet to be updated."]
[null,null,"  Out of total 1883 Excel Users 33% are based in US & get 48% of Salary payout."]
[null,null,"  Average Salary in Australia is the highest amongst all countries."]
[null,null,"  Specialist who works for all 8 hours on EXCEL earns higher than the Top management Salary."]

{"sheet":"Calculation","index":1,"n_rows":75,"n_cols":23,"rows_kept":75,"cut":false,"hidden":false,"merged":[[20,14,20,15],[20,3,20,4],[20,5,20,6],[20,7,20,8],[20,9,20,10],[20,11,20,12]]}
[]
[]
[]
[]
[]
[]
[]
[]
[]
[]
[]
[]
[]
[]
[]
[]
[]
[]
[]
[]
[null,null,"Job Type","4 to 6 hours a day",null,"All the 8 hours baby, all the 8!",null,"2 to 3 hours per day",null,"1 or 2 hours a day",null,"Excel ?!? What Excel?",null,"Total","No.of Employees"]
[null,null,null,"Salary in USD","No. of Employees","Salary in USD","No. of Employees","Salary in USD","No. of Employees","Salary in USD","No. of Employees","Salary in USD","No. of Employees","Salary in USD","Employee Nos.","Avg. Salary",null,null,null,null,null,{"$f":"A","v":"4 to 6 hours a day"},"4 to 6 hours a day"]
[null,null,"Analyst",{"$f":"SUMIFS(Data!$G$5:$G$1888,Data!$I$5:$I$1888,Calculation!$C23,Data!$L$5:$L$1888,Calculation!D$21)","v":17013013.704803523},{"$f":"COUNTIFS(Data!$I$5:$I$1888,Calculation!$C23,Data!$L$5:$L$1888,Calculation!D$21)","v":329},{"$f":"SUMIFS(Data!$G$5:$G$1888,Data!$I$5:$I$1888,Calculation!$C23,Data!$L$5:$L$1888,Calculation!F$21)","v":11122617.653268898},{"$f":"COUNTIFS(Data!$I$5:$I$1888,Calculation!$C23,Data!$L$5:$L$1888,Calculation!F$21)","v":215},{"$f":"SUMIFS(Data!$G$5:$G$1888,Data!$I$5:$I$1888,Calculation!$C23,Data!$L$5:$L$1888,Calculation!H$21)","v":6424250.0062115761},{"$f":"COUNTIFS(Data!$I$5:$I$1888,Calculation!$C23,Data!$L$5:$L$1888,Calculation!H$21)","v":137},{"$f":"SUMIFS(Data!$G$5:$G$1888,Data!$I$5:$I$1888,Calculation!$C23,Data!$L$5:$L$1888,Calculation!J$21)","v":2715890.1392187658},{"$f":"COUNTIFS(Data!$I$5:$I$1888,Calculation!$C23,Data!$L$5:$L$1888,Calculation!J$21)","v":57},{"$f":"SUMIFS(Data!$G$5:$G$1888,Data!$I$5:$I$1888,Calculation!$C23,Data!$L$5:$L$1888,Calculation!L$21)","v":259790.5792789509},{"$f":"COUNTIFS(Data!$I$5:$I$1888,Calculation!$C23,Data!$L$5:$L$1888,Calculation!L$21)","v":5},{"$f":"SUMIF(Data!$I$6:$I$1888,Calculation!C23,Data!$G$6:$G$1888)","v":37535562.082781717},{"$f":"COUNTIF(Data!$I$5:$I$1888,\"=\"&C23)","v":743},{"$f":"IF(O23=0,0,N23/O23)","v":50518.926087189393},null,null,null,null,null,{"$f":"B","v":"All the 8 hours baby, all the 8!"},"All the 8 hours baby, all the 8!"]
[null,null,"Controller",{"$f":"SUMIFS(Data!$G$5:$G$1888,Data!$I$5:$I$1888,Calculation!$C24,Data!$L$5:$L$1888,Calculation!D$21)","v":1847143.4127660783},{"$f":"COUNTIFS(Data!$I$5:$I$1888,Calculation!$C24,Data!$L$5:$L$1888,Calculation!D$21)","v":36},{"$f":"SUMIFS(Data!$G$5:$G$1888,Data!$I$5:$I$1888,Calculation!$C24,Data!$L$5:$L$1888,Calculation!F$21)","v":996176.48974889982},{"$f":"COUNTIFS(Data!$I$5:$I$1888,Calculation!$C24,Data!$L$5:$L$1888,Calculation!F$21)","v":14},{"$f":"SUMIFS(Data!$G$5:$G$1888,Data!$I$5:$I$1888,Calculation!$C24,Data!$L$5:$L$1888,Calculation!H$21)","v":619918.07005851611},{"$f":"COUNTIFS(Data!$I$5:$I$1888,Calculation!$C24,Data!$L$5:$L$1888,Calculation!H$21)","v":15},{"$f":"SUMIFS(Data!$G$5:$G$1888,Data!$I$5:$I$1888,Calculation!$C24,Data!$L$5:$L$1888,Calculation!J$21)","v":41842.375006232774},{"$f":"COUNTIFS(Data!$I$5:$I$1888,Calculation!$C24,Data!$L$5:$L$1888,Calculation!J$21)","v":2},{"$f":"SUMIFS(Data!$G$5:$G$1888,Data!$I$5:$I$1888,Calculation!$C24,Data!$L$5:$L$1888,Calculation!L$21)","v":0},{"$f":"COUNTIFS(Data!$I$5:$I$1888,Calculation!$C24,Data!$L$5:$L$1888,Calculation!L$21)","v":0},{"$f":"SUMIF(Data!$I$6:$I$1888,Calculation!C24,Data!$G$6:$G$1888)","v":3505080.347579726},{"$f":"COUNTIF(Data!$I$5:$I$1888,\"=\"&C24)","v":67},{"$f":"IF(O24=0,0,N24/O24)","v":52314.632053428744},null,null,null,null,null,{"$f":"X","v":"2 to 3 hours per day"},"2 to 3 hours per day"]
[null,null,"Engineer",{"$f":"SUMIFS(Data!$G$5:$G$1888,Data!$I$5:$I$1888,Calculation!$C25,Data!$L$5:$L$1888,Calculation!D$21)","v":1449470.1533049082},{"$f":"COUNTIFS(Data!$I$5:$I$1888,Calculation!$C25,Data!$L$5:$L$1888,Calculation!D$21)","v":26},{"$f":"SUMIFS(Data!$G$5:$G$1888,Data!$I$5:$I$1888,Calculation!$C25,Data!$L$5:$L$1888,Calculation!F$21)","v":304435.10632965632},{"$f":"COUNTIFS(Data!$I$5:$I$1888,Calculation!$C25,Data!$L$5:$L$1888,Calculation!F$21)","v":8},{"$f":"SUMIFS(Data!$G$5:$G$1888,Data!$I$5:$I$1888,Calculation!$C25,Data!$L$5:$L$1888,Calculation!H$21)","v":1313482.8465052212},{"$f":"COUNTIFS(Data!$I$5:$I$1888,Calculation!$C25,Data!$L$5:$L$1888,Calculation!H$21)","v":26},{"$f":"SUMIFS(Data!$G$5:$G$1888,Data!$I$5:$I$1888,Calculation!$C25,Data!$L$5:$L$1888,Calculation!J$21)","v":418184.98362928041},{"$f":"COUNTIFS(Data!$I$5:$I$1888,Calculation!$C25,Data!$L$5:$L$1888,Calculation!J$21)","v":14},{"$f":"SUMIFS(Data!$G$5:$G$1888,Data!$I$5:$I$1888,Calculation!$C25,Data!$L$5:$L$1888,Calculation!L$21)","v":0},{"$f":"COUNTIFS(Data!$I$5:$I$1888,Calculation!$C25,Data!$L$5:$L$1888,Calculation!L$21)","v":0},{"$f":"SUMIF(Data!$I$6:$I$1888,Calculation!C25,Data!$G$6:$G$1888)","v":3485573.0897690663},{"$f":"COUNTIF(Data!$I$5:$I$1888,\"=\"&C25)","v":74},47102.339050933326,null,null,null,null,null,{"$f":"Y","v":"1 or 2 hours a day"},"1 or 2 hours a day"]
[null,null,"Manager",{"$f":"SUMIFS(Data!$G$5:$G$1888,Data!$I$5:$I$1888,Calculation!$C26,Data!$L$5:$L$1888,Calculation!D$21)","v":9787205.3123262431},{"$f":"COUNTIFS(Data!$I$5:$I$1888,Calculation!$C26,Data!$L$5:$L$1888,Calculation!D$21)","v":215},{"$f":"SUMIFS(Data!$G$5:$G$1888,Data!$I$5:$I$1888,Calculation!$C26,Data!$L$5:$L$1888,Calculation!F$21)","v":5290135.3935178565},{"$f":"COUNTIFS(Data!$I$5:$I$1888,Calculation!$C26,Data!$L$5:$L$1888,Calculation!F$21)","v":110},{"$f":"SUMIFS(Data!$G$5:$G$1888,Data!$I$5:$I$1888,Calculation!$C26,Data!$L$5:$L$1888,Calculation!H$21)","v":8457856.4377613291},{"$f":"COUNTIFS(Data!$I$5:$I$1888,Calculation!$C26,Data!$L$5:$L$1888,Calculation!H$21)","v":166},{"$f":"SUMIFS(Data!$G$5:$G$1888,Data!$I$5:$I$1888,Calculation!$C26,Data!$L$5:$L$1888,Calculation!J$21)","v":3333565.3441139185},{"$f":"COUNTIFS(Data!$I$5:$I$1888,Calculation!$C26,Data!$L$5:$L$1888,Calculation!J$21)","v":65},{"$f":"SUMIFS(Data!$G$5:$G$1888,Data!$I$5:$I$1888,Calculation!$C26,Data!$L$5:$L$1888,Calculation!L$21)","v":55689.212541869048},{"$f":"COUNTIFS(Data!$I$5:$I$1888,Calculation!$C26,Data!$L$5:$L$1888,Calculation!L$21)","v":2},{"$f":"SUMIF(Data!$I$6:$I$1888,Calculation!C26,Data!$G$6:$G$1888)","v":26924451.70026122},{"$f":"COUNTIF(Data!$I$5:$I$1888,\"=\"&C26)","v":558},48251.705556023691,null,null,null,null,null,{"$f":"Z","v":"Excel ?!? What Excel?"},"Excel ?!? What Excel?"]
[null,null,"CXO or Top Mgmt.",{"$f":"SUMIFS(Data!$G$5:$G$1888,Data!$I$5:$I$1888,Calculation!$C27,Data!$L$5:$L$1888,Calculation!D$21)","v":1857040.0634000893},{"$f":"COUNTIFS(Data!$I$5:$I$1888,Calculation!$C27,Data!$L$5:$L$1888,Calculation!D$21)","v":32},{"$f":"SUMIFS(Data!$G$5:$G$1888,Data!$I$5:$I$1888,Calculation!$C27,Data!$L$5:$L$1888,Calculation!F$21)","v":505164.6931250901},{"$f":"COUNTIFS(Data!$I$5:$I$1888,Calculation!$C27,Data!$L$5:$L$1888,Calculation!F$21)","v":11},{"$f":"SUMIFS(Data!$G$5:$G$1888,Data!$I$5:$I$1888,Calculation!$C27,Data!$L$5:$L$1888,Calculation!H$21)","v":920584.80384958489},{"$f":"COUNTIFS(Data!$I$5:$I$1888,Calculation!$C27,Data!$L$5:$L$1888,Calculation!H$21)","v":22},{"$f":"SUMIFS(Data!$G$5:$G$1888,Data!$I$5:$I$1888,Calculation!$C27,Data!$L$5:$L$1888,Calculation!J$21)","v":548215.83629537805},{"$f":"COUNTIFS(Data!$I$5:$I$1888,Calculation!$C27,Data!$L$5:$L$1888,Calculation!J$21)","v":10},{"$f":"SUMIFS(Data!$G$5:$G$1888,Data!$I$5:$I$1888,Calculation!$C27,Data!$L$5:$L$1888,Calculation!L$21)","v":0},{"$f":"COUNTIFS(Data!$I$5:$I$1888,Calculation!$C27,Data!$L$5:$L$1888,Calculation!L$21)","v":0},{"$f":"SUMIF(Data!$I$6:$I$1888,Calculation!C27,Data!$G$6:$G$1888)","v":3831005.3966701431},{"$f":"COUNTIF(Data!$I$5:$I$1888,\"=\"&C27)","v":75},51080.07195560191]
[null,null,"Accountant",{"$f":"SUMIFS(Data!$G$5:$G$1888,Data!$I$5:$I$1888,Calculation!$C28,Data!$L$5:$L$1888,Calculation!D$21)","v":3215319.5878056935},{"$f":"COUNTIFS(Data!$I$5:$I$1888,Calculation!$C28,Data!$L$5:$L$1888,Calculation!D$21)","v":58},{"$f":"SUMIFS(Data!$G$5:$G$1888,Data!$I$5:$I$1888,Calculation!$C28,Data!$L$5:$L$1888,Calculation!F$21)","v":1587943.2582679123},{"$f":"COUNTIFS(Data!$I$5:$I$1888,Calculation!$C28,Data!$L$5:$L$1888,Calculation!F$21)","v":39},{"$f":"SUMIFS(Data!$G$5:$G$1888,Data!$I$5:$I$1888,Calculation!$C28,Data!$L$5:$L$1888,Calculation!H$21)","v":1780973.0608141744},{"$f":"COUNTIFS(Data!$I$5:$I$1888,Calculation!$C28,Data!$L$5:$L$1888,Calculation!H$21)","v":34},{"$f":"SUMIFS(Data!$G$5:$G$1888,Data!$I$5:$I$1888,Calculation!$C28,Data!$L$5:$L$1888,Calculation!J$21)","v":420000},{"$f":"COUNTIFS(Data!$I$5:$I$1888,Calculation!$C28,Data!$L$5:$L$1888,Calculation!J$21)","v":4},{"$f":"SUMIFS(Data!$G$5:$G$1888,Data!$I$5:$I$1888,Calculation!$C28,Data!$L$5:$L$1888,Calculation!L$21)","v":0},{"$f":"COUNTIFS(Data!$I$5:$I$1888,Calculation!$C28,Data!$L$5:$L$1888,Calculation!L$21)","v":0},{"$f":"SUMIF(Data!$I$6:$I$1888,Calculation!C28,Data!$G$6:$G$1888)","v":7004235.9068877799},{"$f":"COUNTIF(Data!$I$5:$I$1888,\"=\"&C28)","v":135},51883.228939909481,null,null,null,null,null,{"$f":"INDEX(W22:W26,Dashboard!$H$25,1)","v":"All the 8 hours baby, all the 8!"}]
[null,null,"Specialist",{"$f":"SUMIFS(Data!$G$5:$G$1888,Data!$I$5:$I$1888,Calculation!$C29,Data!$L$5:$L$1888,Calculation!D$21)","v":1041581.2481725822},{"$f":"COUNTIFS(Data!$I$5:$I$1888,Calculation!$C29,Data!$L$5:$L$1888,Calculation!D$21)","v":23},{"$f":"SUMIFS(Data!$G$5:$G$1888,Data!$I$5:$I$1888,Calculation!$C29,Data!$L$5:$L$1888,Calculation!F$21)","v":743401.55088287196},{"$f":"COUNTIFS(Data!$I$5:$I$1888,Calculation!$C29,Data!$L$5:$L$1888,Calculation!F$21)","v":12},{"$f":"SUMIFS(Data!$G$5:$G$1888,Data!$I$5:$I$1888,Calculation!$C29,Data!$L$5:$L$1888,Calculation!H$21)","v":397712.48589690647},{"$f":"COUNTIFS(Data!$I$5:$I$1888,Calculation!$C29,Data!$L$5:$L$1888,Calculation!H$21)","v":12},{"$f":"SUMIFS(Data!$G$5:$G$1888,Data!$I$5:$I$1888,Calculation!$C29,Data!$L$5:$L$1888,Calculation!J$21)","v":130800},{"$f":"COUNTIFS(Data!$I$5:$I$1888,Calculation!$C29,Data!$L$5:$L$1888,Calculation!J$21)","v":4},{"$f":"SUMIFS(Data!$G$5:$G$1888,Data!$I$5:$I$1888,Calculation!$C29,Data!$L$5:$L$1888,Calculation!L$21)","v":0},{"$f":"COUNTIFS(Data!$I$5:$I$1888,Calculation!$C29,Data!$L$5:$L$1888,Calculation!L$21)","v":0},{"$f":"SUMIF(Data!$I$6:$I$1888,Calculation!C29,Data!$G$6:$G$1888)","v":2313495.2849523607},{"$f":"COUNTIF(Data!$I$5:$I$1888,\"=\"&C29)","v":51},45362.652646124719]
[null,null,"Reporting",{"$f":"SUMIFS(Data!$G$5:$G$1888,Data!$I$5:$I$1888,Calculation!$C30,Data!$L$5:$L$1888,Calculation!D$21)","v":1515833.4082813147},{"$f":"COUNTIFS(Data!$I$5:$I$1888,Calculation!$C30,Data!$L$5:$L$1888,Calculation!D$21)","v":26},{"$f":"SUMIFS(Data!$G$5:$G$1888,Data!$I$5:$I$1888,Calculation!$C30,Data!$L$5:$L$1888,Calculation!F$21)","v":1990810.4785367853},{"$f":"COUNTIFS(Data!$I$5:$I$1888,Calculation!$C30,Data!$L$5:$L$1888,Calculation!F$21)","v":41},{"$f":"SUMIFS(Data!$G$5:$G$1888,Data!$I$5:$I$1888,Calculation!$C30,Data!$L$5:$L$1888,Calculation!H$21)","v":447377.56886701816},{"$f":"COUNTIFS(Data!$I$5:$I$1888,Calculation!$C30,Data!$L$5:$L$1888,Calculation!H$21)","v":12},{"$f":"SUMIFS(Data!$G$5:$G$1888,Data!$I$5:$I$1888,Calculation!$C30,Data!$L$5:$L$1888,Calculation!J$21)","v":131431.08336241959},{"$f":"COUNTIFS(Data!$I$5:$I$1888,Calculation!$C30,Data!$L$5:$L$1888,Calculation!J$21)","v":4},{"$f":"SUMIFS(Data!$G$5:$G$1888,Data!$I$5:$I$1888,Calculation!$C30,Data!$L$5:$L$1888,Calculation!L$21)","v":0},{"$f":"COUNTIFS(Data!$I$5:$I$1888,Calculation!$C30,Data!$L$5:$L$1888,Calculation!L$21)","v":0},{"$f":"SUMIF(Data!$I$6:$I$1888,Calculation!C30,Data!$G$6:$G$1888)","v":4085452.5390475378},{"$f":"COUNTIF(Data!$I$5:$I$1888,\"=\"&C30)","v":83},49222.319747560694]
[null,null,"Consultant",{"$f":"SUMIFS(Data!$G$5:$G$1888,Data!$I$5:$I$1888,Calculation!$C31,Data!$L$5:$L$1888,Calculation!D$21)","v":1260583.452722518},{"$f":"COUNTIFS(Data!$I$5:$I$1888,Calculation!$C31,Data!$L$5:$L$1888,Calculation!D$21)","v":27},{"$f":"SUMIFS(Data!$G$5:$G$1888,Data!$I$5:$I$1888,Calculation!$C31,Data!$L$5:$L$1888,Calculation!F$21)","v":1197161.3844863828},{"$f":"COUNTIFS(Data!$I$5:$I$1888,Calculation!$C31,Data!$L$5:$L$1888,Calculation!F$21)","v":25},{"$f":"SUMIFS(Data!$G$5:$G$1888,Data!$I$5:$I$1888,Calculation!$C31,Data!$L$5:$L$1888,Calculation!H$21)","v":1493085.5718586794},{"$f":"COUNTIFS(Data!$I$5:$I$1888,Calculation!$C31,Data!$L$5:$L$1888,Calculation!H$21)","v":26},{"$f":"SUMIFS(Data!$G$5:$G$1888,Data!$I$5:$I$1888,Calculation!$C31,Data!$L$5:$L$1888,Calculation!J$21)","v":756570.91479697987},{"$f":"COUNTIFS(Data!$I$5:$I$1888,Calculation!$C31,Data!$L$5:$L$1888,Calculation!J$21)","v":12},{"$f":"SUMIFS(Data!$G$5:$G$1888,Data!$I$5:$I$1888,Calculation!$C31,Data!$L$5:$L$1888,Calculation!L$21)","v":0},{"$f":"COUNTIFS(Data!$I$5:$I$1888,Calculation!$C31,Data!$L$5:$L$1888,Calculation!L$21)","v":0},{"$f":"SUMIF(Data!$I$6:$I$1888,Calculation!C31,Data!$G$6:$G$1888)","v":4707401.3238645596},{"$f":"COUNTIF(Data!$I$5:$I$1888,\"=\"&C31)","v":90},52304.459154050666]
[null,null,"Misc.",{"$f":"SUMIFS(Data!$G$5:$G$1888,Data!$I$5:$I$1888,Calculation!$C32,Data!$L$5:$L$1888,Calculation!D$21)","v":192600},{"$f":"COUNTIFS(Data!$I$5:$I$1888,Calculation!$C32,Data!$L$5:$L$1888,Calculation!D$21)","v":3},{"$f":"SUMIFS(Data!$G$5:$G$1888,Data!$I$5:$I$1888,Calculation!$C32,Data!$L$5:$L$1888,Calculation!F$21)","v":65000},{"$f":"COUNTIFS(Data!$I$5:$I$1888,Calculation!$C32,Data!$L$5:$L$1888,Calculation!F$21)","v":1},{"$f":"SUMIFS(Data!$G$5:$G$1888,Data!$I$5:$I$1888,Calculation!$C32,Data!$L$5:$L$1888,Calculation!H$21)","v":90469.260118790073},{"$f":"COUNTIFS(Data!$I$5:$I$1888,Calculation!$C32,Data!$L$5:$L$1888,Calculation!H$21)","v":1},{"$f":"SUMIFS(Data!$G$5:$G$1888,Data!$I$5:$I$1888,Calculation!$C32,Data!$L$5:$L$1888,Calculation!J$21)","v":60561.583337488511},{"$f":"COUNTIFS(Data!$I$5:$I$1888,Calculation!$C32,Data!$L$5:$L$1888,Calculation!J$21)","v":2},{"$f":"SUMIFS(Data!$G$5:$G$1888,Data!$I$5:$I$1888,Calculation!$C32,Data!$L$5:$L$1888,Calculation!L$21)","v":0},{"$f":"COUNTIFS(Data!$I$5:$I$1888,Calculation!$C32,Data!$L$5:$L$1888,Calculation!L$21)","v":0},{"$f":"SUMIF(Data!$I$6:$I$1888,Calculation!C32,Data!$G$6:$G$1888)","v":408630.84345627861},{"$f":"COUNTIF(Data!$I$5:$I$1888,\"=\"&C32)","v":7},58375.834779468372]
[]
[null,null,null,{"$f":"SUM(D23:D32)","v":39179790.343582951},{"$f":"SUM(E23:E32)","v":775},23802846.008164354,{"$f":"SUM(G23:G32)","v":476},21945710.111941796,451,8557062.2597604617,174,315479.79182081996,7,93800888.515270397,1883]
[]
[]
[null,null,null,"USA",null,"India",null,"UK",null,"Australia",null,"Canada",null,"Pakistan",null,"Netherlands",null,"Other Countries",null,"Total"]
[null,null,null,"Salary in USD","No. of Employees","Salary in USD","No. of Employees","Salary in USD","No. of Employees","Salary in USD","No. of Employees","Salary in USD","No. of Employees","Salary in USD","No. of Employees","Salary in USD","No. of Employees","Salary in USD","No. of Employees","Salary in USD","No. of Employees"]
[]
[null,null,"Analyst",{"$f":"SUMIFS(Data!$G$5:$G$1888,Data!$I$5:$I$1888,Calculation!$C40,Data!$K$5:$K$1888,Calculation!D$37)","v":14951363},{"$f":"COUNTIFS(Data!$I$5:$I$1888,Calculation!$C40,Data!$K$5:$K$1888,Calculation!D$37)","v":205},{"$f":"SUMIFS(Data!$G$5:$G$1888,Data!$I$5:$I$1888,Calculation!$C40,Data!$K$5:$K$1888,Calculation!F$37)","v":2486857.4374194206},{"$f":"COUNTIFS(Data!$I$5:$I$1888,Calculation!$C40,Data!$K$5:$K$1888,Calculation!F$37)","v":193},{"$f":"SUMIFS(Data!$G$5:$G$1888,Data!$I$5:$I$1888,Calculation!$C40,Data!$K$5:$K$1888,Calculation!H$37)","v":3725724.4083814863},{"$f":"COUNTIFS(Data!$I$5:$I$1888,Calculation!$C40,Data!$K$5:$K$1888,Calculation!H$37)","v":61},{"$f":"SUMIFS(Data!$G$5:$G$1888,Data!$I$5:$I$1888,Calculation!$C40,Data!$K$5:$K$1888,Calculation!J$37)","v":2841823.6362675792},{"$f":"COUNTIFS(Data!$I$5:$I$1888,Calculation!$C40,Data!$K$5:$K$1888,Calculation!J$37)","v":31},{"$f":"SUMIFS(Data!$G$5:$G$1888,Data!$I$5:$I$1888,Calculation!$C40,Data!$K$5:$K$1888,Calculation!L$37)","v":1024105.1307084138},{"$f":"COUNTIFS(Data!$I$5:$I$1888,Calculation!$C40,Data!$K$5:$K$1888,Calculation!L$37)","v":17},{"$f":"SUMIFS(Data!$G$5:$G$1888,Data!$I$5:$I$1888,Calculation!$C40,Data!$K$5:$K$1888,Calculation!N$37)","v":195539.925023396},{"$f":"COUNTIFS(Data!$I$5:$I$1888,Calculation!$C40,Data!$K$5:$K$1888,Calculation!N$37)","v":16},{"$f":"SUMIFS(Data!$G$5:$G$1888,Data!$I$5:$I$1888,Calculation!$C40,Data!$K$5:$K$1888,Calculation!P$37)","v":583748.54221664369},{"$f":"COUNTIFS(Data!$I$5:$I$1888,Calculation!$C40,Data!$K$5:$K$1888,Calculation!P$37)","v":9},{"$f":"SUMIFS(Data!$G$5:$G$1888,Data!$I$5:$I$1888,Calculation!$C40,Data!$K$5:$K$1888,Calculation!R$37)","v":7092568.9209593134},{"$f":"COUNTIFS(Data!$I$5:$I$1888,Calculation!$C40,Data!$K$5:$K$1888,Calculation!R$37)","v":112},{"$f":"R40+P40+N40+L40+J40+H40+F40+D40","v":32901731.000976253},{"$f":"S40+Q40+O40+M40+K40+I40+G40+E40","v":644}]
[null,null,"Controller",{"$f":"SUMIFS(Data!$G$5:$G$1888,Data!$I$5:$I$1888,Calculation!$C41,Data!$K$5:$K$1888,Calculation!D$37)","v":821160},{"$f":"COUNTIFS(Data!$I$5:$I$1888,Calculation!$C41,Data!$K$5:$K$1888,Calculation!D$37)","v":11},{"$f":"SUMIFS(Data!$G$5:$G$1888,Data!$I$5:$I$1888,Calculation!$C41,Data!$K$5:$K$1888,Calculation!F$37)","v":160844.30182281835},{"$f":"COUNTIFS(Data!$I$5:$I$1888,Calculation!$C41,Data!$K$5:$K$1888,Calculation!F$37)","v":16},{"$f":"SUMIFS(Data!$G$5:$G$1888,Data!$I$5:$I$1888,Calculation!$C41,Data!$K$5:$K$1888,Calculation!H$37)","v":278195.46501987567},{"$f":"COUNTIFS(Data!$I$5:$I$1888,Calculation!$C41,Data!$K$5:$K$1888,Calculation!H$37)","v":5},{"$f":"SUMIFS(Data!$G$5:$G$1888,Data!$I$5:$I$1888,Calculation!$C41,Data!$K$5:$K$1888,Calculation!J$37)","v":36000},{"$f":"COUNTIFS(Data!$I$5:$I$1888,Calculation!$C41,Data!$K$5:$K$1888,Calculation!J$37)","v":1},{"$f":"SUMIFS(Data!$G$5:$G$1888,Data!$I$5:$I$1888,Calculation!$C41,Data!$K$5:$K$1888,Calculation!L$37)","v":111406.11913403336},{"$f":"COUNTIFS(Data!$I$5:$I$1888,Calculation!$C41,Data!$K$5:$K$1888,Calculation!L$37)","v":2},{"$f":"SUMIFS(Data!$G$5:$G$1888,Data!$I$5:$I$1888,Calculation!$C41,Data!$K$5:$K$1888,Calculation!N$37)","v":0},{"$f":"COUNTIFS(Data!$I$5:$I$1888,Calculation!$C41,Data!$K$5:$K$1888,Calculation!N$37)","v":0},{"$f":"SUMIFS(Data!$G$5:$G$1888,Data!$I$5:$I$1888,Calculation!$C41,Data!$K$5:$K$1888,Calculation!P$37)","v":0},{"$f":"COUNTIFS(Data!$I$5:$I$1888,Calculation!$C41,Data!$K$5:$K$1888,Calculation!P$37)","v":0},{"$f":"SUMIFS(Data!$G$5:$G$1888,Data!$I$5:$I$1888,Calculation!$C41,Data!$K$5:$K$1888,Calculation!R$37)","v":2025906.8239773924},{"$f":"COUNTIFS(Data!$I$5:$I$1888,Calculation!$C41,Data!$K$5:$K$1888,Calculation!R$37)","v":29},3433512.7099541198,64]
[null,null,"Engineer",{"$f":"SUMIFS(Data!$G$5:$G$1888,Data!$I$5:$I$1888,Calculation!$C42,Data!$K$5:$K$1888,Calculation!D$37)","v":769000},{"$f":"COUNTIFS(Data!$I$5:$I$1888,Calculation!$C42,Data!$K$5:$K$1888,Calculation!D$37)","v":13},{"$f":"SUMIFS(Data!$G$5:$G$1888,Data!$I$5:$I$1888,Calculation!$C42,Data!$K$5:$K$1888,Calculation!F$37)","v":423382.0178506556},{"$f":"COUNTIFS(Data!$I$5:$I$1888,Calculation!$C42,Data!$K$5:$K$1888,Calculation!F$37)","v":27},{"$f":"SUMIFS(Data!$G$5:$G$1888,Data!$I$5:$I$1888,Calculation!$C42,Data!$K$5:$K$1888,Calculation!H$37)","v":97349.498617691672},{"$f":"COUNTIFS(Data!$I$5:$I$1888,Calculation!$C42,Data!$K$5:$K$1888,Calculation!H$37)","v":2},{"$f":"SUMIFS(Data!$G$5:$G$1888,Data!$I$5:$I$1888,Calculation!$C42,Data!$K$5:$K$1888,Calculation!J$37)","v":101990.96564026357},{"$f":"COUNTIFS(Data!$I$5:$I$1888,Calculation!$C42,Data!$K$5:$K$1888,Calculation!J$37)","v":1},{"$f":"SUMIFS(Data!$G$5:$G$1888,Data!$I$5:$I$1888,Calculation!$C42,Data!$K$5:$K$1888,Calculation!L$37)","v":458246.46973213233},{"$f":"COUNTIFS(Data!$I$5:$I$1888,Calculation!$C42,Data!$K$5:$K$1888,Calculation!L$37)","v":4},{"$f":"SUMIFS(Data!$G$5:$G$1888,Data!$I$5:$I$1888,Calculation!$C42,Data!$K$5:$K$1888,Calculation!N$37)","v":0},{"$f":"COUNTIFS(Data!$I$5:$I$1888,Calculation!$C42,Data!$K$5:$K$1888,Calculation!N$37)","v":0},{"$f":"SUMIFS(Data!$G$5:$G$1888,Data!$I$5:$I$1888,Calculation!$C42,Data!$K$5:$K$1888,Calculation!P$37)","v":140379.13800857266},{"$f":"COUNTIFS(Data!$I$5:$I$1888,Calculation!$C42,Data!$K$5:$K$1888,Calculation!P$37)","v":2},{"$f":"SUMIFS(Data!$G$5:$G$1888,Data!$I$5:$I$1888,Calculation!$C42,Data!$K$5:$K$1888,Calculation!R$37)","v":848124.28519302572},{"$f":"COUNTIFS(Data!$I$5:$I$1888,Calculation!$C42,Data!$K$5:$K$1888,Calculation!R$37)","v":16},2838472.3750423416,65]
[null,null,"Manager",{"$f":"SUMIFS(Data!$G$5:$G$1888,Data!$I$5:$I$1888,Calculation!$C43,Data!$K$5:$K$1888,Calculation!D$37)","v":8765498},{"$f":"COUNTIFS(Data!$I$5:$I$1888,Calculation!$C43,Data!$K$5:$K$1888,Calculation!D$37)","v":124},{"$f":"SUMIFS(Data!$G$5:$G$1888,Data!$I$5:$I$1888,Calculation!$C43,Data!$K$5:$K$1888,Calculation!F$37)","v":1978173.6027837326},{"$f":"COUNTIFS(Data!$I$5:$I$1888,Calculation!$C43,Data!$K$5:$K$1888,Calculation!F$37)","v":164},{"$f":"SUMIFS(Data!$G$5:$G$1888,Data!$I$5:$I$1888,Calculation!$C43,Data!$K$5:$K$1888,Calculation!H$37)","v":2381900.1144305426},{"$f":"COUNTIFS(Data!$I$5:$I$1888,Calculation!$C43,Data!$K$5:$K$1888,Calculation!H$37)","v":34},{"$f":"SUMIFS(Data!$G$5:$G$1888,Data!$I$5:$I$1888,Calculation!$C43,Data!$K$5:$K$1888,Calculation!J$37)","v":2574099.2871851404},{"$f":"COUNTIFS(Data!$I$5:$I$1888,Calculation!$C43,Data!$K$5:$K$1888,Calculation!J$37)","v":26},{"$f":"SUMIFS(Data!$G$5:$G$1888,Data!$I$5:$I$1888,Calculation!$C43,Data!$K$5:$K$1888,Calculation!L$37)","v":594283.12944971083},{"$f":"COUNTIFS(Data!$I$5:$I$1888,Calculation!$C43,Data!$K$5:$K$1888,Calculation!L$37)","v":9},{"$f":"SUMIFS(Data!$G$5:$G$1888,Data!$I$5:$I$1888,Calculation!$C43,Data!$K$5:$K$1888,Calculation!N$37)","v":45638.713402622103},{"$f":"COUNTIFS(Data!$I$5:$I$1888,Calculation!$C43,Data!$K$5:$K$1888,Calculation!N$37)","v":5},{"$f":"SUMIFS(Data!$G$5:$G$1888,Data!$I$5:$I$1888,Calculation!$C43,Data!$K$5:$K$1888,Calculation!P$37)","v":283299.07489512849},{"$f":"COUNTIFS(Data!$I$5:$I$1888,Calculation!$C43,Data!$K$5:$K$1888,Calculation!P$37)","v":5},{"$f":"SUMIFS(Data!$G$5:$G$1888,Data!$I$5:$I$1888,Calculation!$C43,Data!$K$5:$K$1888,Calculation!R$37)","v":6892673.8166208891},{"$f":"COUNTIFS(Data!$I$5:$I$1888,Calculation!$C43,Data!$K$5:$K$1888,Calculation!R$37)","v":105},23515565.738767765,472]
[null,null,"CXO or Top Mgmt.",{"$f":"SUMIFS(Data!$G$5:$G$1888,Data!$I$5:$I$1888,Calculation!$C44,Data!$K$5:$K$1888,Calculation!D$37)","v":1360600},{"$f":"COUNTIFS(Data!$I$5:$I$1888,Calculation!$C44,Data!$K$5:$K$1888,Calculation!D$37)","v":17},{"$f":"SUMIFS(Data!$G$5:$G$1888,Data!$I$5:$I$1888,Calculation!$C44,Data!$K$5:$K$1888,Calculation!F$37)","v":208018.88636412201},{"$f":"COUNTIFS(Data!$I$5:$I$1888,Calculation!$C44,Data!$K$5:$K$1888,Calculation!F$37)","v":21},{"$f":"SUMIFS(Data!$G$5:$G$1888,Data!$I$5:$I$1888,Calculation!$C44,Data!$K$5:$K$1888,Calculation!H$37)","v":146584.57930225742},{"$f":"COUNTIFS(Data!$I$5:$I$1888,Calculation!$C44,Data!$K$5:$K$1888,Calculation!H$37)","v":3},{"$f":"SUMIFS(Data!$G$5:$G$1888,Data!$I$5:$I$1888,Calculation!$C44,Data!$K$5:$K$1888,Calculation!J$37)","v":410003.6818738596},{"$f":"COUNTIFS(Data!$I$5:$I$1888,Calculation!$C44,Data!$K$5:$K$1888,Calculation!J$37)","v":5},{"$f":"SUMIFS(Data!$G$5:$G$1888,Data!$I$5:$I$1888,Calculation!$C44,Data!$K$5:$K$1888,Calculation!L$37)","v":119970.10580969987},{"$f":"COUNTIFS(Data!$I$5:$I$1888,Calculation!$C44,Data!$K$5:$K$1888,Calculation!L$37)","v":2},{"$f":"SUMIFS(Data!$G$5:$G$1888,Data!$I$5:$I$1888,Calculation!$C44,Data!$K$5:$K$1888,Calculation!N$37)","v":0},{"$f":"COUNTIFS(Data!$I$5:$I$1888,Calculation!$C44,Data!$K$5:$K$1888,Calculation!N$37)","v":0},{"$f":"SUMIFS(Data!$G$5:$G$1888,Data!$I$5:$I$1888,Calculation!$C44,Data!$K$5:$K$1888,Calculation!P$37)","v":0},{"$f":"COUNTIFS(Data!$I$5:$I$1888,Calculation!$C44,Data!$K$5:$K$1888,Calculation!P$37)","v":0},{"$f":"SUMIFS(Data!$G$5:$G$1888,Data!$I$5:$I$1888,Calculation!$C44,Data!$K$5:$K$1888,Calculation!R$37)","v":877075.09882745065},{"$f":"COUNTIFS(Data!$I$5:$I$1888,Calculation!$C44,Data!$K$5:$K$1888,Calculation!R$37)","v":13},3122252.3521773894,61]
[null,null,"Accountant",{"$f":"SUMIFS(Data!$G$5:$G$1888,Data!$I$5:$I$1888,Calculation!$C45,Data!$K$5:$K$1888,Calculation!D$37)","v":2736360},{"$f":"COUNTIFS(Data!$I$5:$I$1888,Calculation!$C45,Data!$K$5:$K$1888,Calculation!D$37)","v":37},{"$f":"SUMIFS(Data!$G$5:$G$1888,Data!$I$5:$I$1888,Calculation!$C45,Data!$K$5:$K$1888,Calculation!F$37)","v":468830.83623127494},{"$f":"COUNTIFS(Data!$I$5:$I$1888,Calculation!$C45,Data!$K$5:$K$1888,Calculation!F$37)","v":32},{"$f":"SUMIFS(Data!$G$5:$G$1888,Data!$I$5:$I$1888,Calculation!$C45,Data!$K$5:$K$1888,Calculation!H$37)","v":278385.85726760043},{"$f":"COUNTIFS(Data!$I$5:$I$1888,Calculation!$C45,Data!$K$5:$K$1888,Calculation!H$37)","v":6},{"$f":"SUMIFS(Data!$G$5:$G$1888,Data!$I$5:$I$1888,Calculation!$C45,Data!$K$5:$K$1888,Calculation!J$37)","v":448908.65077171463},{"$f":"COUNTIFS(Data!$I$5:$I$1888,Calculation!$C45,Data!$K$5:$K$1888,Calculation!J$37)","v":5},{"$f":"SUMIFS(Data!$G$5:$G$1888,Data!$I$5:$I$1888,Calculation!$C45,Data!$K$5:$K$1888,Calculation!L$37)","v":76702.198796365497},{"$f":"COUNTIFS(Data!$I$5:$I$1888,Calculation!$C45,Data!$K$5:$K$1888,Calculation!L$37)","v":1},{"$f":"SUMIFS(Data!$G$5:$G$1888,Data!$I$5:$I$1888,Calculation!$C45,Data!$K$5:$K$1888,Calculation!N$37)","v":16800},{"$f":"COUNTIFS(Data!$I$5:$I$1888,Calculation!$C45,Data!$K$5:$K$1888,Calculation!N$37)","v":1},{"$f":"SUMIFS(Data!$G$5:$G$1888,Data!$I$5:$I$1888,Calculation!$C45,Data!$K$5:$K$1888,Calculation!P$37)","v":63519.971949580387},{"$f":"COUNTIFS(Data!$I$5:$I$1888,Calculation!$C45,Data!$K$5:$K$1888,Calculation!P$37)","v":1},{"$f":"SUMIFS(Data!$G$5:$G$1888,Data!$I$5:$I$1888,Calculation!$C45,Data!$K$5:$K$1888,Calculation!R$37)","v":2116671.2362481155},{"$f":"COUNTIFS(Data!$I$5:$I$1888,Calculation!$C45,Data!$K$5:$K$1888,Calculation!R$37)","v":34},6206178.7512646522,117]
[null,null,"Specialist",{"$f":"SUMIFS(Data!$G$5:$G$1888,Data!$I$5:$I$1888,Calculation!$C46,Data!$K$5:$K$1888,Calculation!D$37)","v":1089532},{"$f":"COUNTIFS(Data!$I$5:$I$1888,Calculation!$C46,Data!$K$5:$K$1888,Calculation!D$37)","v":14},{"$f":"SUMIFS(Data!$G$5:$G$1888,Data!$I$5:$I$1888,Calculation!$C46,Data!$K$5:$K$1888,Calculation!F$37)","v":103346.80632822127},{"$f":"COUNTIFS(Data!$I$5:$I$1888,Calculation!$C46,Data!$K$5:$K$1888,Calculation!F$37)","v":13},{"$f":"SUMIFS(Data!$G$5:$G$1888,Data!$I$5:$I$1888,Calculation!$C46,Data!$K$5:$K$1888,Calculation!H$37)","v":69506.309441623103},{"$f":"COUNTIFS(Data!$I$5:$I$1888,Calculation!$C46,Data!$K$5:$K$1888,Calculation!H$37)","v":2},{"$f":"SUMIFS(Data!$G$5:$G$1888,Data!$I$5:$I$1888,Calculation!$C46,Data!$K$5:$K$1888,Calculation!J$37)","v":152986.44846039536},{"$f":"COUNTIFS(Data!$I$5:$I$1888,Calculation!$C46,Data!$K$5:$K$1888,Calculation!J$37)","v":1},{"$f":"SUMIFS(Data!$G$5:$G$1888,Data!$I$5:$I$1888,Calculation!$C46,Data!$K$5:$K$1888,Calculation!L$37)","v":0},{"$f":"COUNTIFS(Data!$I$5:$I$1888,Calculation!$C46,Data!$K$5:$K$1888,Calculation!L$37)","v":0},{"$f":"SUMIFS(Data!$G$5:$G$1888,Data!$I$5:$I$1888,Calculation!$C46,Data!$K$5:$K$1888,Calculation!N$37)","v":61925},{"$f":"COUNTIFS(Data!$I$5:$I$1888,Calculation!$C46,Data!$K$5:$K$1888,Calculation!N$37)","v":4},{"$f":"SUMIFS(Data!$G$5:$G$1888,Data!$I$5:$I$1888,Calculation!$C46,Data!$K$5:$K$1888,Calculation!P$37)","v":152447.93267899292},{"$f":"COUNTIFS(Data!$I$5:$I$1888,Calculation!$C46,Data!$K$5:$K$1888,Calculation!P$37)","v":2},{"$f":"SUMIFS(Data!$G$5:$G$1888,Data!$I$5:$I$1888,Calculation!$C46,Data!$K$5:$K$1888,Calculation!R$37)","v":602109.603751363},{"$f":"COUNTIFS(Data!$I$5:$I$1888,Calculation!$C46,Data!$K$5:$K$1888,Calculation!R$37)","v":11},2231854.1006605956,47]
[null,null,"Reporting",{"$f":"SUMIFS(Data!$G$5:$G$1888,Data!$I$5:$I$1888,Calculation!$C47,Data!$K$5:$K$1888,Calculation!D$37)","v":1326160},{"$f":"COUNTIFS(Data!$I$5:$I$1888,Calculation!$C47,Data!$K$5:$K$1888,Calculation!D$37)","v":17},{"$f":"SUMIFS(Data!$G$5:$G$1888,Data!$I$5:$I$1888,Calculation!$C47,Data!$K$5:$K$1888,Calculation!F$37)","v":622333.49922001315},{"$f":"COUNTIFS(Data!$I$5:$I$1888,Calculation!$C47,Data!$K$5:$K$1888,Calculation!F$37)","v":26},{"$f":"SUMIFS(Data!$G$5:$G$1888,Data!$I$5:$I$1888,Calculation!$C47,Data!$K$5:$K$1888,Calculation!H$37)","v":345183.04158273526},{"$f":"COUNTIFS(Data!$I$5:$I$1888,Calculation!$C47,Data!$K$5:$K$1888,Calculation!H$37)","v":5},{"$f":"SUMIFS(Data!$G$5:$G$1888,Data!$I$5:$I$1888,Calculation!$C47,Data!$K$5:$K$1888,Calculation!J$37)","v":337590.09626927244},{"$f":"COUNTIFS(Data!$I$5:$I$1888,Calculation!$C47,Data!$K$5:$K$1888,Calculation!J$37)","v":4},{"$f":"SUMIFS(Data!$G$5:$G$1888,Data!$I$5:$I$1888,Calculation!$C47,Data!$K$5:$K$1888,Calculation!L$37)","v":49168.076151516347},{"$f":"COUNTIFS(Data!$I$5:$I$1888,Calculation!$C47,Data!$K$5:$K$1888,Calculation!L$37)","v":1},{"$f":"SUMIFS(Data!$G$5:$G$1888,Data!$I$5:$I$1888,Calculation!$C47,Data!$K$5:$K$1888,Calculation!N$37)","v":13603.016099449767},{"$f":"COUNTIFS(Data!$I$5:$I$1888,Calculation!$C47,Data!$K$5:$K$1888,Calculation!N$37)","v":1},{"$f":"SUMIFS(Data!$G$5:$G$1888,Data!$I$5:$I$1888,Calculation!$C47,Data!$K$5:$K$1888,Calculation!P$37)","v":43828.780645210471},{"$f":"COUNTIFS(Data!$I$5:$I$1888,Calculation!$C47,Data!$K$5:$K$1888,Calculation!P$37)","v":1},{"$f":"SUMIFS(Data!$G$5:$G$1888,Data!$I$5:$I$1888,Calculation!$C47,Data!$K$5:$K$1888,Calculation!R$37)","v":645720.17191557237},{"$f":"COUNTIFS(Data!$I$5:$I$1888,Calculation!$C47,Data!$K$5:$K$1888,Calculation!R$37)","v":11},3383586.68188377,66]
[null,null,"Consultant",{"$f":"SUMIFS(Data!$G$5:$G$1888,Data!$I$5:$I$1888,Calculation!$C48,Data!$K$5:$K$1888,Calculation!D$37)","v":1140178},{"$f":"COUNTIFS(Data!$I$5:$I$1888,Calculation!$C48,Data!$K$5:$K$1888,Calculation!D$37)","v":17},{"$f":"SUMIFS(Data!$G$5:$G$1888,Data!$I$5:$I$1888,Calculation!$C48,Data!$K$5:$K$1888,Calculation!F$37)","v":269339.94600639655},{"$f":"COUNTIFS(Data!$I$5:$I$1888,Calculation!$C48,Data!$K$5:$K$1888,Calculation!F$37)","v":19},{"$f":"SUMIFS(Data!$G$5:$G$1888,Data!$I$5:$I$1888,Calculation!$C48,Data!$K$5:$K$1888,Calculation!H$37)","v":401704.79441906809},{"$f":"COUNTIFS(Data!$I$5:$I$1888,Calculation!$C48,Data!$K$5:$K$1888,Calculation!H$37)","v":5},{"$f":"SUMIFS(Data!$G$5:$G$1888,Data!$I$5:$I$1888,Calculation!$C48,Data!$K$5:$K$1888,Calculation!J$37)","v":391645.30805861217},{"$f":"COUNTIFS(Data!$I$5:$I$1888,Calculation!$C48,Data!$K$5:$K$1888,Calculation!J$37)","v":4},{"$f":"SUMIFS(Data!$G$5:$G$1888,Data!$I$5:$I$1888,Calculation!$C48,Data!$K$5:$K$1888,Calculation!L$37)","v":180334.46092121309},{"$f":"COUNTIFS(Data!$I$5:$I$1888,Calculation!$C48,Data!$K$5:$K$1888,Calculation!L$37)","v":3},{"$f":"SUMIFS(Data!$G$5:$G$1888,Data!$I$5:$I$1888,Calculation!$C48,Data!$K$5:$K$1888,Calculation!N$37)","v":4457.9172610556352},{"$f":"COUNTIFS(Data!$I$5:$I$1888,Calculation!$C48,Data!$K$5:$K$1888,Calculation!N$37)","v":1},{"$f":"SUMIFS(Data!$G$5:$G$1888,Data!$I$5:$I$1888,Calculation!$C48,Data!$K$5:$K$1888,Calculation!P$37)","v":95279.957924370581},{"$f":"COUNTIFS(Data!$I$5:$I$1888,Calculation!$C48,Data!$K$5:$K$1888,Calculation!P$37)","v":1},{"$f":"SUMIFS(Data!$G$5:$G$1888,Data!$I$5:$I$1888,Calculation!$C48,Data!$K$5:$K$1888,Calculation!R$37)","v":1623287.1577592015},{"$f":"COUNTIFS(Data!$I$5:$I$1888,Calculation!$C48,Data!$K$5:$K$1888,Calculation!R$37)","v":25},4106227.5423499178,75]
[null,null,"Misc.",{"$f":"SUMIFS(Data!$G$5:$G$1888,Data!$I$5:$I$1888,Calculation!$C49,Data!$K$5:$K$1888,Calculation!D$37)","v":233600},{"$f":"COUNTIFS(Data!$I$5:$I$1888,Calculation!$C49,Data!$K$5:$K$1888,Calculation!D$37)","v":4},{"$f":"SUMIFS(Data!$G$5:$G$1888,Data!$I$5:$I$1888,Calculation!$C49,Data!$K$5:$K$1888,Calculation!F$37)","v":3561.5833374885137},{"$f":"COUNTIFS(Data!$I$5:$I$1888,Calculation!$C49,Data!$K$5:$K$1888,Calculation!F$37)","v":1},{"$f":"SUMIFS(Data!$G$5:$G$1888,Data!$I$5:$I$1888,Calculation!$C49,Data!$K$5:$K$1888,Calculation!H$37)","v":81000},{"$f":"COUNTIFS(Data!$I$5:$I$1888,Calculation!$C49,Data!$K$5:$K$1888,Calculation!H$37)","v":1},{"$f":"SUMIFS(Data!$G$5:$G$1888,Data!$I$5:$I$1888,Calculation!$C49,Data!$K$5:$K$1888,Calculation!J$37)","v":0},{"$f":"COUNTIFS(Data!$I$5:$I$1888,Calculation!$C49,Data!$K$5:$K$1888,Calculation!J$37)","v":0},{"$f":"SUMIFS(Data!$G$5:$G$1888,Data!$I$5:$I$1888,Calculation!$C49,Data!$K$5:$K$1888,Calculation!L$37)","v":90469.260118790073},{"$f":"COUNTIFS(Data!$I$5:$I$1888,Calculation!$C49,Data!$K$5:$K$1888,Calculation!L$37)","v":1},{"$f":"SUMIFS(Data!$G$5:$G$1888,Data!$I$5:$I$1888,Calculation!$C49,Data!$K$5:$K$1888,Calculation!N$37)","v":0},{"$f":"COUNTIFS(Data!$I$5:$I$1888,Calculation!$C49,Data!$K$5:$K$1888,Calculation!N$37)","v":0},{"$f":"SUMIFS(Data!$G$5:$G$1888,Data!$I$5:$I$1888,Calculation!$C49,Data!$K$5:$K$1888,Calculation!P$37)","v":0},{"$f":"COUNTIFS(Data!$I$5:$I$1888,Calculation!$C49,Data!$K$5:$K$1888,Calculation!P$37)","v":0},{"$f":"SUMIFS(Data!$G$5:$G$1888,Data!$I$5:$I$1888,Calculation!$C49,Data!$K$5:$K$1888,Calculation!R$37)","v":0},{"$f":"COUNTIFS(Data!$I$5:$I$1888,Calculation!$C49,Data!$K$5:$K$1888,Calculation!R$37)","v":0},408630.84345627861,7]
[]
[null,null,null,{"$f":"SUM(D40:D49)","v":33193451},{"$f":"SUM(E40:E49)","v":459},{"$f":"SUM(F40:F49)","v":6724688.9173641438},{"$f":"SUM(G40:G49)","v":512},{"$f":"SUM(H40:H49)","v":7805534.0684628803},{"$f":"SUM(I40:I49)","v":124},{"$f":"SUM(J40:J49)","v":7295048.074526838},{"$f":"SUM(K40:K49)","v":78},{"$f":"SUM(L40:L49)","v":2704684.9508218747},{"$f":"SUM(M40:M49)","v":40},{"$f":"SUM(N40:N49)","v":337964.57178652351},{"$f":"SUM(O40:O49)","v":28},{"$f":"SUM(P40:P49)","v":1362503.3983184993},{"$f":"SUM(Q40:Q49)","v":21},{"$f":"SUM(R40:R49)","v":22724137.115252323},{"$f":"SUM(S40:S49)","v":356},{"$f":"SUM(T40:T49)","v":82148012.096533075},{"$f":"SUM(U40:U49)","v":1618}]
[]
[null,null,null,100000]
[]
[null,{"$f":"D55/$D$64","v":0.40406882836061803},"USA",{"$f":"(D51)/100000","v":331.93450999999999},{"$f":"E51","v":459},{"$f":"D55/E55*100000","v":72316.886710239647}]
[null,{"$f":"D56/$D$64","v":8.1860640881508906E-2},"India",{"$f":"(F51)/100000","v":67.246889173641435},{"$f":"G51","v":512},{"$f":"D56/E56*100000","v":13134.158041726843}]
[null,9.5017930066165282E-2,"UK",{"$f":"(H51)/100000","v":78.055340684628803},{"$f":"I51","v":124},62947.855390829674]
[null,8.8803707945535465E-2,"Australia",{"$f":"(J51)/100000","v":72.950480745268379},{"$f":"K51","v":78},93526.257365728699]
[null,3.2924533190694473E-2,"Canada",{"$f":"(L51)/100000","v":27.046849508218745},{"$f":"M51","v":40},67617.123770546867]
[null,4.1140931248510003E-3,"Pakistan",{"$f":"(N51)/100000","v":3.3796457178652353},{"$f":"O51","v":28},12070.163278090125]
[null,1.6585957024954003E-2,"Netherlands",{"$f":"(P51)/100000","v":13.625033983184993},{"$f":"Q51","v":21},64881.114205642822]
[null,0.2766243094056729,"Other Countries",{"$f":"(R51)/100000","v":227.24137115252324},{"$f":"S51","v":356},63831.845829360456]
[]
[null,null,"Total",{"$f":"SUM(D55:D63)","v":821.4801209653308},{"$f":"SUM(E55:E63)","v":1618},{"$f":"E55/E64","v":0.28368355995055622}]
[]
[]
[null,null,null,"No. of Employees","Experience in Years"]
[]
[null,null,null,548,"Blank",{"$f":"SUM(Data!G1341:G1888)","v":19024434.610467572},{"$f":"F69/D69","v":34716.121551948127}]
[null,5,null,{"$f":"COUNTIF(Data!$M$6:$M$1888,\"<\"&B70)","v":420},"Less than 5",{"$f":"SUMIF(Data!$M$6:$M$1888,\"<\"&B70,Data!$G$6:$G$1888)","v":21865036.922382545},{"$f":"F70/D70","v":52059.611719958441}]
[null,10,null,{"$f":"COUNTIF(Data!$M$6:$M$1888,\"<\"&B71)-D70","v":417},">=5 but < 10",{"$f":"SUMIF(Data!$M$6:$M$1888,\"<\"&B71,Data!$G$6:$G$1888)-F70","v":22990083.110363442},{"$f":"F71/D71","v":55132.093789840386}]
[null,20,null,{"$f":"COUNTIF(Data!$M$6:$M$1888,\"<\"&B72)-(D71+D70)","v":355},">=10 but < 20",{"$f":"SUMIF(Data!$M$6:$M$1888,\"<\"&B72,Data!$G$6:$G$1888)-(F71+F70)","v":22238165.307099104},{"$f":"F72/D72","v":62642.719174927057}]
[null,41,null,{"$f":"COUNTIF(Data!$M$6:$M$1888,\"<\"&B73)-(SUM(D70:D72))","v":143},"> than 20",{"$f":"SUMIF(Data!$M$6:$M$1888,\"<\"&B73,Data!$G$6:$G$1888)-(SUM(F70:F72))","v":7683168.5649576783},{"$f":"F73/D73","v":53728.451503200551}]
[]
[null,null,null,{"$f":"SUM(D69:D73)","v":1883},null,{"$f":"SUM(F69:F73)","v":93800888.515270337}]

{"sheet":"Pivottwo ","index":2,"n_rows":15,"n_cols":7,"rows_kept":15,"cut":false,"hidden":false,"merged":[]}
[]
[]
["Count of Salary in USD","Column Labels"]
["Row Labels","1 or 2 hours a day","2 to 3 hours per day","4 to 6 hours a day","All the 8 hours baby, all the 8!","Excel ?!? What Excel?","Grand Total"]
["Accountant",4,34,58,39,null,135]
["Analyst",57,137,329,215,5,743]
["Consultant",12,26,27,25,null,90]
["Controller",2,15,36,14,null,67]
["CXO or Top Mgmt.",10,22,32,11,null,75]
["Engineer",14,26,26,8,null,74]
["Manager",65,166,215,110,2,558]
["Misc.",2,1,3,1,null,7]
["Reporting",4,12,26,41,null,83]
["Specialist",4,12,23,12,null,51]
["Grand Total",174,451,775,476,7,1883]

{"sheet":"Pivotone","index":3,"n_rows":15,"n_cols":7,"rows_kept":15,"cut":false,"hidden":false,"merged":[]}
[]
[]
["Sum of Salary in USD","Column Labels"]
["Row Labels","1 or 2 hours a day","2 to 3 hours per day","4 to 6 hours a day","All the 8 hours baby, all the 8!","Excel ?!? What Excel?","Grand Total"]
["Accountant",87201.973098284434,1278065.8949842113,4035501.3172119451,1915750.2932257301,null,7316519.4785201708]
["Analyst",2497698.7669547582,6654434.1169609893,15695244.701194942,9234925.4212033991,315453.67055368022,34397756.676867768]
["Consultant",547484.92330488062,1674624.0220708929,1675134.3922084388,1768322.6523190467,null,5665565.9899032591]
["Controller",74995.482820131787,1162435.932117051,2279259.2560399813,845272.57374912687,null,4361963.2447262909]
["CXO or Top Mgmt.",793531.50650823419,2653298.7099546315,2958563.5388856176,889546.91605107766,null,7294940.6713995608]
["Engineer",494929.79465060291,1733476.7135923521,1271639.3638250576,326875.33334995405,null,3826921.2054179665]
["Manager",3739019.2132787476,7971864.7966886163,10244727.03731575,3897827.2704607206,87000,25940438.317743834]
["Misc.",164461,41712.231189497601,94493.108336241959,21000,null,321666.33952573955]
["Reporting",52287.46251433537,353950.80337453313,465160.39769449411,753256.49460161524,null,1624655.1581849777]
["Specialist",200779.22926577728,629289.40973428939,1133296.254799901,1087096.5391808571,null,3050461.4329808247]
["Grand Total",8652389.3523957524,24153152.630667061,39853019.367512368,20739873.494141527,402453.67055368022,93800888.515270397]

{"sheet":"mapping","index":4,"n_rows":137,"n_cols":13,"rows_kept":137,"cut":false,"hidden":false,"merged":[[0,1,0,2]]}
[null,"Mapping Sheet",null,null,null,null,"Source: Xrates on 6/21/2012","and xe.com"]
[null,"Currency Mapping",null,null,null,null,null,null,null,null,null,"Country Mapping"]
[null,"Currency","in USD",null,null,null,"Value of 1 American Dollar",null,null,null,null,"Actual","Mapping"]
[null,"USD",1,null,null,null,"     Argentine Peso ",4.4927299999999999,"ARS",null,null,"USA","USA"]
[null,"EUR",{"$f":"1/INDEX($H$4:$H$64,MATCH(tblXrate[[#This Row],[Currency]],$I$4:$I$64,0))","v":1.2703994389916078},null,null,null,"     Australian Dollar ",0.98047899999999999,"AUD",null,null,"India","India"]
[null,"PKR",{"$f":"1/INDEX($H$4:$H$64,MATCH(tblXrate[[#This Row],[Currency]],$I$4:$I$64,0))","v":1.0614088716799131E-2},null,null,null,"     Botswana Pula ",7.6569700000000003,"BWP",null,null,"UK","UK"]
[null,"INR",{"$f":"1/INDEX($H$4:$H$64,MATCH(tblXrate[[#This Row],[Currency]],$I$4:$I$64,0))","v":1.7807916687442568E-2},null,null,null,"     Brazilian Real ",2.0231400000000002,"BRL",null,null,"Australia","Australia"]
[null,"GBP",{"$f":"1/INDEX($H$4:$H$64,MATCH(tblXrate[[#This Row],[Currency]],$I$4:$I$64,0))","v":1.5761782720672841},null,null,null,"     British Pound ",0.63444599999999995,"GBP",null,null,"Canada","Canada"]
[null,"AUD",{"$f":"1/INDEX($H$4:$H$64,MATCH(tblXrate[[#This Row],[Currency]],$I$4:$I$64,0))","v":1.0199096564026358},null,null,null,"     Brunei dollar ",1.2686999999999999,"BND",null,null,"Pakistan","Pakistan"]
[null,"CAD",{"$f":"1/INDEX($H$4:$H$64,MATCH(tblXrate[[#This Row],[Currency]],$I$4:$I$64,0))","v":0.98336152303032687},null,null,null,"     Bulgarian Lev ",1.53952,"BGN",null,null,"South Africa","South Africa"]
[null,"PHP",{"$f":"1/INDEX($H$4:$H$64,MATCH(tblXrate[[#This Row],[Currency]],$I$4:$I$64,0))","v":2.3705052257787702E-2},null,null,null,"     Canadian Dollar ",1.01692,"CAD",null,null,"Germany","Germany"]
[null,"AED",{"$f":"1/INDEX($H$4:$H$64,MATCH(tblXrate[[#This Row],[Currency]],$I$4:$I$64,0))","v":0.27221921268759308},null,null,null,"     Chilean Peso ",497.26799999999997,"CLP",null,null,"UAE","UAE"]
[null,"MXN",{"$f":"1/INDEX($H$4:$H$64,MATCH(tblXrate[[#This Row],[Currency]],$I$4:$I$64,0))","v":7.3046552567951561E-2},null,null,null,"     Chinese Yuan ",6.3609099999999996,"CNY",null,null,"Brazil","Brazil"]
[null,"SEK",{"$f":"1/INDEX($H$4:$H$64,MATCH(tblXrate[[#This Row],[Currency]],$I$4:$I$64,0))","v":0.14365525038391866},null,null,null,"     Colombian Peso ",1769.79,"COP",null,null,"Netherlands","Netherlands"]
[null,"BDT",{"$f":"1/INDEX($H$4:$H$64,MATCH(tblXrate[[#This Row],[Currency]],$I$4:$I$64,0))","v":1.2220845340313881E-2},null,null,null,"     Croatian Kuna ",5.9367099999999997,"HRK",null,null,"Singapore","Singapore"]
[null,"COSTARICAN",{"$f":"1/INDEX($H$4:$H$64,MATCH(tblXrate[[#This Row],[Currency]],$I$4:$I$64,0))","v":2.0078305391024996E-3},null,null,null,"     Danish Krone ",5.8512300000000002,"DKK",null,null,"Philippines","Philippines"]
[null,"ZAR",{"$f":"1/INDEX($H$4:$H$64,MATCH(tblXrate[[#This Row],[Currency]],$I$4:$I$64,0))","v":0.12192177986291114},null,null,null,"     Euro ",0.78715400000000002,"EUR",null,null,"Portugal","Portugal"]
[null,"NZD",{"$f":"1/INDEX($H$4:$H$64,MATCH(tblXrate[[#This Row],[Currency]],$I$4:$I$64,0))","v":0.79758809360493876},null,null,null,"     Hong Kong Dollar ",7.7588900000000001,"HKD",null,null,"Spain","Spain"]
[null,"CNY",{"$f":"1/INDEX($H$4:$H$64,MATCH(tblXrate[[#This Row],[Currency]],$I$4:$I$64,0))","v":0.15721021048875083},null,null,null,"     Hungarian Forint ",225.874,"HUF",null,null,"New Zealand","New Zealand"]
[null,"EGYPT",{"$f":"1/INDEX($H$4:$H$64,MATCH(tblXrate[[#This Row],[Currency]],$I$4:$I$64,0))","v":0.16526194017517765},null,null,null,"     Iceland Krona ",124.697,"ISK",null,null,"Russia","Russia"]
[null,"NAIRA",{"$f":"1/INDEX($H$4:$H$64,MATCH(tblXrate[[#This Row],[Currency]],$I$4:$I$64,0))","v":6.1633281972265025E-3},null,null,null,"     Indian Rupee ",56.154800000000002,"INR",null,null,"Saudi Arabia","Saudi Arabia"]
[null,"AED",{"$f":"1/INDEX($H$4:$H$64,MATCH(tblXrate[[#This Row],[Currency]],$I$4:$I$64,0))","v":0.27221921268759308},null,null,null,"     Indonesian Rupiah ",9443.81,"IDR",null,null,"Mexico","Mexico"]
[null,"BRL",{"$f":"1/INDEX($H$4:$H$64,MATCH(tblXrate[[#This Row],[Currency]],$I$4:$I$64,0))","v":0.49428116689897877},null,null,null,"     Israeli New Shekel ",3.86721,"ILS",null,null,"Indonesia","Indonesia"]
[null,"RON",{"$f":"1/INDEX($H$4:$H$64,MATCH(tblXrate[[#This Row],[Currency]],$I$4:$I$64,0))","v":0.28461323906942854},null,null,null,"     Japanese Yen ",78.904300000000006,"JPY",null,null,"Norway","Norway"]
[null,"USD",1,null,null,null,"     Kazakhstani Tenge ",148.88,"KZT",null,null,"malaysia","malaysia"]
[null,"MYR",{"$f":"1/INDEX($H$4:$H$64,MATCH(tblXrate[[#This Row],[Currency]],$I$4:$I$64,0))","v":0.31680056770661735},null,null,null,"     Kuwaiti Dinar ",0.27939999999999998,"KWD",null,null,"The Netherlands","Netherlands"]
[null,"LKR",{"$f":"1/INDEX($H$4:$H$64,MATCH(tblXrate[[#This Row],[Currency]],$I$4:$I$64,0))","v":7.5240581760178168E-3},null,null,null,"     Latvian Lat ",0.548489,"LVL",null,null,"Romania","Romania"]
[null,"SGD",{"$f":"1/INDEX($H$4:$H$64,MATCH(tblXrate[[#This Row],[Currency]],$I$4:$I$64,0))","v":0.78882394238429931},null,null,null,"     Libyan Dinar ",1.9323999999999999,"LYD",null,null,"Poland","Poland"]
[null,"GBP",{"$f":"1/INDEX($H$4:$H$64,MATCH(tblXrate[[#This Row],[Currency]],$I$4:$I$64,0))","v":1.5761782720672841},null,null,null,"     Lithuanian Litas ",2.7178800000000001,"LTL",null,null,"italy","italy"]
[null,"DOP",{"$f":"1/INDEX($H$4:$H$64,MATCH(tblXrate[[#This Row],[Currency]],$I$4:$I$64,0))","v":2.5673940949935813E-2},null,null,null,"     Malaysian Ringgit ",3.1565599999999998,"MYR",null,null,"Hungary","Hungary"]
[null,"PLN",{"$f":"1/INDEX($H$4:$H$64,MATCH(tblXrate[[#This Row],[Currency]],$I$4:$I$64,0))","v":0.30031472983686902},null,null,null,"     Mauritius Rupee ",30.715900000000001,"MUR",null,null,"Denmark","Denmark"]
[null,"KENYA",{"$f":"1/INDEX($H$4:$H$64,MATCH(tblXrate[[#This Row],[Currency]],$I$4:$I$64,0))","v":1.1976047904191617E-2},null,null,null,"     Mexican Peso ",13.6899,"MXN",null,null,"Ireland","Ireland"]
[null,"DKK",{"$f":"1/INDEX($H$4:$H$64,MATCH(tblXrate[[#This Row],[Currency]],$I$4:$I$64,0))","v":0.17090423722875361},null,null,null,"     Nepalese Rupee ",89.65,"NPR",null,null,"Israel","Israel"]
[null,"IDR",{"$f":"1/INDEX($H$4:$H$64,MATCH(tblXrate[[#This Row],[Currency]],$I$4:$I$64,0))","v":1.0588946622178973E-4},null,null,null,"     New Zealand Dollar ",1.2537799999999999,"NZD",null,null,"France","France"]
[null,"MONGOLIAN",{"$f":"1/INDEX($H$4:$H$64,MATCH(tblXrate[[#This Row],[Currency]],$I$4:$I$64,0))","v":7.5642965204236008E-4},null,null,null,"     Norwegian Kroner ",5.9083800000000002,"NOK",null,null,"Colombia","Colombia"]
[null,"JPY",{"$f":"1/INDEX($H$4:$H$64,MATCH(tblXrate[[#This Row],[Currency]],$I$4:$I$64,0))","v":1.2673580527296991E-2},null,null,null,"     Omani Rial ",0.38450000000000001,"OMR",null,null,"Switzerland","Switzerland"]
[null,"SAR",{"$f":"1/INDEX($H$4:$H$64,MATCH(tblXrate[[#This Row],[Currency]],$I$4:$I$64,0))","v":0.26666666666666666},null,null,null,"     Pakistan Rupee ",94.214399999999998,"PKR",null,null,"Sri Lanka","Sri Lanka"]
[null,"MAD",{"$f":"1/INDEX($H$4:$H$64,MATCH(tblXrate[[#This Row],[Currency]],$I$4:$I$64,0))","v":0.11454753722794959},null,null,null,"     Philippine Peso ",42.185099999999998,"PHP",null,null,"Belgium","Belgium"]
[null,"MUR",{"$f":"1/INDEX($H$4:$H$64,MATCH(tblXrate[[#This Row],[Currency]],$I$4:$I$64,0))","v":3.2556428429575561E-2},null,null,null,"     Qatari Rial ",3.64,"QAR",null,null,"Dubai","Dubai"]
[null,"NOK",{"$f":"1/INDEX($H$4:$H$64,MATCH(tblXrate[[#This Row],[Currency]],$I$4:$I$64,0))","v":0.16925113144381371},null,null,null,"     Romanian Leu ",3.5135399999999999,"RON",null,null,"Ukraine","Ukraine"]
[null,"CHF",{"$f":"1/INDEX($H$4:$H$64,MATCH(tblXrate[[#This Row],[Currency]],$I$4:$I$64,0))","v":1.0578730615798488},null,null,null,"     Russian Ruble ",32.5458,"RUB",null,null,"Kuwait","Kuwait"]
[null,"ETB",{"$f":"1/INDEX($H$4:$H$64,MATCH(tblXrate[[#This Row],[Currency]],$I$4:$I$64,0))","v":5.6561085972850679E-2},null,null,null,"     Saudi Riyal ",3.75,"SAR",null,null,"iran","iran"]
[null,null,null,null,null,null,"     Singapore Dollar ",1.2677099999999999,"SGD",null,null,"Qatar","Qatar"]
[null,null,null,null,null,null,"     South African Rand ",8.2019800000000007,"ZAR",null,null,"Nigeria","Nigeria"]
[null,null,null,null,null,null,"     South Korean Won ",1151.0899999999999,"KRW",null,null,"Finland","Finland"]
[null,null,null,null,null,null,"     Sri Lanka Rupee ",132.90700000000001,"LKR",null,null,"Europe","Europe"]
[null,null,null,null,null,null,"     Swedish Krona ",6.9611099999999997,"SEK",null,null,"Japan","Japan"]
[null,null,null,null,null,null,"     Swiss Franc ",0.94529300000000005,"CHF",null,null,"Brasil","Brasil"]
[null,null,null,null,null,null,"     Taiwan Dollar ",29.859400000000001,"TWD",null,null,"nz","New Zealand"]
[null,null,null,null,null,null,"     Thai Baht ",31.500299999999999,"THB",null,null,"Greece","Greece"]
[null,null,null,null,null,null,"     Trinidad/Tobago Dollar ",6.3912199999999997,"TTD",null,null,"ksa","USA"]
[null,null,null,null,null,null,"     Turkish Lira ",1.79447,"TRY",null,null,"Panama","Panama"]
[null,null,null,null,null,null,"     Venezuelan Bolivar ",4.2940199999999997,"VEF",null,null,"Turkey","Turkey"]
[null,null,null,null,null,null,"UAE Dirham",3.6735099999999998,"AED",null,null,"Sweden","Sweden"]
[null,null,null,null,null,null,"Bangladesh Takha",81.827399999999997,"BDT",null,null,"china","china"]
[null,null,null,null,null,null,"Costarican CRC",498.05,"Costarican",null,null,"Bangladesh","Bangladesh"]
[null,null,null,null,null,null,"Egyptian Pound",6.0510000000000002,"Egypt",null,null,"Croatia","Croatia"]
[null,null,null,null,null,null,"Nigerian Naira",162.25,"NAIRA",null,null,"United Arab Emirates","UAE"]
[null,null,null,null,null,null,"Dominican Peso",38.950000000000003,"DOP",null,null,"MÃ©xico","Mexico"]
[null,null,null,null,null,null,"Polish Zloty",3.3298399999999999,"PLN",null,null,"Zambia","Zambia"]
[null,null,null,null,null,null,"Kenyan Shilling",83.5,"Kenya",null,null,"Tunisia","Tunisia"]
[null,null,null,null,null,null,"Mongolian Tughrik",1322,"Mongolian",null,null,"Saudi Arabai","Saudi Arabia"]
[null,null,null,null,null,null,"Moroccan Dirham",8.73,"MAD",null,null,"Ethiopia","Ethiopia"]
[null,null,null,null,null,null,"Ethiopian Birr",17.68,"ETB",null,null,"CEE","CEE"]
[null,null,null,null,null,null,null,null,null,null,null,"SouthAfrica","South Africa"]
[null,null,null,null,null,null,null,null,null,null,null,"Central America","Central America"]
[null,null,null,null,null,null,null,null,null,null,null,"Uruguay","Uruguay"]
[null,null,null,null,null,null,null,null,null,null,null,"Kenya","Kenya"]
[null,null,null,null,null,null,null,null,null,null,null,"Republica Dominicana","Republica Dominicana"]
[null,null,null,null,null,null,null,null,null,null,null,"Kingdom of Saudi Arabia","Saudi Arabia"]
[null,null,null,null,null,null,null,null,null,null,null,"Slovakia","Slovakia"]
[null,null,null,null,null,null,null,null,null,null,null,"Austria","Austria"]
[null,null,null,null,null,null,null,null,null,null,null,"Guyana","Guyana"]
[null,null,null,null,null,null,null,null,null,null,null,"Azerbaijan","Azerbaijan"]
[null,null,null,null,null,null,null,null,null,null,null,"Bulgaria","Bulgaria"]
[null,null,null,null,null,null,null,null,null,null,null,"Kuwait ","Kuwait "]
[null,null,null,null,null,null,null,null,null,null,null,"Peru","Peru"]
[null,null,null,null,null,null,null,null,null,null,null,"Vietnam","Vietnam"]
[null,null,null,null,null,null,null,null,null,null,null,"Armenia","Armenia"]
[null,null,null,null,null,null,null,null,null,null,null,"Zimbabwe","Zimbabwe"]
[null,null,null,null,null,null,null,null,null,null,null,"RSA","South Africa"]
[null,null,null,null,null,null,null,null,null,null,null,"Libya","Libya"]
[null,null,null,null,null,null,null,null,null,null,null,"self-employed","self-employed"]
[null,null,null,null,null,null,null,null,null,null,null,"Lithuania","Lithuania"]
[null,null,null,null,null,null,null,null,null,null,null,"Somalia","Somalia"]
[null,null,null,null,null,null,null,null,null,null,null,"Colombia - South America","Colombia"]
[null,null,null,null,null,null,null,null,null,null,null,"BRA","Brazil"]
[null,null,null,null,null,null,null,null,null,null,null,"mainland Europe (Euro zone)","Europe"]
[null,null,null,null,null,null,null,null,null,null,null,"Thailand","Thailand"]
[null,null,null,null,null,null,null,null,null,null,null,"Continental Europe","CEE"]
[null,null,null,null,null,null,null,null,null,null,null,"Asia","Asia"]
[null,null,null,null,null,null,null,null,null,null,null,"Mauritius","Mauritius"]
[null,null,null,null,null,null,null,null,null,null,null,"Cambodia","Cambodia"]
[null,null,null,null,null,null,null,null,null,null,null,"Costa Rica","Costa Rica"]
[null,null,null,null,null,null,null,null,null,null,null,"Viet Nam","Viet Nam"]
[null,null,null,null,null,null,null,null,null,null,null,"Mongolia","Mongolia"]
[null,null,null,null,null,null,null,null,null,null,null,"Estonia","Estonia"]
[null,null,null,null,null,null,null,null,null,null,null,"Montenegro","Montenegro"]
[null,null,null,null,null,null,null,null,null,null,null,"EU","Europe"]
[null,null,null,null,null,null,null,null,null,null,null,"Morocco","Morocco"]
[null,null,null,null,null,null,null,null,null,null,null,"Republic of Georgia","Republic of Georgia"]
[null,null,null,null,null,null,null,null,null,null,null,"mozambique","mozambique"]
[null,null,null,null,null,null,null,null,null,null,null,"europe/Croatia","Croatia"]
[null,null,null,null,null,null,null,null,null,null,null,"Myanmar","Myanmar"]
[null,null,null,null,null,null,null,null,null,null,null,"Bermuda","Bermuda"]
[null,null,null,null,null,null,null,null,null,null,null,"Myanmar [Burma]","Myanmar"]
[null,null,null,null,null,null,null,null,null,null,null,"FR","France"]
[null,null,null,null,null,null,null,null,null,null,null,"MYS","MYS"]
[null,null,null,null,null,null,null,null,null,null,null,"Bhutan","Bhutan"]
[null,null,null,null,null,null,null,null,null,null,null,"Baltic","Baltic"]
[null,null,null,null,null,null,null,null,null,null,null,"Slovenia","Slovenia"]
[null,null,null,null,null,null,null,null,null,null,null,"New  Zealand","New Zealand"]
[null,null,null,null,null,null,null,null,null,null,null,"Bolivia","Bolivia"]
[null,null,null,null,null,null,null,null,null,null,null,"Czech Republic","Czech Republic"]
[null,null,null,null,null,null,null,null,null,null,null,"Ghana","Ghana"]
[null,null,null,null,null,null,null,null,null,null,null,"bangkok","Thailand"]
[null,null,null,null,null,null,null,null,null,null,null,"srilanka","Sri Lanka"]
[null,null,null,null,null,null,null,null,null,null,null,"NL","Netherlands"]
[null,null,null,null,null,null,null,null,null,null,null,"Hong Kong","Hong Kong"]
[null,null,null,null,null,null,null,null,null,null,null,"nld","New Zealand"]
[null,null,null,null,null,null,null,null,null,null,null,"Aruba","Aruba"]
[null,null,null,null,null,null,null,null,null,null,null,"DK","Denmark"]
[null,null,null,null,null,null,null,null,null,null,null,"Iceland","Iceland"]
[null,null,null,null,null,null,null,null,null,null,null,"Dominican Republic","Dominican Republic"]
[null,null,null,null,null,null,null,null,null,null,null,"Uganda","Uganda"]
[null,null,null,null,null,null,null,null,null,null,null,"Oman","Oman"]
[null,null,null,null,null,null,null,null,null,null,null,"Inonesia","Indonesia"]
[null,null,null,null,null,null,null,null,null,null,null,"Argentina","Argentina"]
[null,null,null,null,null,null,null,null,null,null,null,"United Arab Emriate","UAE"]
[null,null,null,null,null,null,null,null,null,null,null,"Pakistan, Angola","Pakistan"]
[null,null,null,null,null,null,null,null,null,null,null,"Canad","Canada"]
[null,null,null,null,null,null,null,null,null,null,null,"Egypt","Egypt"]
[null,null,null,null,null,null,null,null,null,null,null,"arabian Gulf","arabian Gulf"]
[null,null,null,null,null,null,null,null,null,null,null,"Paraguay","Paraguay"]
[null,null,null,null,null,null,null,null,null,null,null,"Latin America","Latin America"]
[null,null,null,null,null,null,null,null,null,null,null,"Albania","Albania"]
[null,null,null,null,null,null,null,null,null,null,null,"Lesotho","Lesotho"]

{"sheet":"Data","index":5,"n_rows":1890,"n_cols":14,"rows_kept":1890,"cut":false,"hidden":false,"merged":[[0,1,0,4]]}
[null,"Excel Salary Survey Data",null,null,null,null,12]
[]
[null,"Note: Experience data is not available for first few hundred rows."]
[]
[null,"Unique ID","Timestamp","Your Salary","clean Salary (in local currency)","Currency","Salary in USD","Your Job Title","Job Type","Where do you work","clean Country","How many hours of a day you work on Excel","Years of Experience","Original clean Country"]
[null,"ID0708","2012-05-26T14:04:35","Rs 10000",120000,"INR",{"$f":"Data!$E591*VLOOKUP(Data!$F591,tblXrate[],2,FALSE)","v":3480},"Intern","Analyst","India",{"$f":"VLOOKUP(Data!$J591,tblCountries[[Actual]:[Mapping]],2,FALSE)","v":"Pakistan"},"1 or 2 hours a day",0,"India"]
[null,"ID0711","2012-05-26T14:14:35",400000,400000,"INR",{"$f":"Data!$E594*VLOOKUP(Data!$F594,tblXrate[],2,FALSE)","v":21369.500024931083},"Consultant","Consultant","India",{"$f":"VLOOKUP(Data!$J594,tblCountries[[Actual]:[Mapping]],2,FALSE)","v":"India"},"4 to 6 hours a day",0,"India"]
[null,"ID0816","2012-05-26T22:23:38",516000,516000,"INR",{"$f":"Data!$E678*VLOOKUP(Data!$F678,tblXrate[],2,FALSE)","v":96891.417358250401},"Management Trainee","Manager","India",{"$f":"VLOOKUP(Data!$J678,tblCountries[[Actual]:[Mapping]],2,FALSE)","v":"Australia"},"4 to 6 hours a day",0,"India"]
[null,"ID0998","2012-05-28T09:41:04",204000,204000,"INR",{"$f":"Data!$E802*VLOOKUP(Data!$F802,tblXrate[],2,FALSE)","v":20571},"Retired Government Officer, having knowledge in excel.","Manager","India",{"$f":"VLOOKUP(Data!$J802,tblCountries[[Actual]:[Mapping]],2,FALSE)","v":"Albania"},"4 to 6 hours a day",0,"India"]
[null,"ID1072","2012-05-28T14:56:27",15600,15600,"GBP",{"$f":"Data!$E858*VLOOKUP(Data!$F858,tblXrate[],2,FALSE)","v":65000},"business data analyst","Analyst","UK",{"$f":"VLOOKUP(Data!$J858,tblCountries[[Actual]:[Mapping]],2,FALSE)","v":"USA"},"All the 8 hours baby, all the 8!",0,"UK"]
[null,"ID1454","2012-05-30T13:21:06",500000,500000,"INR",{"$f":"Data!$E1157*VLOOKUP(Data!$F1157,tblXrate[],2,FALSE)","v":14400},"Project Management","Manager","India",{"$f":"VLOOKUP(Data!$J1157,tblCountries[[Actual]:[Mapping]],2,FALSE)","v":"Bulgaria"},"2 to 3 hours per day",0,"India"]
[null,"ID1756","2012-06-08T15:43:16","INR800000",800000,"INR",{"$f":"Data!$E1389*VLOOKUP(Data!$F1389,tblXrate[],2,FALSE)","v":85087},"MANAGER","Manager","India",{"$f":"VLOOKUP(Data!$J1389,tblCountries[[Actual]:[Mapping]],2,FALSE)","v":"USA"},"2 to 3 hours per day",0,"India"]
[null,"ID1757","2012-06-08T15:45:14",800000,800000,"INR",{"$f":"Data!$E1390*VLOOKUP(Data!$F1390,tblXrate[],2,FALSE)","v":50000},"MANAGER","Manager","India",{"$f":"VLOOKUP(Data!$J1390,tblCountries[[Actual]:[Mapping]],2,FALSE)","v":"USA"},"2 to 3 hours per day",0,"India"]
[null,"ID1777","2012-06-10T04:16:05",500000,500000,"INR",{"$f":"Data!$E1406*VLOOKUP(Data!$F1406,tblXrate[],2,FALSE)","v":41301.183967273726},"equity research trainee","Analyst","India",{"$f":"VLOOKUP(Data!$J1406,tblCountries[[Actual]:[Mapping]],2,FALSE)","v":"Canada"},"All the 8 hours baby, all the 8!",0,"India"]
[null,"ID1841","2012-06-14T04:22:36",40000,40000,"USD",{"$f":"Data!$E1462*VLOOKUP(Data!$F1462,tblXrate[],2,FALSE)","v":90000},"Rates Analyst","Analyst","USA",{"$f":"VLOOKUP(Data!$J1462,tblCountries[[Actual]:[Mapping]],2,FALSE)","v":"USA"},"2 to 3 hours per day",0,"USA"]
[null,"ID1850","2012-06-15T01:10:09",37500,37500,"USD",{"$f":"Data!$E1468*VLOOKUP(Data!$F1468,tblXrate[],2,FALSE)","v":58000},"consultant","Consultant","India",{"$f":"VLOOKUP(Data!$J1468,tblCountries[[Actual]:[Mapping]],2,FALSE)","v":"Canada"},"All the 8 hours baby, all the 8!",0,"India"]
[null,"ID1535","2012-05-31T10:54:48",1000,12000,"USD",{"$f":"Data!$E1818*VLOOKUP(Data!$F1818,tblXrate[],2,FALSE)","v":26000},"Associate Analyst","Analyst","MYS","Other Countries","2 to 3 hours per day",0,"MYS"]
[null,"ID1324","2012-05-29T15:49:41",314000,314000,"INR",{"$f":"Data!$E1046*VLOOKUP(Data!$F1046,tblXrate[],2,FALSE)","v":95856},"relationship manager","Manager","India",{"$f":"VLOOKUP(Data!$J1046,tblCountries[[Actual]:[Mapping]],2,FALSE)","v":"USA"},"1 or 2 hours a day",0.1,"India"]
[null,"ID1832","2012-06-13T17:22:47",15000,15000,"USD",{"$f":"Data!$E1453*VLOOKUP(Data!$F1453,tblXrate[],2,FALSE)","v":45000},"senior associate","Analyst","India",{"$f":"VLOOKUP(Data!$J1453,tblCountries[[Actual]:[Mapping]],2,FALSE)","v":"USA"},"2 to 3 hours per day",0.3,"India"]
[null,"ID1859","2012-06-15T15:07:11",700,8400,"USD",{"$f":"Data!$E1876*VLOOKUP(Data!$F1876,tblXrate[],2,FALSE)","v":108000},"Analyst","Analyst","Baltic","Other Countries","All the 8 hours baby, all the 8!",0.3,"Baltic"]
[null,"ID0919","2012-05-27T18:33:51","300000RS",300000,"INR",{"$f":"Data!$E750*VLOOKUP(Data!$F750,tblXrate[],2,FALSE)","v":173384.64158844808},"ANALYST","Analyst","India",{"$f":"VLOOKUP(Data!$J750,tblCountries[[Actual]:[Mapping]],2,FALSE)","v":"Australia"},"4 to 6 hours a day",0.5,"India"]
[null,"ID1326","2012-05-29T15:53:14",10000,10000,"USD",{"$f":"Data!$E1047*VLOOKUP(Data!$F1047,tblXrate[],2,FALSE)","v":64500},"MIS","Reporting","India",{"$f":"VLOOKUP(Data!$J1047,tblCountries[[Actual]:[Mapping]],2,FALSE)","v":"USA"},"1 or 2 hours a day",0.5,"India"]
[null,"ID1378","2012-05-29T21:17:26",50000,50000,"USD",{"$f":"Data!$E1089*VLOOKUP(Data!$F1089,tblXrate[],2,FALSE)","v":45000},"Engineering Intern","Engineer","USA",{"$f":"VLOOKUP(Data!$J1089,tblCountries[[Actual]:[Mapping]],2,FALSE)","v":"India"},"4 to 6 hours a day",0.5,"USA"]
[null,"ID1327","2012-05-29T16:07:59",9000,9000,"USD",{"$f":"Data!$E1048*VLOOKUP(Data!$F1048,tblXrate[],2,FALSE)","v":77000},"Data Analyst","Analyst","India",{"$f":"VLOOKUP(Data!$J1048,tblCountries[[Actual]:[Mapping]],2,FALSE)","v":"USA"},"All the 8 hours baby, all the 8!",0.6,"India"]
[null,"ID1172","2012-05-28T22:41:15",500000,500000,"INR",{"$f":"Data!$E936*VLOOKUP(Data!$F936,tblXrate[],2,FALSE)","v":60000},"Business Analyst","Analyst","India",{"$f":"VLOOKUP(Data!$J936,tblCountries[[Actual]:[Mapping]],2,FALSE)","v":"USA"},"4 to 6 hours a day",0.8,"India"]
[null,"ID0564","2012-05-26T06:14:13",27500,27500,"USD",{"$f":"Data!$E466*VLOOKUP(Data!$F466,tblXrate[],2,FALSE)","v":12465.541681209797},"Associate","Analyst","USA",{"$f":"VLOOKUP(Data!$J466,tblCountries[[Actual]:[Mapping]],2,FALSE)","v":"India"},"All the 8 hours baby, all the 8!",1,"USA"]
[null,"ID0626","2012-05-26T11:05:45",100000,100000,"AUD",{"$f":"Data!$E519*VLOOKUP(Data!$F519,tblXrate[],2,FALSE)","v":81592.772512210868},"Business Analyst","Analyst","Australia",{"$f":"VLOOKUP(Data!$J519,tblCountries[[Actual]:[Mapping]],2,FALSE)","v":"Australia"},"All the 8 hours baby, all the 8!",1,"Australia"]
[null,"ID0644","2012-05-26T11:47:38","25000 INR",300000,"INR",{"$f":"Data!$E536*VLOOKUP(Data!$F536,tblXrate[],2,FALSE)","v":21000},"MIS","Reporting","India",{"$f":"VLOOKUP(Data!$J536,tblCountries[[Actual]:[Mapping]],2,FALSE)","v":"India"},"4 to 6 hours a day",1,"India"]
[null,"ID0716","2012-05-26T14:23:48",500000,500000,"INR",{"$f":"Data!$E597*VLOOKUP(Data!$F597,tblXrate[],2,FALSE)","v":7265},"mis ","Reporting","India",{"$f":"VLOOKUP(Data!$J597,tblCountries[[Actual]:[Mapping]],2,FALSE)","v":"India"},"2 to 3 hours per day",1,"India"]
[null,"ID0728","2012-05-26T15:04:33","INR 390000 PA",390000,"INR",{"$f":"Data!$E607*VLOOKUP(Data!$F607,tblXrate[],2,FALSE)","v":5342.3750062327708},"Business Analyst","Analyst","India",{"$f":"VLOOKUP(Data!$J607,tblCountries[[Actual]:[Mapping]],2,FALSE)","v":"India"},"4 to 6 hours a day",1,"India"]
[null,"ID0762","2012-05-26T17:06:48",2000,24000,"USD",{"$f":"Data!$E634*VLOOKUP(Data!$F634,tblXrate[],2,FALSE)","v":28995},"Asst Production Planner","Analyst","India",{"$f":"VLOOKUP(Data!$J634,tblCountries[[Actual]:[Mapping]],2,FALSE)","v":"India"},"2 to 3 hours per day",1,"India"]
[null,"ID0786","2012-05-26T19:29:34",16000,16000,"USD",{"$f":"Data!$E652*VLOOKUP(Data!$F652,tblXrate[],2,FALSE)","v":39000},"Mis executiv","Reporting","India",{"$f":"VLOOKUP(Data!$J652,tblCountries[[Actual]:[Mapping]],2,FALSE)","v":"South Africa"},"All the 8 hours baby, all the 8!",1,"India"]
[null,"ID0818","2012-05-26T22:29:21",144000,144000,"INR",{"$f":"Data!$E680*VLOOKUP(Data!$F680,tblXrate[],2,FALSE)","v":8903.9583437212841},"BPO information process enabler","Analyst","India",{"$f":"VLOOKUP(Data!$J680,tblCountries[[Actual]:[Mapping]],2,FALSE)","v":"India"},"All the 8 hours baby, all the 8!",1,"India"]
[null,"ID0832","2012-05-26T23:14:58","5.5 lakhs",550000,"INR",{"$f":"Data!$E690*VLOOKUP(Data!$F690,tblXrate[],2,FALSE)","v":45000},"web analyst","Analyst","India",{"$f":"VLOOKUP(Data!$J690,tblCountries[[Actual]:[Mapping]],2,FALSE)","v":"USA"},"4 to 6 hours a day",1,"India"]
[null,"ID0840","2012-05-27T00:02:45",85000,85000,"USD",{"$f":"Data!$E696*VLOOKUP(Data!$F696,tblXrate[],2,FALSE)","v":95000},"actuary","Accountant","USA",{"$f":"VLOOKUP(Data!$J696,tblCountries[[Actual]:[Mapping]],2,FALSE)","v":"USA"},"All the 8 hours baby, all the 8!",1,"USA"]
[null,"ID0846","2012-05-27T00:53:20","2 lac",200000,"INR",{"$f":"Data!$E700*VLOOKUP(Data!$F700,tblXrate[],2,FALSE)","v":8547.8000099724322},"Bio-Statiscian","Reporting","India",{"$f":"VLOOKUP(Data!$J700,tblCountries[[Actual]:[Mapping]],2,FALSE)","v":"India"},"4 to 6 hours a day",1,"India"]
[null,"ID0847","2012-05-27T01:04:46",5000,5000,"USD",{"$f":"Data!$E701*VLOOKUP(Data!$F701,tblXrate[],2,FALSE)","v":17807.916687442568},"Management Intern","Manager","India",{"$f":"VLOOKUP(Data!$J701,tblCountries[[Actual]:[Mapping]],2,FALSE)","v":"India"},"4 to 6 hours a day",1,"India"]
[null,"ID0855","2012-05-27T03:16:05","Rs. 550000",550000,"INR",{"$f":"Data!$E707*VLOOKUP(Data!$F707,tblXrate[],2,FALSE)","v":12000},"Analyst","Analyst","India",{"$f":"VLOOKUP(Data!$J707,tblCountries[[Actual]:[Mapping]],2,FALSE)","v":"India"},"4 to 6 hours a day",1,"India"]
[null,"ID0856","2012-05-27T03:19:29",32000,32000,"USD",{"$f":"Data!$E708*VLOOKUP(Data!$F708,tblXrate[],2,FALSE)","v":49153.119414418252},"Reporting Manager","Manager","USA",{"$f":"VLOOKUP(Data!$J708,tblCountries[[Actual]:[Mapping]],2,FALSE)","v":"UK"},"4 to 6 hours a day",1,"USA"]
[null,"ID0879","2012-05-27T12:03:51",144000,144000,"INR",{"$f":"Data!$E722*VLOOKUP(Data!$F722,tblXrate[],2,FALSE)","v":53356.776437647524},"Cost Trainee","Analyst","India",{"$f":"VLOOKUP(Data!$J722,tblCountries[[Actual]:[Mapping]],2,FALSE)","v":"Germany"},"4 to 6 hours a day",1,"India"]
[null,"ID0888","2012-05-27T13:34:12",43000,43000,"USD",{"$f":"Data!$E728*VLOOKUP(Data!$F728,tblXrate[],2,FALSE)","v":40414},"Financial Analyst","Analyst","USA",{"$f":"VLOOKUP(Data!$J728,tblCountries[[Actual]:[Mapping]],2,FALSE)","v":"USA"},"4 to 6 hours a day",1,"USA"]
[null,"ID0937","2012-05-27T23:10:01","Rs.7,00,000",700000,"INR",{"$f":"Data!$E761*VLOOKUP(Data!$F761,tblXrate[],2,FALSE)","v":19000},"Business Analyst","Analyst","India",{"$f":"VLOOKUP(Data!$J761,tblCountries[[Actual]:[Mapping]],2,FALSE)","v":"UK"},"All the 8 hours baby, all the 8!",1,"India"]
[null,"ID0971","2012-05-28T06:52:05",43000,43000,"AUD",{"$f":"Data!$E780*VLOOKUP(Data!$F780,tblXrate[],2,FALSE)","v":40000},"Finance Officer","Manager","Australia",{"$f":"VLOOKUP(Data!$J780,tblCountries[[Actual]:[Mapping]],2,FALSE)","v":"USA"},"All the 8 hours baby, all the 8!",1,"Australia"]
[null,"ID1010","2012-05-28T11:11:53",650000,650000,"INR",{"$f":"Data!$E812*VLOOKUP(Data!$F812,tblXrate[],2,FALSE)","v":30500},"Ass Research  Manager","Manager","India",{"$f":"VLOOKUP(Data!$J812,tblCountries[[Actual]:[Mapping]],2,FALSE)","v":"Brazil"},"2 to 3 hours per day",1,"India"]
[null,"ID1069","2012-05-28T14:52:45","Rs. 25000",300000,"INR",{"$f":"Data!$E855*VLOOKUP(Data!$F855,tblXrate[],2,FALSE)","v":12821.700014958649},"Professional consultant-Finance","Consultant","India",{"$f":"VLOOKUP(Data!$J855,tblCountries[[Actual]:[Mapping]],2,FALSE)","v":"India"},"2 to 3 hours per day",1,"India"]
[null,"ID1083","2012-05-28T15:35:32",20000,20000,"GBP",{"$f":"Data!$E868*VLOOKUP(Data!$F868,tblXrate[],2,FALSE)","v":126094.26176538273},"finance assistant","Analyst","UK",{"$f":"VLOOKUP(Data!$J868,tblCountries[[Actual]:[Mapping]],2,FALSE)","v":"UK"},"4 to 6 hours a day",1,"UK"]
[null,"ID1086","2012-05-28T15:44:12","Â£63000",63000,"GBP",{"$f":"Data!$E871*VLOOKUP(Data!$F871,tblXrate[],2,FALSE)","v":57167.974754622352},"Business Improvement Specialist","Specialist","UK",{"$f":"VLOOKUP(Data!$J871,tblCountries[[Actual]:[Mapping]],2,FALSE)","v":"Netherlands"},"2 to 3 hours per day",1,"UK"]
[null,"ID1125","2012-05-28T17:38:46",210000,210000,"INR",{"$f":"Data!$E904*VLOOKUP(Data!$F904,tblXrate[],2,FALSE)","v":120000},"information Analyst","Analyst","India",{"$f":"VLOOKUP(Data!$J904,tblCountries[[Actual]:[Mapping]],2,FALSE)","v":"USA"},"All the 8 hours baby, all the 8!",1,"India"]
[null,"ID1183","2012-05-28T22:53:03",27840,27840,"USD",{"$f":"Data!$E945*VLOOKUP(Data!$F945,tblXrate[],2,FALSE)","v":60000},"Data Entry Clerk III","Analyst","USA",{"$f":"VLOOKUP(Data!$J945,tblCountries[[Actual]:[Mapping]],2,FALSE)","v":"Russia"},"2 to 3 hours per day",1,"USA"]
[null,"ID1207","2012-05-29T00:07:00",250000,250000,"INR",{"$f":"Data!$E962*VLOOKUP(Data!$F962,tblXrate[],2,FALSE)","v":36000},"Officer Production","Manager","India",{"$f":"VLOOKUP(Data!$J962,tblCountries[[Actual]:[Mapping]],2,FALSE)","v":"Kuwait"},"4 to 6 hours a day",1,"India"]
[null,"ID1229","2012-05-29T01:47:39",750,9000,"USD",{"$f":"Data!$E978*VLOOKUP(Data!$F978,tblXrate[],2,FALSE)","v":10684.750012465542},"assurance manager","Manager","India",{"$f":"VLOOKUP(Data!$J978,tblCountries[[Actual]:[Mapping]],2,FALSE)","v":"India"},"4 to 6 hours a day",1,"India"]
[null,"ID1234","2012-05-29T02:22:13",400000,400000,"INR",{"$f":"Data!$E983*VLOOKUP(Data!$F983,tblXrate[],2,FALSE)","v":10000},"Pmo","Manager","India",{"$f":"VLOOKUP(Data!$J983,tblCountries[[Actual]:[Mapping]],2,FALSE)","v":"India"},"4 to 6 hours a day",1,"India"]
[null,"ID1244","2012-05-29T04:25:02",56000,56000,"USD",{"$f":"Data!$E990*VLOOKUP(Data!$F990,tblXrate[],2,FALSE)","v":60000},"Accountant","Accountant","USA",{"$f":"VLOOKUP(Data!$J990,tblCountries[[Actual]:[Mapping]],2,FALSE)","v":"USA"},"4 to 6 hours a day",1,"USA"]
[null,"ID1252","2012-05-29T05:53:42","Â£25750",25750,"GBP",{"$f":"Data!$E995*VLOOKUP(Data!$F995,tblXrate[],2,FALSE)","v":10000},"Energy Analyst","Analyst","UK",{"$f":"VLOOKUP(Data!$J995,tblCountries[[Actual]:[Mapping]],2,FALSE)","v":"India"},"4 to 6 hours a day",1,"UK"]
[null,"ID1257","2012-05-29T07:28:41",20000,20000,"GBP",{"$f":"Data!$E999*VLOOKUP(Data!$F999,tblXrate[],2,FALSE)","v":78808.913603364199},"Environmental Information Analyst","Analyst","UK",{"$f":"VLOOKUP(Data!$J999,tblCountries[[Actual]:[Mapping]],2,FALSE)","v":"UK"},"4 to 6 hours a day",1,"UK"]
[null,"ID1297","2012-05-29T13:16:45",1000,12000,"USD",{"$f":"Data!$E1028*VLOOKUP(Data!$F1028,tblXrate[],2,FALSE)","v":18060},"excel prof","Consultant","pakistan",{"$f":"VLOOKUP(Data!$J1028,tblCountries[[Actual]:[Mapping]],2,FALSE)","v":"Philippines"},"4 to 6 hours a day",1,"Pakistan"]
[null,"ID1328","2012-05-29T16:08:40",9000,9000,"USD",{"$f":"Data!$E1049*VLOOKUP(Data!$F1049,tblXrate[],2,FALSE)","v":17807.916687442568},"Data Analyst","Analyst","India",{"$f":"VLOOKUP(Data!$J1049,tblCountries[[Actual]:[Mapping]],2,FALSE)","v":"India"},"4 to 6 hours a day",1,"India"]
[null,"ID1362","2012-05-29T19:10:05","27,000.GBP 42,353 USD ",27000,"GBP",{"$f":"Data!$E1075*VLOOKUP(Data!$F1075,tblXrate[],2,FALSE)","v":98000},"Engineering Tech","Engineer","UK",{"$f":"VLOOKUP(Data!$J1075,tblCountries[[Actual]:[Mapping]],2,FALSE)","v":"Indonesia"},"4 to 6 hours a day",1,"UK"]
[null,"ID1374","2012-05-29T20:20:21","$100,000 US",100000,"USD",{"$f":"Data!$E1085*VLOOKUP(Data!$F1085,tblXrate[],2,FALSE)","v":105000},"Senior Financial Analyst","Analyst","USA",{"$f":"VLOOKUP(Data!$J1085,tblCountries[[Actual]:[Mapping]],2,FALSE)","v":"USA"},"4 to 6 hours a day",1,"USA"]
[null,"ID1408","2012-05-29T23:13:32",55000,55000,"USD",{"$f":"Data!$E1116*VLOOKUP(Data!$F1116,tblXrate[],2,FALSE)","v":4451.9791718606421},"Risk Analyst","Analyst","USA",{"$f":"VLOOKUP(Data!$J1116,tblCountries[[Actual]:[Mapping]],2,FALSE)","v":"India"},"All the 8 hours baby, all the 8!",1,"USA"]
[null,"ID1409","2012-05-29T23:20:41",40000,40000,"USD",{"$f":"Data!$E1117*VLOOKUP(Data!$F1117,tblXrate[],2,FALSE)","v":44000},"Project Coordinator","Manager","USA",{"$f":"VLOOKUP(Data!$J1117,tblCountries[[Actual]:[Mapping]],2,FALSE)","v":"USA"},"4 to 6 hours a day",1,"USA"]
[null,"ID1423","2012-05-30T01:12:35","INR 750000",750000,"INR",{"$f":"Data!$E1129*VLOOKUP(Data!$F1129,tblXrate[],2,FALSE)","v":4273.9000049862161},"Associate - Indirect Tax","CXO or Top Mgmt.","India",{"$f":"VLOOKUP(Data!$J1129,tblCountries[[Actual]:[Mapping]],2,FALSE)","v":"India"},"1 or 2 hours a day",1,"India"]
[null,"ID1569","2012-06-01T01:29:02",46325,46325,"USD",{"$f":"Data!$E1244*VLOOKUP(Data!$F1244,tblXrate[],2,FALSE)","v":32311.654577379326},"Work Force Scheduler for Call Center","Controller","USA",{"$f":"VLOOKUP(Data!$J1244,tblCountries[[Actual]:[Mapping]],2,FALSE)","v":"UK"},"4 to 6 hours a day",1,"USA"]
[null,"ID1606","2012-06-01T22:20:26","20000 $",20000,"USD",{"$f":"Data!$E1272*VLOOKUP(Data!$F1272,tblXrate[],2,FALSE)","v":86689.804963700633},"Manager","Manager","India",{"$f":"VLOOKUP(Data!$J1272,tblCountries[[Actual]:[Mapping]],2,FALSE)","v":"UK"},"4 to 6 hours a day",1,"India"]
[null,"ID1611","2012-06-02T02:28:30",38000,38000,"USD",{"$f":"Data!$E1276*VLOOKUP(Data!$F1276,tblXrate[],2,FALSE)","v":127500},"Business Analyst","Analyst","USA",{"$f":"VLOOKUP(Data!$J1276,tblCountries[[Actual]:[Mapping]],2,FALSE)","v":"USA"},"All the 8 hours baby, all the 8!",1,"USA"]
[null,"ID1612","2012-06-02T03:08:50",1800000,1800000,"INR",{"$f":"Data!$E1277*VLOOKUP(Data!$F1277,tblXrate[],2,FALSE)","v":21000},"analyst","Analyst","India",{"$f":"VLOOKUP(Data!$J1277,tblCountries[[Actual]:[Mapping]],2,FALSE)","v":"India"},"All the 8 hours baby, all the 8!",1,"India"]
[null,"ID1615","2012-06-02T03:29:19","Â£21500Uk",21500,"GBP",{"$f":"Data!$E1280*VLOOKUP(Data!$F1280,tblXrate[],2,FALSE)","v":66199.48742682593},"Data Analyst","Analyst","UK",{"$f":"VLOOKUP(Data!$J1280,tblCountries[[Actual]:[Mapping]],2,FALSE)","v":"UK"},"All the 8 hours baby, all the 8!",1,"UK"]
[null,"ID1616","2012-06-02T04:49:42",60000,60000,"USD",{"$f":"Data!$E1281*VLOOKUP(Data!$F1281,tblXrate[],2,FALSE)","v":63807.047488395103},"Data Analyst","Analyst","USA",{"$f":"VLOOKUP(Data!$J1281,tblCountries[[Actual]:[Mapping]],2,FALSE)","v":"New Zealand"},"2 to 3 hours per day",1,"USA"]
[null,"ID1625","2012-06-02T18:47:32",7000,7000,"USD",{"$f":"Data!$E1288*VLOOKUP(Data!$F1288,tblXrate[],2,FALSE)","v":17807.916687442568},"M.I.S","Reporting","India",{"$f":"VLOOKUP(Data!$J1288,tblCountries[[Actual]:[Mapping]],2,FALSE)","v":"India"},"4 to 6 hours a day",1,"India"]
[null,"ID1630","2012-06-02T22:33:32",55000,55000,"USD",{"$f":"Data!$E1293*VLOOKUP(Data!$F1293,tblXrate[],2,FALSE)","v":50846},"Supply Chain Analyst","Analyst","USA",{"$f":"VLOOKUP(Data!$J1293,tblCountries[[Actual]:[Mapping]],2,FALSE)","v":"USA"},"4 to 6 hours a day",1,"USA"]
[null,"ID1653","2012-06-04T02:30:11",10000,10000,"USD",{"$f":"Data!$E1308*VLOOKUP(Data!$F1308,tblXrate[],2,FALSE)","v":8400},"ceo","CXO or Top Mgmt.","India",{"$f":"VLOOKUP(Data!$J1308,tblCountries[[Actual]:[Mapping]],2,FALSE)","v":"India"},"All the 8 hours baby, all the 8!",1,"India"]
[null,"ID1666","2012-06-04T21:43:15",56000,56000,"CAD",{"$f":"Data!$E1320*VLOOKUP(Data!$F1320,tblXrate[],2,FALSE)","v":53000},"consultant","Consultant","Canada",{"$f":"VLOOKUP(Data!$J1320,tblCountries[[Actual]:[Mapping]],2,FALSE)","v":"USA"},"All the 8 hours baby, all the 8!",1,"Canada"]
[null,"ID1680","2012-06-05T05:03:04",1000,12000,"USD",{"$f":"Data!$E1328*VLOOKUP(Data!$F1328,tblXrate[],2,FALSE)","v":150000},"Waiter","Analyst","USA",{"$f":"VLOOKUP(Data!$J1328,tblCountries[[Actual]:[Mapping]],2,FALSE)","v":"USA"},"2 to 3 hours per day",1,"USA"]
[null,"ID1705","2012-06-06T02:11:58","US$60000",60000,"USD",{"$f":"Data!$E1345*VLOOKUP(Data!$F1345,tblXrate[],2,FALSE)","v":12227.430201752599},"Analyst","Analyst","USA",{"$f":"VLOOKUP(Data!$J1345,tblCountries[[Actual]:[Mapping]],2,FALSE)","v":"Pakistan"},"All the 8 hours baby, all the 8!",1,"USA"]
[null,"ID1712","2012-06-06T08:25:56",42000,42000,"USD",{"$f":"Data!$E1351*VLOOKUP(Data!$F1351,tblXrate[],2,FALSE)","v":50000},"Staff Accountant","Accountant","USA",{"$f":"VLOOKUP(Data!$J1351,tblCountries[[Actual]:[Mapping]],2,FALSE)","v":"India"},"4 to 6 hours a day",1,"USA"]
[null,"ID1747","2012-06-08T03:34:51",30000,30000,"USD",{"$f":"Data!$E1381*VLOOKUP(Data!$F1381,tblXrate[],2,FALSE)","v":28371.208897211112},"Inventory Manager","Manager","USA",{"$f":"VLOOKUP(Data!$J1381,tblCountries[[Actual]:[Mapping]],2,FALSE)","v":"UK"},"4 to 6 hours a day",1,"USA"]
[null,"ID1749","2012-06-08T06:42:32",75000,75000,"USD",{"$f":"Data!$E1383*VLOOKUP(Data!$F1383,tblXrate[],2,FALSE)","v":41000},"actuary","Accountant","USA",{"$f":"VLOOKUP(Data!$J1383,tblCountries[[Actual]:[Mapping]],2,FALSE)","v":"USA"},"All the 8 hours baby, all the 8!",1,"USA"]
[null,"ID1785","2012-06-11T03:11:39",150000,150000,"INR",{"$f":"Data!$E1412*VLOOKUP(Data!$F1412,tblXrate[],2,FALSE)","v":24000},"ENGINEER","Engineer","India",{"$f":"VLOOKUP(Data!$J1412,tblCountries[[Actual]:[Mapping]],2,FALSE)","v":"USA"},"2 to 3 hours per day",1,"India"]
[null,"ID1790","2012-06-11T17:01:58","Rs 480000",480000,"INR",{"$f":"Data!$E1417*VLOOKUP(Data!$F1417,tblXrate[],2,FALSE)","v":80000},"Development Analyst","Analyst","India",{"$f":"VLOOKUP(Data!$J1417,tblCountries[[Actual]:[Mapping]],2,FALSE)","v":"USA"},"4 to 6 hours a day",1,"India"]
[null,"ID1795","2012-06-11T21:29:29",300,3600,"USD",{"$f":"Data!$E1421*VLOOKUP(Data!$F1421,tblXrate[],2,FALSE)","v":57400},"Analyst","Analyst","India",{"$f":"VLOOKUP(Data!$J1421,tblCountries[[Actual]:[Mapping]],2,FALSE)","v":"USA"},"4 to 6 hours a day",1,"India"]
[null,"ID1800","2012-06-12T01:55:12",40000,40000,"CAD",{"$f":"Data!$E1424*VLOOKUP(Data!$F1424,tblXrate[],2,FALSE)","v":50000},"Machine Scheduler","Analyst","Canada",{"$f":"VLOOKUP(Data!$J1424,tblCountries[[Actual]:[Mapping]],2,FALSE)","v":"USA"},"1 or 2 hours a day",1,"Canada"]
[null,"ID1814","2012-06-12T18:28:39",32000,32000,"GBP",{"$f":"Data!$E1438*VLOOKUP(Data!$F1438,tblXrate[],2,FALSE)","v":12000},"Financial Analyst","Analyst","UK",{"$f":"VLOOKUP(Data!$J1438,tblCountries[[Actual]:[Mapping]],2,FALSE)","v":"Pakistan"},"All the 8 hours baby, all the 8!",1,"UK"]
[null,"ID1851","2012-06-15T02:24:44",40000,40000,"USD",{"$f":"Data!$E1469*VLOOKUP(Data!$F1469,tblXrate[],2,FALSE)","v":55000},"Research Support Specialist","Specialist","USA",{"$f":"VLOOKUP(Data!$J1469,tblCountries[[Actual]:[Mapping]],2,FALSE)","v":"USA"},"4 to 6 hours a day",1,"USA"]
[null,"ID1855","2012-06-15T05:44:30",29000,29000,"USD",{"$f":"Data!$E1472*VLOOKUP(Data!$F1472,tblXrate[],2,FALSE)","v":105219.68296424497},"Customer Experence Engineer","Engineer","USA",{"$f":"VLOOKUP(Data!$J1472,tblCountries[[Actual]:[Mapping]],2,FALSE)","v":"Canada"},"All the 8 hours baby, all the 8!",1,"USA"]
[null,"ID1857","2012-06-15T09:00:08",48000,48000,"USD",{"$f":"Data!$E1473*VLOOKUP(Data!$F1473,tblXrate[],2,FALSE)","v":22880},"Accountant","Accountant","USA",{"$f":"VLOOKUP(Data!$J1473,tblCountries[[Actual]:[Mapping]],2,FALSE)","v":"USA"},"4 to 6 hours a day",1,"USA"]
[null,"ID1858","2012-06-15T09:01:23",48000,48000,"USD",{"$f":"Data!$E1474*VLOOKUP(Data!$F1474,tblXrate[],2,FALSE)","v":80000},"Accountant","Accountant","USA",{"$f":"VLOOKUP(Data!$J1474,tblCountries[[Actual]:[Mapping]],2,FALSE)","v":"USA"},"4 to 6 hours a day",1,"USA"]
[null,"ID1875","2012-06-16T08:10:59","63000 USD",63000,"USD",{"$f":"Data!$E1487*VLOOKUP(Data!$F1487,tblXrate[],2,FALSE)","v":41406},"Financial Analyst","Analyst","USA",{"$f":"VLOOKUP(Data!$J1487,tblCountries[[Actual]:[Mapping]],2,FALSE)","v":"Canada"},"All the 8 hours baby, all the 8!",1,"USA"]
[null,"ID1891","2012-06-18T06:14:35",46000,46000,"USD",{"$f":"Data!$E1499*VLOOKUP(Data!$F1499,tblXrate[],2,FALSE)","v":67000},"AML Analyst","Analyst","USA",{"$f":"VLOOKUP(Data!$J1499,tblCountries[[Actual]:[Mapping]],2,FALSE)","v":"USA"},"All the 8 hours baby, all the 8!",1,"USA"]
[null,"ID1911","2012-06-19T21:32:36",48000,48000,"USD",{"$f":"Data!$E1517*VLOOKUP(Data!$F1517,tblXrate[],2,FALSE)","v":80000},"Marketing Analyst Co-op","Analyst","USA",{"$f":"VLOOKUP(Data!$J1517,tblCountries[[Actual]:[Mapping]],2,FALSE)","v":"USA"},"4 to 6 hours a day",1,"USA"]
[null,"ID0648","2012-05-26T11:58:23",8000,8000,"USD",{"$f":"Data!$E1632*VLOOKUP(Data!$F1632,tblXrate[],2,FALSE)","v":6588.9291743537506},"Quality officer","Manager","bangkok","Other Countries","All the 8 hours baby, all the 8!",1,"Thailand"]
[null,"ID0673","2012-05-26T12:54:36",15000,15000,"USD",{"$f":"Data!$E1635*VLOOKUP(Data!$F1635,tblXrate[],2,FALSE)","v":56000},"TA","Analyst","Indonesia","Other Countries","4 to 6 hours a day",1,"Indonesia"]
[null,"ID1510","2012-05-31T01:09:06","US$ 10000",10000,"USD",{"$f":"Data!$E1815*VLOOKUP(Data!$F1815,tblXrate[],2,FALSE)","v":100000},"Trainee","Analyst","Brazil","Other Countries","4 to 6 hours a day",1,"Brazil"]
[null,"ID1831","2012-06-13T11:58:30",20000,20000,"USD",{"$f":"Data!$E1871*VLOOKUP(Data!$F1871,tblXrate[],2,FALSE)","v":5250},"Personal Assistant","Analyst","Hong Kong","Other Countries","1 or 2 hours a day",1,"Hong Kong"]
[null,"ID1853","2012-06-15T03:00:04",30000,30000,"USD",{"$f":"Data!$E1875*VLOOKUP(Data!$F1875,tblXrate[],2,FALSE)","v":131675.52225194403},"Trainee","Analyst","Brazil","Other Countries","2 to 3 hours per day",1,"Brazil"]
[null,"ID0826","2012-05-26T23:02:00","INR 1700000",1700000,"INR",{"$f":"Data!$E685*VLOOKUP(Data!$F685,tblXrate[],2,FALSE)","v":7960},"Operations Lead","Manager","India",{"$f":"VLOOKUP(Data!$J685,tblCountries[[Actual]:[Mapping]],2,FALSE)","v":"India"},"All the 8 hours baby, all the 8!",1.1000000000000001,"India"]
[null,"ID0640","2012-05-26T11:40:34","4000000 INR",4000000,"INR",{"$f":"Data!$E532*VLOOKUP(Data!$F532,tblXrate[],2,FALSE)","v":45000},"Senior Executive","Manager","India",{"$f":"VLOOKUP(Data!$J532,tblCountries[[Actual]:[Mapping]],2,FALSE)","v":"USA"},"4 to 6 hours a day",1.5,"India"]
[null,"ID0747","2012-05-26T16:12:09","GBP21798",21798,"GBP",{"$f":"Data!$E622*VLOOKUP(Data!$F622,tblXrate[],2,FALSE)","v":145000},"Data Analyst","Analyst","UK",{"$f":"VLOOKUP(Data!$J622,tblCountries[[Actual]:[Mapping]],2,FALSE)","v":"USA"},"All the 8 hours baby, all the 8!",1.5,"UK"]
[null,"ID0792","2012-05-26T20:20:34","Rs 450000",450000,"INR",{"$f":"Data!$E658*VLOOKUP(Data!$F658,tblXrate[],2,FALSE)","v":100000},"Material Planner","Manager","India",{"$f":"VLOOKUP(Data!$J658,tblCountries[[Actual]:[Mapping]],2,FALSE)","v":"Russia"},"All the 8 hours baby, all the 8!",1.5,"India"]
[null,"ID0972","2012-05-28T06:52:05",45616,45616,"USD",{"$f":"Data!$E781*VLOOKUP(Data!$F781,tblXrate[],2,FALSE)","v":15000},"Assistant Fleet Analyst","Analyst","Australia",{"$f":"VLOOKUP(Data!$J781,tblCountries[[Actual]:[Mapping]],2,FALSE)","v":"USA"},"4 to 6 hours a day",1.5,"Australia"]
[null,"ID1184","2012-05-28T22:54:24","Rs. 350000",350000,"INR",{"$f":"Data!$E946*VLOOKUP(Data!$F946,tblXrate[],2,FALSE)","v":19055.991584874118},"officer accounts","Accountant","India",{"$f":"VLOOKUP(Data!$J946,tblCountries[[Actual]:[Mapping]],2,FALSE)","v":"Spain"},"2 to 3 hours per day",1.5,"India"]
[null,"ID1204","2012-05-29T00:00:21",61000,61000,"USD",{"$f":"Data!$E959*VLOOKUP(Data!$F959,tblXrate[],2,FALSE)","v":72000},"Financial Analyst","Analyst","USA",{"$f":"VLOOKUP(Data!$J959,tblCountries[[Actual]:[Mapping]],2,FALSE)","v":"New Zealand"},"4 to 6 hours a day",1.5,"USA"]
[null,"ID1301","2012-05-29T13:40:09","3.5 lakhs p.a",350000,"INR",{"$f":"Data!$E1030*VLOOKUP(Data!$F1030,tblXrate[],2,FALSE)","v":25407.988779832154},"I dont know","Analyst","India",{"$f":"VLOOKUP(Data!$J1030,tblCountries[[Actual]:[Mapping]],2,FALSE)","v":"Greece"},"4 to 6 hours a day",1.5,"India"]
[null,"ID1444","2012-05-30T10:40:24",75000,75000,"USD",{"$f":"Data!$E1149*VLOOKUP(Data!$F1149,tblXrate[],2,FALSE)","v":38111.983169748237},"Business Analyst","Analyst","USA",{"$f":"VLOOKUP(Data!$J1149,tblCountries[[Actual]:[Mapping]],2,FALSE)","v":"Belgium"},"2 to 3 hours per day",1.5,"USA"]
[null,"ID1520","2012-05-31T04:12:19",75000,75000,"USD",{"$f":"Data!$E1206*VLOOKUP(Data!$F1206,tblXrate[],2,FALSE)","v":50000},"Financial Analyst","Analyst","USA",{"$f":"VLOOKUP(Data!$J1206,tblCountries[[Actual]:[Mapping]],2,FALSE)","v":"India"},"All the 8 hours baby, all the 8!",1.5,"USA"]
[null,"ID1886","2012-06-17T12:00:57",25000,25000,"USD",{"$f":"Data!$E1496*VLOOKUP(Data!$F1496,tblXrate[],2,FALSE)","v":28000},"Data Analyst","Analyst","India",{"$f":"VLOOKUP(Data!$J1496,tblCountries[[Actual]:[Mapping]],2,FALSE)","v":"USA"},"All the 8 hours baby, all the 8!",1.5,"India"]
[null,"ID1703","2012-06-06T01:26:56","38920EUR",38920,"EUR",{"$f":"Data!$E1855*VLOOKUP(Data!$F1855,tblXrate[],2,FALSE)","v":15000},"functional analyst","Analyst","Belgium","Other Countries","4 to 6 hours a day",1.5,"Belgium"]
[null,"ID1474","2012-05-30T17:01:10",230000,230000,"INR",{"$f":"Data!$E1172*VLOOKUP(Data!$F1172,tblXrate[],2,FALSE)","v":41768.724209783031},"Process Assocaite","Analyst","India",{"$f":"VLOOKUP(Data!$J1172,tblCountries[[Actual]:[Mapping]],2,FALSE)","v":"UK"},"4 to 6 hours a day",1.6,"India"]
[null,"ID1916","2012-06-20T01:20:49",250000,250000,"INR",{"$f":"Data!$E1521*VLOOKUP(Data!$F1521,tblXrate[],2,FALSE)","v":6232.7708406048987},"research associate","Analyst","India",{"$f":"VLOOKUP(Data!$J1521,tblCountries[[Actual]:[Mapping]],2,FALSE)","v":"India"},"Excel ?!? What Excel?",1.6,"India"]
[null,"ID0567","2012-05-26T06:40:59",45000,45000,"USD",{"$f":"Data!$E469*VLOOKUP(Data!$F469,tblXrate[],2,FALSE)","v":7000},"Workflow Analyst","Analyst","USA",{"$f":"VLOOKUP(Data!$J469,tblCountries[[Actual]:[Mapping]],2,FALSE)","v":"India"},"4 to 6 hours a day",2,"USA"]
[null,"ID0639","2012-05-26T11:39:48","Rs 300000",300000,"INR",{"$f":"Data!$E531*VLOOKUP(Data!$F531,tblXrate[],2,FALSE)","v":40000},"Planning Engineer","Engineer","India",{"$f":"VLOOKUP(Data!$J531,tblCountries[[Actual]:[Mapping]],2,FALSE)","v":"India"},"All the 8 hours baby, all the 8!",2,"India"]
[null,"ID0658","2012-05-26T12:26:33",15000,15000,"USD",{"$f":"Data!$E548*VLOOKUP(Data!$F548,tblXrate[],2,FALSE)","v":42000},"MIS Executive","Reporting","India",{"$f":"VLOOKUP(Data!$J548,tblCountries[[Actual]:[Mapping]],2,FALSE)","v":"Kuwait"},"All the 8 hours baby, all the 8!",2,"India"]
[null,"ID0659","2012-05-26T12:27:20",200000,200000,"PKR",{"$f":"Data!$E549*VLOOKUP(Data!$F549,tblXrate[],2,FALSE)","v":60000},"Accounts Officer","Accountant","Pakistan",{"$f":"VLOOKUP(Data!$J549,tblCountries[[Actual]:[Mapping]],2,FALSE)","v":"Finland"},"2 to 3 hours per day",2,"Pakistan"]
[null,"ID0684","2012-05-26T13:11:01","Rs. 260000",260000,"INR",{"$f":"Data!$E569*VLOOKUP(Data!$F569,tblXrate[],2,FALSE)","v":57875.729234188344},"Analyst","Analyst","India",{"$f":"VLOOKUP(Data!$J569,tblCountries[[Actual]:[Mapping]],2,FALSE)","v":"India"},"4 to 6 hours a day",2,"India"]
[null,"ID0692","2012-05-26T13:24:05","4500 rs. per month",648000,"INR",{"$f":"Data!$E576*VLOOKUP(Data!$F576,tblXrate[],2,FALSE)","v":80135.625093491559},"COMPUTER OPERATOR","Analyst","India",{"$f":"VLOOKUP(Data!$J576,tblCountries[[Actual]:[Mapping]],2,FALSE)","v":"India"},"All the 8 hours baby, all the 8!",2,"India"]
[null,"ID0702","2012-05-26T13:46:52","370000 inr",370000,"INR",{"$f":"Data!$E585*VLOOKUP(Data!$F585,tblXrate[],2,FALSE)","v":8013.5625093491553},"Operations Analyst","Analyst","India",{"$f":"VLOOKUP(Data!$J585,tblCountries[[Actual]:[Mapping]],2,FALSE)","v":"India"},"All the 8 hours baby, all the 8!",2,"India"]
[null,"ID0703","2012-05-26T13:47:06","370000 inr",370000,"INR",{"$f":"Data!$E586*VLOOKUP(Data!$F586,tblXrate[],2,FALSE)","v":13000},"Operations Analyst","Analyst","India",{"$f":"VLOOKUP(Data!$J586,tblCountries[[Actual]:[Mapping]],2,FALSE)","v":"India"},"All the 8 hours baby, all the 8!",2,"India"]
[null,"ID0706","2012-05-26T14:01:00",600000,600000,"INR",{"$f":"Data!$E589*VLOOKUP(Data!$F589,tblXrate[],2,FALSE)","v":75010},"senior executive","Manager","India",{"$f":"VLOOKUP(Data!$J589,tblCountries[[Actual]:[Mapping]],2,FALSE)","v":"USA"},"1 or 2 hours a day",2,"India"]
[null,"ID0707","2012-05-26T14:01:09",10000,10000,"USD",{"$f":"Data!$E590*VLOOKUP(Data!$F590,tblXrate[],2,FALSE)","v":8654.6475100970874},"Executive","Manager","India",{"$f":"VLOOKUP(Data!$J590,tblCountries[[Actual]:[Mapping]],2,FALSE)","v":"India"},"4 to 6 hours a day",2,"India"]
[null,"ID0713","2012-05-26T14:18:11",636000,636000,"INR",{"$f":"Data!$E596*VLOOKUP(Data!$F596,tblXrate[],2,FALSE)","v":11397.066679963244},"Audit Manager","Manager","India",{"$f":"VLOOKUP(Data!$J596,tblCountries[[Actual]:[Mapping]],2,FALSE)","v":"India"},"4 to 6 hours a day",2,"India"]
[null,"ID0717","2012-05-26T14:33:11",500000,500000,"INR",{"$f":"Data!$E598*VLOOKUP(Data!$F598,tblXrate[],2,FALSE)","v":6720},"Engineer","Engineer","India",{"$f":"VLOOKUP(Data!$J598,tblCountries[[Actual]:[Mapping]],2,FALSE)","v":"India"},"All the 8 hours baby, all the 8!",2,"India"]
[null,"ID0723","2012-05-26T14:57:45","PKR 17000",204000,"PKR",{"$f":"Data!$E603*VLOOKUP(Data!$F603,tblXrate[],2,FALSE)","v":3561.5833374885137},"Accounts Manager","Manager","Pakistan",{"$f":"VLOOKUP(Data!$J603,tblCountries[[Actual]:[Mapping]],2,FALSE)","v":"India"},"All the 8 hours baby, all the 8!",2,"Pakistan"]
[null,"ID0744","2012-05-26T16:01:54",15000,15000,"USD",{"$f":"Data!$E619*VLOOKUP(Data!$F619,tblXrate[],2,FALSE)","v":6410.8500074793246},"PROCSS ASOCIATE","Controller","India",{"$f":"VLOOKUP(Data!$J619,tblCountries[[Actual]:[Mapping]],2,FALSE)","v":"India"},"2 to 3 hours per day",2,"India"]
[null,"ID0766","2012-05-26T17:10:20",120000,120000,"INR",{"$f":"Data!$E636*VLOOKUP(Data!$F636,tblXrate[],2,FALSE)","v":16027.125018698311},"ACCOUNTANT","Accountant","India",{"$f":"VLOOKUP(Data!$J636,tblCountries[[Actual]:[Mapping]],2,FALSE)","v":"India"},"2 to 3 hours per day",2,"India"]
[null,"ID0775","2012-05-26T18:19:49","2.2 lakhs per annum",220000,"INR",{"$f":"Data!$E643*VLOOKUP(Data!$F643,tblXrate[],2,FALSE)","v":8400},"Associate Software Engineer","Engineer","India",{"$f":"VLOOKUP(Data!$J643,tblCountries[[Actual]:[Mapping]],2,FALSE)","v":"India"},"4 to 6 hours a day",2,"India"]
[null,"ID0794","2012-05-26T20:31:30","ONE LACK FIFTY THOUSAND(INR)",150000,"INR",{"$f":"Data!$E660*VLOOKUP(Data!$F660,tblXrate[],2,FALSE)","v":76223.966339496474},"WORKING WITH PRODUCT TEAM OF MAKEMYTRIP.COM","Analyst","India",{"$f":"VLOOKUP(Data!$J660,tblCountries[[Actual]:[Mapping]],2,FALSE)","v":"Germany"},"4 to 6 hours a day",2,"India"]
[null,"ID0805","2012-05-26T21:27:01",850000,850000,"INR",{"$f":"Data!$E669*VLOOKUP(Data!$F669,tblXrate[],2,FALSE)","v":14246.333349954055},"Senior Research Analyst","Analyst","India",{"$f":"VLOOKUP(Data!$J669,tblCountries[[Actual]:[Mapping]],2,FALSE)","v":"India"},"4 to 6 hours a day",2,"India"]
[null,"ID0809","2012-05-26T21:56:36",170000,170000,"INR",{"$f":"Data!$E673*VLOOKUP(Data!$F673,tblXrate[],2,FALSE)","v":20000},"Sr. Executive MIS","Reporting","India",{"$f":"VLOOKUP(Data!$J673,tblCountries[[Actual]:[Mapping]],2,FALSE)","v":"India"},"4 to 6 hours a day",2,"India"]
[null,"ID0830","2012-05-26T23:04:53",42000,42000,"EUR",{"$f":"Data!$E688*VLOOKUP(Data!$F688,tblXrate[],2,FALSE)","v":55000},"Project Engineer","Engineer","The Netherlands",{"$f":"VLOOKUP(Data!$J688,tblCountries[[Actual]:[Mapping]],2,FALSE)","v":"USA"},"4 to 6 hours a day",2,"Netherlands"]
[null,"ID0842","2012-05-27T00:12:53",30000,30000,"USD",{"$f":"Data!$E697*VLOOKUP(Data!$F697,tblXrate[],2,FALSE)","v":94570.696324037053},"MIS Executive","Reporting","India",{"$f":"VLOOKUP(Data!$J697,tblCountries[[Actual]:[Mapping]],2,FALSE)","v":"UK"},"4 to 6 hours a day",2,"India"]
[null,"ID0848","2012-05-27T01:22:06","INR 2,00,000",200000,"INR",{"$f":"Data!$E702*VLOOKUP(Data!$F702,tblXrate[],2,FALSE)","v":127488.70705032947},"Sales Analyst","Analyst","India",{"$f":"VLOOKUP(Data!$J702,tblCountries[[Actual]:[Mapping]],2,FALSE)","v":"Australia"},"4 to 6 hours a day",2,"India"]
[null,"ID0859","2012-05-27T03:37:32","3000 $",3000,"USD",{"$f":"Data!$E711*VLOOKUP(Data!$F711,tblXrate[],2,FALSE)","v":52801.972114254015},"Statistical Analyst","Analyst","Pakistan",{"$f":"VLOOKUP(Data!$J711,tblCountries[[Actual]:[Mapping]],2,FALSE)","v":"UK"},"2 to 3 hours per day",2,"Pakistan"]
[null,"ID0867","2012-05-27T06:17:41",40000,40000,"USD",{"$f":"Data!$E715*VLOOKUP(Data!$F715,tblXrate[],2,FALSE)","v":30000},"IT Capacity Planner","Analyst","USA",{"$f":"VLOOKUP(Data!$J715,tblCountries[[Actual]:[Mapping]],2,FALSE)","v":"Indonesia"},"All the 8 hours baby, all the 8!",2,"USA"]
[null,"ID0912","2012-05-27T16:30:54",775000,775000,"INR",{"$f":"Data!$E745*VLOOKUP(Data!$F745,tblXrate[],2,FALSE)","v":10684.750012465542},"Analyst","Analyst","India",{"$f":"VLOOKUP(Data!$J745,tblCountries[[Actual]:[Mapping]],2,FALSE)","v":"India"},"4 to 6 hours a day",2,"India"]
[null,"ID0946","2012-05-28T00:28:56","Rs 40000",480000,"INR",{"$f":"Data!$E765*VLOOKUP(Data!$F765,tblXrate[],2,FALSE)","v":70000},"Manager","Manager","India",{"$f":"VLOOKUP(Data!$J765,tblCountries[[Actual]:[Mapping]],2,FALSE)","v":"USA"},"2 to 3 hours per day",2,"India"]
[null,"ID0967","2012-05-28T05:51:20",15000,15000,"USD",{"$f":"Data!$E776*VLOOKUP(Data!$F776,tblXrate[],2,FALSE)","v":45000},"Quality Executive","Analyst","India",{"$f":"VLOOKUP(Data!$J776,tblCountries[[Actual]:[Mapping]],2,FALSE)","v":"USA"},"2 to 3 hours per day",2,"India"]
[null,"ID0974","2012-05-28T07:21:12",56600,56600,"AUD",{"$f":"Data!$E782*VLOOKUP(Data!$F782,tblXrate[],2,FALSE)","v":6410.8500074793246},"Operations Coordinator","Manager","Australia",{"$f":"VLOOKUP(Data!$J782,tblCountries[[Actual]:[Mapping]],2,FALSE)","v":"India"},"2 to 3 hours per day",2,"Australia"]
[null,"ID0975","2012-05-28T07:23:07",20000,20000,"USD",{"$f":"Data!$E783*VLOOKUP(Data!$F783,tblXrate[],2,FALSE)","v":85000},"data analyst","Analyst","Australia",{"$f":"VLOOKUP(Data!$J783,tblCountries[[Actual]:[Mapping]],2,FALSE)","v":"USA"},"2 to 3 hours per day",2,"Australia"]
[null,"ID0989","2012-05-28T08:41:13",120000,120000,"AUD",{"$f":"Data!$E795*VLOOKUP(Data!$F795,tblXrate[],2,FALSE)","v":11000},"analyst","Analyst","Australia",{"$f":"VLOOKUP(Data!$J795,tblCountries[[Actual]:[Mapping]],2,FALSE)","v":"India"},"4 to 6 hours a day",2,"Australia"]
[null,"ID1012","2012-05-28T11:33:05","AUD$70,000",70000,"AUD",{"$f":"Data!$E814*VLOOKUP(Data!$F814,tblXrate[],2,FALSE)","v":17807.916687442568},"Director","CXO or Top Mgmt.","Australia",{"$f":"VLOOKUP(Data!$J814,tblCountries[[Actual]:[Mapping]],2,FALSE)","v":"India"},"All the 8 hours baby, all the 8!",2,"Australia"]
[null,"ID1034","2012-05-28T13:01:42","PK RS 456000",456000,"PKR",{"$f":"Data!$E830*VLOOKUP(Data!$F830,tblXrate[],2,FALSE)","v":70000},"Strategic Planning Executive","Manager","Pakistan",{"$f":"VLOOKUP(Data!$J830,tblCountries[[Actual]:[Mapping]],2,FALSE)","v":"USA"},"4 to 6 hours a day",2,"Pakistan"]
[null,"ID1054","2012-05-28T14:12:52","Rs. 1200000",1200000,"INR",{"$f":"Data!$E844*VLOOKUP(Data!$F844,tblXrate[],2,FALSE)","v":33099.743713412965},"Management Trainee","Manager","India",{"$f":"VLOOKUP(Data!$J844,tblCountries[[Actual]:[Mapping]],2,FALSE)","v":"UK"},"2 to 3 hours per day",2,"India"]
[null,"ID1133","2012-05-28T18:05:16","Â£15000",15000,"GBP",{"$f":"Data!$E909*VLOOKUP(Data!$F909,tblXrate[],2,FALSE)","v":87712.230450626681},"MI Specialist","Reporting","UK",{"$f":"VLOOKUP(Data!$J909,tblCountries[[Actual]:[Mapping]],2,FALSE)","v":"Australia"},"All the 8 hours baby, all the 8!",2,"UK"]
[null,"ID1139","2012-05-28T18:40:08",400000,400000,"INR",{"$f":"Data!$E912*VLOOKUP(Data!$F912,tblXrate[],2,FALSE)","v":45000},"software engineer","Engineer","India",{"$f":"VLOOKUP(Data!$J912,tblCountries[[Actual]:[Mapping]],2,FALSE)","v":"USA"},"1 or 2 hours a day",2,"India"]
[null,"ID1145","2012-05-28T19:23:29",40000,40000,"USD",{"$f":"Data!$E917*VLOOKUP(Data!$F917,tblXrate[],2,FALSE)","v":72768.752704244194},"Engineer","Engineer","India",{"$f":"VLOOKUP(Data!$J917,tblCountries[[Actual]:[Mapping]],2,FALSE)","v":"Canada"},"2 to 3 hours per day",2,"India"]
[null,"ID1163","2012-05-28T22:13:24",8600,8600,"USD",{"$f":"Data!$E929*VLOOKUP(Data!$F929,tblXrate[],2,FALSE)","v":63000},"Catlog associates","Analyst","India",{"$f":"VLOOKUP(Data!$J929,tblCountries[[Actual]:[Mapping]],2,FALSE)","v":"USA"},"4 to 6 hours a day",2,"India"]
[null,"ID1181","2012-05-28T22:51:27",31763,31763,"GBP",{"$f":"Data!$E943*VLOOKUP(Data!$F943,tblXrate[],2,FALSE)","v":36000},"Network Administrator","Analyst","UK",{"$f":"VLOOKUP(Data!$J943,tblCountries[[Actual]:[Mapping]],2,FALSE)","v":"Russia"},"2 to 3 hours per day",2,"UK"]
[null,"ID1194","2012-05-28T23:17:31",56000,56000,"USD",{"$f":"Data!$E951*VLOOKUP(Data!$F951,tblXrate[],2,FALSE)","v":60000},"Analyst","Analyst","USA",{"$f":"VLOOKUP(Data!$J951,tblCountries[[Actual]:[Mapping]],2,FALSE)","v":"Singapore"},"1 or 2 hours a day",2,"USA"]
[null,"ID1198","2012-05-28T23:33:59",88000,88000,"USD",{"$f":"Data!$E954*VLOOKUP(Data!$F954,tblXrate[],2,FALSE)","v":55262.375596134938},"Manager, Strategy & Insights","Manager","USA",{"$f":"VLOOKUP(Data!$J954,tblCountries[[Actual]:[Mapping]],2,FALSE)","v":"Spain"},"4 to 6 hours a day",2,"USA"]
[null,"ID1223","2012-05-29T01:19:26","INR 450000",450000,"INR",{"$f":"Data!$E974*VLOOKUP(Data!$F974,tblXrate[],2,FALSE)","v":10684.750012465542},"ASSISTANT MANAGER","Manager","India",{"$f":"VLOOKUP(Data!$J974,tblCountries[[Actual]:[Mapping]],2,FALSE)","v":"India"},"All the 8 hours baby, all the 8!",2,"India"]
[null,"ID1232","2012-05-29T02:12:32","Â£26000",26000,"GBP",{"$f":"Data!$E981*VLOOKUP(Data!$F981,tblXrate[],2,FALSE)","v":3561.5833374885137},"Business Analyst","Analyst","UK",{"$f":"VLOOKUP(Data!$J981,tblCountries[[Actual]:[Mapping]],2,FALSE)","v":"India"},"4 to 6 hours a day",2,"UK"]
[null,"ID1274","2012-05-29T09:52:02","48000 $AUD",48000,"AUD",{"$f":"Data!$E1011*VLOOKUP(Data!$F1011,tblXrate[],2,FALSE)","v":64000},"Research Assistant","Analyst","Australia",{"$f":"VLOOKUP(Data!$J1011,tblCountries[[Actual]:[Mapping]],2,FALSE)","v":"USA"},"1 or 2 hours a day",2,"Australia"]
[null,"ID1299","2012-05-29T13:23:45","6,00,000 INR",600000,"INR",{"$f":"Data!$E1029*VLOOKUP(Data!$F1029,tblXrate[],2,FALSE)","v":32666.305522511171},"Senior Business Executive","Manager","India",{"$f":"VLOOKUP(Data!$J1029,tblCountries[[Actual]:[Mapping]],2,FALSE)","v":"UAE"},"2 to 3 hours per day",2,"India"]
[null,"ID1309","2012-05-29T14:34:42","500000 Rupees",500000,"INR",{"$f":"Data!$E1037*VLOOKUP(Data!$F1037,tblXrate[],2,FALSE)","v":38111.983169748237},"Senior software engineer","Engineer","India",{"$f":"VLOOKUP(Data!$J1037,tblCountries[[Actual]:[Mapping]],2,FALSE)","v":"Spain"},"4 to 6 hours a day",2,"India"]
[null,"ID1330","2012-05-29T16:26:15","17000 Rs",204000,"INR",{"$f":"Data!$E1051*VLOOKUP(Data!$F1051,tblXrate[],2,FALSE)","v":72000},"MIS Associate","Reporting","India",{"$f":"VLOOKUP(Data!$J1051,tblCountries[[Actual]:[Mapping]],2,FALSE)","v":"USA"},"All the 8 hours baby, all the 8!",2,"India"]
[null,"ID1340","2012-05-29T17:17:13","Â£26000",26000,"GBP",{"$f":"Data!$E1057*VLOOKUP(Data!$F1057,tblXrate[],2,FALSE)","v":3205.4250037396623},"Web Analyst","Analyst","UK",{"$f":"VLOOKUP(Data!$J1057,tblCountries[[Actual]:[Mapping]],2,FALSE)","v":"India"},"4 to 6 hours a day",2,"UK"]
[null,"ID1355","2012-05-29T18:38:51",125000,125000,"USD",{"$f":"Data!$E1069*VLOOKUP(Data!$F1069,tblXrate[],2,FALSE)","v":55000},"Vice President of Performance Management","Manager","USA",{"$f":"VLOOKUP(Data!$J1069,tblCountries[[Actual]:[Mapping]],2,FALSE)","v":"USA"},"4 to 6 hours a day",2,"USA"]
[null,"ID1426","2012-05-30T01:25:26",57678.400000000001,57678,"USD",{"$f":"Data!$E1132*VLOOKUP(Data!$F1132,tblXrate[],2,FALSE)","v":69000},"Financial Analyst","Analyst","USA",{"$f":"VLOOKUP(Data!$J1132,tblCountries[[Actual]:[Mapping]],2,FALSE)","v":"USA"},"4 to 6 hours a day",2,"USA"]
[null,"ID1438","2012-05-30T03:20:17","24000 USD",24000,"USD",{"$f":"Data!$E1144*VLOOKUP(Data!$F1144,tblXrate[],2,FALSE)","v":36500},"inventory controller","Controller","USA",{"$f":"VLOOKUP(Data!$J1144,tblCountries[[Actual]:[Mapping]],2,FALSE)","v":"Saudi Arabia"},"1 or 2 hours a day",2,"USA"]
[null,"ID1462","2012-05-30T13:56:48","320000 INR",320000,"INR",{"$f":"Data!$E1162*VLOOKUP(Data!$F1162,tblXrate[],2,FALSE)","v":108110.42357867939},"Analyst","Analyst","India",{"$f":"VLOOKUP(Data!$J1162,tblCountries[[Actual]:[Mapping]],2,FALSE)","v":"Australia"},"2 to 3 hours per day",2,"India"]
[null,"ID1480","2012-05-30T18:16:05",42000,42000,"USD",{"$f":"Data!$E1177*VLOOKUP(Data!$F1177,tblXrate[],2,FALSE)","v":85000},"Service Solution Rep","Analyst","USA",{"$f":"VLOOKUP(Data!$J1177,tblCountries[[Actual]:[Mapping]],2,FALSE)","v":"USA"},"All the 8 hours baby, all the 8!",2,"USA"]
[null,"ID1502","2012-05-30T22:32:21",66000,66000,"USD",{"$f":"Data!$E1192*VLOOKUP(Data!$F1192,tblXrate[],2,FALSE)","v":8000},"Director of Business Analytics","Analyst","USA",{"$f":"VLOOKUP(Data!$J1192,tblCountries[[Actual]:[Mapping]],2,FALSE)","v":"India"},"4 to 6 hours a day",2,"USA"]
[null,"ID1562","2012-05-31T23:09:08","Â£25000",25000,"GBP",{"$f":"Data!$E1239*VLOOKUP(Data!$F1239,tblXrate[],2,FALSE)","v":70928.022243027779},"Reporting Team Lead","Reporting","UK",{"$f":"VLOOKUP(Data!$J1239,tblCountries[[Actual]:[Mapping]],2,FALSE)","v":"UK"},"4 to 6 hours a day",2,"UK"]
[null,"ID1601","2012-06-01T20:12:22","500 USD",6000,"USD",{"$f":"Data!$E1267*VLOOKUP(Data!$F1267,tblXrate[],2,FALSE)","v":88000},"Business Analyst","Analyst","India",{"$f":"VLOOKUP(Data!$J1267,tblCountries[[Actual]:[Mapping]],2,FALSE)","v":"USA"},"4 to 6 hours a day",2,"India"]
[null,"ID1603","2012-06-01T20:37:53",50000,50000,"USD",{"$f":"Data!$E1269*VLOOKUP(Data!$F1269,tblXrate[],2,FALSE)","v":24000},"Sales Operations Analyst","Analyst","USA",{"$f":"VLOOKUP(Data!$J1269,tblCountries[[Actual]:[Mapping]],2,FALSE)","v":"Argentina"},"All the 8 hours baby, all the 8!",2,"USA"]
[null,"ID1610","2012-06-02T02:24:39",55000,55000,"USD",{"$f":"Data!$E1275*VLOOKUP(Data!$F1275,tblXrate[],2,FALSE)","v":69960},"Business Analyst","Analyst","USA",{"$f":"VLOOKUP(Data!$J1275,tblCountries[[Actual]:[Mapping]],2,FALSE)","v":"USA"},"4 to 6 hours a day",2,"USA"]
[null,"ID1618","2012-06-02T06:31:21","42000 US",42000,"USD",{"$f":"Data!$E1283*VLOOKUP(Data!$F1283,tblXrate[],2,FALSE)","v":75000},"production clerk","Analyst","USA",{"$f":"VLOOKUP(Data!$J1283,tblCountries[[Actual]:[Mapping]],2,FALSE)","v":"USA"},"4 to 6 hours a day",2,"USA"]
[null,"ID1629","2012-06-02T21:42:42","6.8 Lac INR",680000,"INR",{"$f":"Data!$E1292*VLOOKUP(Data!$F1292,tblXrate[],2,FALSE)","v":67775.665698893223},"Deputy Manager","Manager","India",{"$f":"VLOOKUP(Data!$J1292,tblCountries[[Actual]:[Mapping]],2,FALSE)","v":"UK"},"1 or 2 hours a day",2,"India"]
[null,"ID1657","2012-06-04T12:22:05",10000,10000,"USD",{"$f":"Data!$E1312*VLOOKUP(Data!$F1312,tblXrate[],2,FALSE)","v":75000},"MIS Executive","Reporting","India",{"$f":"VLOOKUP(Data!$J1312,tblCountries[[Actual]:[Mapping]],2,FALSE)","v":"USA"},"All the 8 hours baby, all the 8!",2,"India"]
[null,"ID1679","2012-06-05T04:06:09",80000,80000,"USD",{"$f":"Data!$E1327*VLOOKUP(Data!$F1327,tblXrate[],2,FALSE)","v":37000},"Data Resource Specialist","Specialist","USA",{"$f":"VLOOKUP(Data!$J1327,tblCountries[[Actual]:[Mapping]],2,FALSE)","v":"USA"},"2 to 3 hours per day",2,"USA"]
[null,"ID1711","2012-06-06T07:28:48",10000,10000,"USD",{"$f":"Data!$E1350*VLOOKUP(Data!$F1350,tblXrate[],2,FALSE)","v":9794.354178093412},"Student assistant","Analyst","USA",{"$f":"VLOOKUP(Data!$J1350,tblCountries[[Actual]:[Mapping]],2,FALSE)","v":"India"},"4 to 6 hours a day",2,"USA"]
[null,"ID1714","2012-06-06T11:21:08",36000,36000,"CAD",{"$f":"Data!$E1353*VLOOKUP(Data!$F1353,tblXrate[],2,FALSE)","v":96000},"data organizer","Analyst","Canada",{"$f":"VLOOKUP(Data!$J1353,tblCountries[[Actual]:[Mapping]],2,FALSE)","v":"USA"},"All the 8 hours baby, all the 8!",2,"Canada"]
[null,"ID1727","2012-06-07T00:32:24","500000vINR",500000,"INR",{"$f":"Data!$E1363*VLOOKUP(Data!$F1363,tblXrate[],2,FALSE)","v":150000},"Business Analyst","Analyst","India",{"$f":"VLOOKUP(Data!$J1363,tblCountries[[Actual]:[Mapping]],2,FALSE)","v":"USA"},"4 to 6 hours a day",2,"India"]
[null,"ID1729","2012-06-07T06:22:17","Â£27000",27000,"GBP",{"$f":"Data!$E1364*VLOOKUP(Data!$F1364,tblXrate[],2,FALSE)","v":69000},"Network Designer","Analyst","UK",{"$f":"VLOOKUP(Data!$J1364,tblCountries[[Actual]:[Mapping]],2,FALSE)","v":"USA"},"4 to 6 hours a day",2,"UK"]
[null,"ID1731","2012-06-07T09:25:45",70000,70000,"CAD",{"$f":"Data!$E1366*VLOOKUP(Data!$F1366,tblXrate[],2,FALSE)","v":7123.1666749770275},"Financial Analyst","Analyst","Canada",{"$f":"VLOOKUP(Data!$J1366,tblCountries[[Actual]:[Mapping]],2,FALSE)","v":"India"},"All the 8 hours baby, all the 8!",2,"Canada"]
[null,"ID1733","2012-06-07T15:19:53",50000,50000,"GBP",{"$f":"Data!$E1367*VLOOKUP(Data!$F1367,tblXrate[],2,FALSE)","v":71393.675948184507},"Research Analyst","Analyst","UK",{"$f":"VLOOKUP(Data!$J1367,tblCountries[[Actual]:[Mapping]],2,FALSE)","v":"Australia"},"2 to 3 hours per day",2,"UK"]
[null,"ID1736","2012-06-07T17:09:18",360000,360000,"INR",{"$f":"Data!$E1370*VLOOKUP(Data!$F1370,tblXrate[],2,FALSE)","v":58000},"Baan ERP Functional Consultant","Consultant","India",{"$f":"VLOOKUP(Data!$J1370,tblCountries[[Actual]:[Mapping]],2,FALSE)","v":"USA"},"1 or 2 hours a day",2,"India"]
[null,"ID1740","2012-06-07T23:33:23",45000,45000,"USD",{"$f":"Data!$E1374*VLOOKUP(Data!$F1374,tblXrate[],2,FALSE)","v":12000},"Sourcing Analyst","Analyst","USA",{"$f":"VLOOKUP(Data!$J1374,tblCountries[[Actual]:[Mapping]],2,FALSE)","v":"USA"},"All the 8 hours baby, all the 8!",2,"USA"]
[null,"ID1753","2012-06-08T13:55:44","15000inr",180000,"INR",{"$f":"Data!$E1386*VLOOKUP(Data!$F1386,tblXrate[],2,FALSE)","v":85000},"mis","Reporting","India",{"$f":"VLOOKUP(Data!$J1386,tblCountries[[Actual]:[Mapping]],2,FALSE)","v":"USA"},"4 to 6 hours a day",2,"India"]
[null,"ID1754","2012-06-08T14:43:05",60000,60000,"USD",{"$f":"Data!$E1387*VLOOKUP(Data!$F1387,tblXrate[],2,FALSE)","v":48275.178681681093},"Project Lead ","Manager","USA",{"$f":"VLOOKUP(Data!$J1387,tblCountries[[Actual]:[Mapping]],2,FALSE)","v":"Netherlands"},"All the 8 hours baby, all the 8!",2,"USA"]
[null,"ID1755","2012-06-08T14:43:40",60000,60000,"USD",{"$f":"Data!$E1388*VLOOKUP(Data!$F1388,tblXrate[],2,FALSE)","v":86692.320794224041},"Project Lead ","Manager","USA",{"$f":"VLOOKUP(Data!$J1388,tblCountries[[Actual]:[Mapping]],2,FALSE)","v":"Australia"},"All the 8 hours baby, all the 8!",2,"USA"]
[null,"ID1768","2012-06-09T01:15:44",65000,65000,"USD",{"$f":"Data!$E1400*VLOOKUP(Data!$F1400,tblXrate[],2,FALSE)","v":150000},"Compliance Officer","Manager","USA",{"$f":"VLOOKUP(Data!$J1400,tblCountries[[Actual]:[Mapping]],2,FALSE)","v":"USA"},"4 to 6 hours a day",2,"USA"]
[null,"ID1793","2012-06-11T19:56:36",11000,11000,"USD",{"$f":"Data!$E1419*VLOOKUP(Data!$F1419,tblXrate[],2,FALSE)","v":52000},"Web Analyst","Analyst","India",{"$f":"VLOOKUP(Data!$J1419,tblCountries[[Actual]:[Mapping]],2,FALSE)","v":"USA"},"4 to 6 hours a day",2,"India"]
[null,"ID1794","2012-06-11T21:03:36",40000,40000,"USD",{"$f":"Data!$E1420*VLOOKUP(Data!$F1420,tblXrate[],2,FALSE)","v":36000},"Intern","Analyst","USA",{"$f":"VLOOKUP(Data!$J1420,tblCountries[[Actual]:[Mapping]],2,FALSE)","v":"USA"},"2 to 3 hours per day",2,"USA"]
[null,"ID1821","2012-06-13T00:23:31",80000,80000,"USD",{"$f":"Data!$E1444*VLOOKUP(Data!$F1444,tblXrate[],2,FALSE)","v":14246.333349954055},"Manager, Operations","Manager","USA",{"$f":"VLOOKUP(Data!$J1444,tblCountries[[Actual]:[Mapping]],2,FALSE)","v":"India"},"4 to 6 hours a day",2,"USA"]
[null,"ID1823","2012-06-13T00:50:20",20000,20000,"USD",{"$f":"Data!$E1446*VLOOKUP(Data!$F1446,tblXrate[],2,FALSE)","v":49168.076151516347},"administrator","Analyst","Canada",{"$f":"VLOOKUP(Data!$J1446,tblCountries[[Actual]:[Mapping]],2,FALSE)","v":"Canada"},"2 to 3 hours per day",2,"Canada"]
[null,"ID1876","2012-06-16T14:10:51","INR 360000",360000,"INR",{"$f":"Data!$E1488*VLOOKUP(Data!$F1488,tblXrate[],2,FALSE)","v":70000},"Analyst","Analyst","India",{"$f":"VLOOKUP(Data!$J1488,tblCountries[[Actual]:[Mapping]],2,FALSE)","v":"USA"},"All the 8 hours baby, all the 8!",2,"India"]
[null,"ID1883","2012-06-17T01:34:46","4,00,000",400000,"INR",{"$f":"Data!$E1495*VLOOKUP(Data!$F1495,tblXrate[],2,FALSE)","v":59001.691381819612},"technical analyst","Analyst","India",{"$f":"VLOOKUP(Data!$J1495,tblCountries[[Actual]:[Mapping]],2,FALSE)","v":"Canada"},"1 or 2 hours a day",2,"India"]
[null,"ID1892","2012-06-18T08:19:01",5000,5000,"USD",{"$f":"Data!$E1500*VLOOKUP(Data!$F1500,tblXrate[],2,FALSE)","v":70000},"analyst ","Analyst","India",{"$f":"VLOOKUP(Data!$J1500,tblCountries[[Actual]:[Mapping]],2,FALSE)","v":"USA"},"All the 8 hours baby, all the 8!",2,"India"]
[null,"ID1909","2012-06-19T21:01:21",420000,420000,"INR",{"$f":"Data!$E1515*VLOOKUP(Data!$F1515,tblXrate[],2,FALSE)","v":100000},"Analyst","Analyst","India",{"$f":"VLOOKUP(Data!$J1515,tblCountries[[Actual]:[Mapping]],2,FALSE)","v":"USA"},"4 to 6 hours a day",2,"India"]
[null,"ID0695","2012-05-26T13:29:12","3000 $",3000,"USD",{"$f":"Data!$E1639*VLOOKUP(Data!$F1639,tblXrate[],2,FALSE)","v":68000},"Call Centre Consultant","Consultant","Cambodia","Other Countries","2 to 3 hours per day",2,"Cambodia"]
[null,"ID0714","2012-05-26T14:20:23","15000 USD",15000,"USD",{"$f":"Data!$E1640*VLOOKUP(Data!$F1640,tblXrate[],2,FALSE)","v":75000},"Audit - senior assistant","Accountant","Lithuania","Other Countries","4 to 6 hours a day",2,"Lithuania"]
[null,"ID0727","2012-05-26T15:02:34",800,9600,"USD",{"$f":"Data!$E1643*VLOOKUP(Data!$F1643,tblXrate[],2,FALSE)","v":85000},"Admin","Analyst","South Africa","Other Countries","4 to 6 hours a day",2,"South Africa"]
[null,"ID0742","2012-05-26T15:56:57","4800 $",4800,"USD",{"$f":"Data!$E1646*VLOOKUP(Data!$F1646,tblXrate[],2,FALSE)","v":47500},"Data Analysis","Analyst","Bhutan","Other Countries","4 to 6 hours a day",2,"Bhutan"]
[null,"ID0765","2012-05-26T17:09:24","14960 $",14960,"USD",{"$f":"Data!$E1652*VLOOKUP(Data!$F1652,tblXrate[],2,FALSE)","v":160271.25018698312},"Stock Controller","Controller","Saudi Arabia","Other Countries","All the 8 hours baby, all the 8!",2,"Saudi Arabia"]
[null,"ID0865","2012-05-27T04:31:08","R134000",134000,"ZAR",{"$f":"Data!$E1671*VLOOKUP(Data!$F1671,tblXrate[],2,FALSE)","v":47000},"Data Analyst","Analyst","South Africa","Other Countries","4 to 6 hours a day",2,"South Africa"]
[null,"ID0950","2012-05-28T00:48:23",20000,20000,"USD",{"$f":"Data!$E1698*VLOOKUP(Data!$F1698,tblXrate[],2,FALSE)","v":75000},"Financial Modeller","Accountant","Zambia","Other Countries","All the 8 hours baby, all the 8!",2,"Zambia"]
[null,"ID1001","2012-05-28T10:15:27","RM48,000",48000,"MYR",{"$f":"Data!$E1710*VLOOKUP(Data!$F1710,tblXrate[],2,FALSE)","v":74000},"Credit Risk Manager","Manager","Malaysia","Other Countries","4 to 6 hours a day",2,"malaysia"]
[null,"ID1136","2012-05-28T18:34:12","PhP 216,000",216000,"PHP",{"$f":"Data!$E1736*VLOOKUP(Data!$F1736,tblXrate[],2,FALSE)","v":52000},"Planner","Manager","Philippines","Other Countries","4 to 6 hours a day",2,"Philippines"]
[null,"ID1189","2012-05-28T23:05:03","216000 AED",216000,"AED",{"$f":"Data!$E1751*VLOOKUP(Data!$F1751,tblXrate[],2,FALSE)","v":12821.700014958649},"Financial analyst","Analyst","Dubai","Other Countries","4 to 6 hours a day",2,"Dubai"]
[null,"ID1245","2012-05-29T04:30:10","IDR 4000000",48000000,"IDR",{"$f":"Data!$E1764*VLOOKUP(Data!$F1764,tblXrate[],2,FALSE)","v":54000},"Office Instructor","Analyst","Indonesia","Other Countries","1 or 2 hours a day",2,"Indonesia"]
[null,"ID1260","2012-05-29T07:57:04",800000,9600000,"MONGOLIAN",{"$f":"Data!$E1768*VLOOKUP(Data!$F1768,tblXrate[],2,FALSE)","v":86093.301341305123},"Analyst","Analyst","Mongolia","Other Countries","All the 8 hours baby, all the 8!",2,"Mongolia"]
[null,"ID1261","2012-05-29T08:13:06","RM3000",36000,"MYR",{"$f":"Data!$E1769*VLOOKUP(Data!$F1769,tblXrate[],2,FALSE)","v":72600},"Process Engineering","Engineer","Malaysia","Other Countries","4 to 6 hours a day",2,"malaysia"]
[null,"ID1317","2012-05-29T15:18:45",250,3000,"USD",{"$f":"Data!$E1779*VLOOKUP(Data!$F1779,tblXrate[],2,FALSE)","v":61194.579384158147},"FANANCE","Accountant","SRI LANKA","Other Countries","4 to 6 hours a day",2,"Sri Lanka"]
[null,"ID1458","2012-05-30T13:36:48",41000,41000,"USD",{"$f":"Data!$E1801*VLOOKUP(Data!$F1801,tblXrate[],2,FALSE)","v":12000},"Marketing Analyst","Analyst","Japan","Other Countries","2 to 3 hours per day",2,"Japan"]
[null,"ID1460","2012-05-30T13:47:51","zar22000",264000,"ZAR",{"$f":"Data!$E1802*VLOOKUP(Data!$F1802,tblXrate[],2,FALSE)","v":44000},"Analyst","Analyst","SouthAfrica","Other Countries","All the 8 hours baby, all the 8!",2,"South Africa"]
[null,"ID1477","2012-05-30T17:14:27","ZAR6500",78000,"ZAR",{"$f":"Data!$E1806*VLOOKUP(Data!$F1806,tblXrate[],2,FALSE)","v":45000},"Online Stats Controller","Controller","South Africa","Other Countries","4 to 6 hours a day",2,"South Africa"]
[null,"ID1524","2012-05-31T05:37:29",800,9600,"USD",{"$f":"Data!$E1816*VLOOKUP(Data!$F1816,tblXrate[],2,FALSE)","v":33420},"Reporting Analyst","Analyst","Bolivia","Other Countries","All the 8 hours baby, all the 8!",2,"Bolivia"]
[null,"ID1576","2012-06-01T04:44:29",11000,11000,"USD",{"$f":"Data!$E1826*VLOOKUP(Data!$F1826,tblXrate[],2,FALSE)","v":36000},"Coordinator","Manager","MÃ©xico","Other Countries","4 to 6 hours a day",2,"Mexico"]
[null,"ID1797","2012-06-11T22:21:25",33600,33600,"USD",{"$f":"Data!$E1868*VLOOKUP(Data!$F1868,tblXrate[],2,FALSE)","v":8500},"Executive","Analyst","Singapore","Other Countries","All the 8 hours baby, all the 8!",2,"Singapore"]
[null,"ID1798","2012-06-11T22:22:00",33600,33600,"USD",{"$f":"Data!$E1869*VLOOKUP(Data!$F1869,tblXrate[],2,FALSE)","v":78000},"Executive","Analyst","Singapore","Other Countries","All the 8 hours baby, all the 8!",2,"Singapore"]
[null,"ID0781","2012-05-26T18:56:52",570000,570000,"INR",{"$f":"Data!$E647*VLOOKUP(Data!$F647,tblXrate[],2,FALSE)","v":26400},"Analyst","Analyst","India",{"$f":"VLOOKUP(Data!$J647,tblCountries[[Actual]:[Mapping]],2,FALSE)","v":"UAE"},"All the 8 hours baby, all the 8!",2.4,"India"]
[null,"ID0776","2012-05-26T18:29:06",13500,13500,"USD",{"$f":"Data!$E644*VLOOKUP(Data!$F644,tblXrate[],2,FALSE)","v":56400},"MIS","Reporting","India",{"$f":"VLOOKUP(Data!$J644,tblCountries[[Actual]:[Mapping]],2,FALSE)","v":"UAE"},"All the 8 hours baby, all the 8!",2.5,"India"]
[null,"ID0986","2012-05-28T08:26:43",94000,94000,"AUD",{"$f":"Data!$E793*VLOOKUP(Data!$F793,tblXrate[],2,FALSE)","v":4986.216672483919},"Business Analyst","Analyst","Australia",{"$f":"VLOOKUP(Data!$J793,tblCountries[[Actual]:[Mapping]],2,FALSE)","v":"India"},"2 to 3 hours per day",2.5,"Australia"]
[null,"ID1013","2012-05-28T11:33:07","350000 Rs",350000,"INR",{"$f":"Data!$E815*VLOOKUP(Data!$F815,tblXrate[],2,FALSE)","v":21500},"Data Analyst","Analyst","India",{"$f":"VLOOKUP(Data!$J815,tblCountries[[Actual]:[Mapping]],2,FALSE)","v":"India"},"4 to 6 hours a day",2.5,"India"]
[null,"ID1590","2012-06-01T14:32:41",250000,250000,"INR",{"$f":"Data!$E1260*VLOOKUP(Data!$F1260,tblXrate[],2,FALSE)","v":100000},"Analytics engineer","Engineer","India",{"$f":"VLOOKUP(Data!$J1260,tblCountries[[Actual]:[Mapping]],2,FALSE)","v":"Sweden"},"4 to 6 hours a day",2.5,"India"]
[null,"ID1627","2012-06-02T20:50:40",400000,400000,"INR",{"$f":"Data!$E1290*VLOOKUP(Data!$F1290,tblXrate[],2,FALSE)","v":8903.9583437212841},"application dev","Analyst","India",{"$f":"VLOOKUP(Data!$J1290,tblCountries[[Actual]:[Mapping]],2,FALSE)","v":"India"},"1 or 2 hours a day",2.5,"India"]
[null,"ID1663","2012-06-04T18:55:54","INR 3.2 lpa",320000,"INR",{"$f":"Data!$E1318*VLOOKUP(Data!$F1318,tblXrate[],2,FALSE)","v":107000},"Research Associate","Analyst","India",{"$f":"VLOOKUP(Data!$J1318,tblCountries[[Actual]:[Mapping]],2,FALSE)","v":"USA"},"4 to 6 hours a day",2.5,"India"]
[null,"ID1742","2012-06-08T00:01:49",68000,68000,"USD",{"$f":"Data!$E1376*VLOOKUP(Data!$F1376,tblXrate[],2,FALSE)","v":57000},"Tax Associate","Analyst","USA",{"$f":"VLOOKUP(Data!$J1376,tblCountries[[Actual]:[Mapping]],2,FALSE)","v":"USA"},"4 to 6 hours a day",2.5,"USA"]
[null,"ID0582","2012-05-26T07:36:23",45000,45000,"USD",{"$f":"Data!$E481*VLOOKUP(Data!$F481,tblXrate[],2,FALSE)","v":50000},"business analyst","Analyst","USA",{"$f":"VLOOKUP(Data!$J481,tblCountries[[Actual]:[Mapping]],2,FALSE)","v":"Canada"},"4 to 6 hours a day",3,"USA"]
[null,"ID0587","2012-05-26T07:53:13",70000,70000,"USD",{"$f":"Data!$E486*VLOOKUP(Data!$F486,tblXrate[],2,FALSE)","v":5342.3750062327708},"Financial Analyst","Analyst","USA",{"$f":"VLOOKUP(Data!$J486,tblCountries[[Actual]:[Mapping]],2,FALSE)","v":"India"},"4 to 6 hours a day",3,"USA"]
[null,"ID0591","2012-05-26T08:05:39",65000,65000,"USD",{"$f":"Data!$E490*VLOOKUP(Data!$F490,tblXrate[],2,FALSE)","v":5300},"Data Analyst","Analyst","USA",{"$f":"VLOOKUP(Data!$J490,tblCountries[[Actual]:[Mapping]],2,FALSE)","v":"Pakistan"},"4 to 6 hours a day",3,"USA"]
[null,"ID0598","2012-05-26T08:51:04","4,00,000",400000,"INR",{"$f":"Data!$E494*VLOOKUP(Data!$F494,tblXrate[],2,FALSE)","v":102000},"BPO","Manager","India",{"$f":"VLOOKUP(Data!$J494,tblCountries[[Actual]:[Mapping]],2,FALSE)","v":"USA"},"1 or 2 hours a day",3,"India"]
[null,"ID0613","2012-05-26T10:22:45","INR 420000",420000,"INR",{"$f":"Data!$E507*VLOOKUP(Data!$F507,tblXrate[],2,FALSE)","v":122389.15876831629},"Assistant EDP","Analyst","India",{"$f":"VLOOKUP(Data!$J507,tblCountries[[Actual]:[Mapping]],2,FALSE)","v":"Australia"},"4 to 6 hours a day",3,"India"]
[null,"ID0621","2012-05-26T10:59:39","1 lakh 60 thousand INR/Year",160000,"INR",{"$f":"Data!$E514*VLOOKUP(Data!$F514,tblXrate[],2,FALSE)","v":49168.076151516347},"MIS Executive","Reporting","India",{"$f":"VLOOKUP(Data!$J514,tblCountries[[Actual]:[Mapping]],2,FALSE)","v":"Canada"},"All the 8 hours baby, all the 8!",3,"India"]
[null,"ID0631","2012-05-26T11:17:56",39000,39000,"USD",{"$f":"Data!$E523*VLOOKUP(Data!$F523,tblXrate[],2,FALSE)","v":40000},"Content Analyst ","Analyst","USA",{"$f":"VLOOKUP(Data!$J523,tblCountries[[Actual]:[Mapping]],2,FALSE)","v":"USA"},"All the 8 hours baby, all the 8!",3,"USA"]
[null,"ID0636","2012-05-26T11:36:04","Rs. 200000",200000,"INR",{"$f":"Data!$E528*VLOOKUP(Data!$F528,tblXrate[],2,FALSE)","v":78000},"Auditor","Accountant","India",{"$f":"VLOOKUP(Data!$J528,tblCountries[[Actual]:[Mapping]],2,FALSE)","v":"USA"},"4 to 6 hours a day",3,"India"]
[null,"ID0638","2012-05-26T11:37:53",600000,600000,"INR",{"$f":"Data!$E530*VLOOKUP(Data!$F530,tblXrate[],2,FALSE)","v":4808.137505609493},"Financial Analyst","Analyst","India",{"$f":"VLOOKUP(Data!$J530,tblCountries[[Actual]:[Mapping]],2,FALSE)","v":"India"},"2 to 3 hours per day",3,"India"]
[null,"ID0650","2012-05-26T12:14:07","Rs 800000",800000,"INR",{"$f":"Data!$E541*VLOOKUP(Data!$F541,tblXrate[],2,FALSE)","v":24000},"Engineer","Engineer","India",{"$f":"VLOOKUP(Data!$J541,tblCountries[[Actual]:[Mapping]],2,FALSE)","v":"Croatia"},"2 to 3 hours per day",3,"India"]
[null,"ID0651","2012-05-26T12:17:01",480000,480000,"INR",{"$f":"Data!$E542*VLOOKUP(Data!$F542,tblXrate[],2,FALSE)","v":12000},"BI Consultant","Reporting","India",{"$f":"VLOOKUP(Data!$J542,tblCountries[[Actual]:[Mapping]],2,FALSE)","v":"Ukraine"},"1 or 2 hours a day",3,"India"]
[null,"ID0654","2012-05-26T12:20:07",450,5400,"USD",{"$f":"Data!$E545*VLOOKUP(Data!$F545,tblXrate[],2,FALSE)","v":12326.656394453004},"manager","Manager","India",{"$f":"VLOOKUP(Data!$J545,tblCountries[[Actual]:[Mapping]],2,FALSE)","v":"Nigeria"},"All the 8 hours baby, all the 8!",3,"India"]
[null,"ID0660","2012-05-26T12:28:05","INR 9,50,000",950000,"INR",{"$f":"Data!$E550*VLOOKUP(Data!$F550,tblXrate[],2,FALSE)","v":6000},"Investment Banker","Manager","India",{"$f":"VLOOKUP(Data!$J550,tblCountries[[Actual]:[Mapping]],2,FALSE)","v":"Zambia"},"4 to 6 hours a day",3,"India"]
[null,"ID0665","2012-05-26T12:35:42","INR 2 l;acks",200000,"INR",{"$f":"Data!$E555*VLOOKUP(Data!$F555,tblXrate[],2,FALSE)","v":39879.404680246938},"MIS EXECUTIVE","Reporting","India",{"$f":"VLOOKUP(Data!$J555,tblCountries[[Actual]:[Mapping]],2,FALSE)","v":"New Zealand"},"All the 8 hours baby, all the 8!",3,"India"]
[null,"ID0668","2012-05-26T12:48:19","230000 INR",230000,"INR",{"$f":"Data!$E558*VLOOKUP(Data!$F558,tblXrate[],2,FALSE)","v":110000},"MIS Executive","Reporting","India",{"$f":"VLOOKUP(Data!$J558,tblCountries[[Actual]:[Mapping]],2,FALSE)","v":"Norway"},"All the 8 hours baby, all the 8!",3,"India"]
[null,"ID0669","2012-05-26T12:50:08","23000 Rupees",276000,"INR",{"$f":"Data!$E559*VLOOKUP(Data!$F559,tblXrate[],2,FALSE)","v":88927.960729412545},"Education Officer","Manager","Pakistan",{"$f":"VLOOKUP(Data!$J559,tblCountries[[Actual]:[Mapping]],2,FALSE)","v":"Germany"},"1 or 2 hours a day",3,"Pakistan"]
[null,"ID0682","2012-05-26T13:05:03","220000 in INR",220000,"INR",{"$f":"Data!$E567*VLOOKUP(Data!$F567,tblXrate[],2,FALSE)","v":4006.7812546745777},"Accounts Payable Analyst","Analyst","India",{"$f":"VLOOKUP(Data!$J567,tblCountries[[Actual]:[Mapping]],2,FALSE)","v":"India"},"2 to 3 hours per day",3,"India"]
[null,"ID0685","2012-05-26T13:12:48","1,20,000 INR",120000,"INR",{"$f":"Data!$E570*VLOOKUP(Data!$F570,tblXrate[],2,FALSE)","v":39355.495879248076},"Data Analyst","Analyst","India",{"$f":"VLOOKUP(Data!$J570,tblCountries[[Actual]:[Mapping]],2,FALSE)","v":"India"},"2 to 3 hours per day",3,"India"]
[null,"ID0691","2012-05-26T13:22:43",300000,300000,"INR",{"$f":"Data!$E575*VLOOKUP(Data!$F575,tblXrate[],2,FALSE)","v":4000},"govt","Manager","India",{"$f":"VLOOKUP(Data!$J575,tblCountries[[Actual]:[Mapping]],2,FALSE)","v":"India"},"2 to 3 hours per day",3,"India"]
[null,"ID0725","2012-05-26T15:01:00","USD130000",130000,"USD",{"$f":"Data!$E605*VLOOKUP(Data!$F605,tblXrate[],2,FALSE)","v":60000},"Modeller","Manager","Australia",{"$f":"VLOOKUP(Data!$J605,tblCountries[[Actual]:[Mapping]],2,FALSE)","v":"USA"},"4 to 6 hours a day",3,"Australia"]
[null,"ID0813","2012-05-26T22:08:56","Rs 20000",240000,"INR",{"$f":"Data!$E675*VLOOKUP(Data!$F675,tblXrate[],2,FALSE)","v":1910.5359690238436},"MANAGER","Manager","India",{"$f":"VLOOKUP(Data!$J675,tblCountries[[Actual]:[Mapping]],2,FALSE)","v":"Pakistan"},"2 to 3 hours per day",3,"India"]
[null,"ID0817","2012-05-26T22:29:16","3500 Rs",504000,"INR",{"$f":"Data!$E679*VLOOKUP(Data!$F679,tblXrate[],2,FALSE)","v":71393.675948184507},"MNR","Manager","India",{"$f":"VLOOKUP(Data!$J679,tblCountries[[Actual]:[Mapping]],2,FALSE)","v":"Australia"},"All the 8 hours baby, all the 8!",3,"India"]
[null,"ID0821","2012-05-26T22:43:12",15500,15500,"USD",{"$f":"Data!$E682*VLOOKUP(Data!$F682,tblXrate[],2,FALSE)","v":8700},"Engineer","Engineer","India",{"$f":"VLOOKUP(Data!$J682,tblCountries[[Actual]:[Mapping]],2,FALSE)","v":"India"},"1 or 2 hours a day",3,"India"]
[null,"ID0884","2012-05-27T12:57:51","Rs.60000/-",720000,"INR",{"$f":"Data!$E725*VLOOKUP(Data!$F725,tblXrate[],2,FALSE)","v":8738},"Article (Internship) - CA","Accountant","India",{"$f":"VLOOKUP(Data!$J725,tblCountries[[Actual]:[Mapping]],2,FALSE)","v":"India"},"4 to 6 hours a day",3,"India"]
[null,"ID0898","2012-05-27T14:49:12","5,00,000 INR",500000,"INR",{"$f":"Data!$E735*VLOOKUP(Data!$F735,tblXrate[],2,FALSE)","v":10684.750012465542},"Planning Engineer","Engineer","India",{"$f":"VLOOKUP(Data!$J735,tblCountries[[Actual]:[Mapping]],2,FALSE)","v":"India"},"2 to 3 hours per day",3,"India"]
[null,"ID0900","2012-05-27T14:55:30","INR 850,000",850000,"INR",{"$f":"Data!$E737*VLOOKUP(Data!$F737,tblXrate[],2,FALSE)","v":37828.278529614821},"Assistant Manager","Manager","India",{"$f":"VLOOKUP(Data!$J737,tblCountries[[Actual]:[Mapping]],2,FALSE)","v":"UK"},"2 to 3 hours per day",3,"India"]
[null,"ID0911","2012-05-27T16:24:50",1300000,1300000,"INR",{"$f":"Data!$E744*VLOOKUP(Data!$F744,tblXrate[],2,FALSE)","v":3205.4250037396623},"banker","Manager","India",{"$f":"VLOOKUP(Data!$J744,tblCountries[[Actual]:[Mapping]],2,FALSE)","v":"India"},"1 or 2 hours a day",3,"India"]
[null,"ID0928","2012-05-27T21:24:42","7 Lakhs",700000,"INR",{"$f":"Data!$E756*VLOOKUP(Data!$F756,tblXrate[],2,FALSE)","v":5100},"Business Support Executive","Manager","India",{"$f":"VLOOKUP(Data!$J756,tblCountries[[Actual]:[Mapping]],2,FALSE)","v":"India"},"4 to 6 hours a day",3,"India"]
[null,"ID0931","2012-05-27T22:05:15",24000,24000,"USD",{"$f":"Data!$E758*VLOOKUP(Data!$F758,tblXrate[],2,FALSE)","v":91418.339779902482},"business analyst","Analyst","India",{"$f":"VLOOKUP(Data!$J758,tblCountries[[Actual]:[Mapping]],2,FALSE)","v":"UK"},"4 to 6 hours a day",3,"India"]
[null,"ID0970","2012-05-28T06:51:54",60000,60000,"USD",{"$f":"Data!$E779*VLOOKUP(Data!$F779,tblXrate[],2,FALSE)","v":125000},"Sales Manager","Manager","USA",{"$f":"VLOOKUP(Data!$J779,tblCountries[[Actual]:[Mapping]],2,FALSE)","v":"USA"},"2 to 3 hours per day",3,"USA"]
[null,"ID0980","2012-05-28T07:39:22",62000,62000,"AUD",{"$f":"Data!$E788*VLOOKUP(Data!$F788,tblXrate[],2,FALSE)","v":55954.328658388586},"Business Analyst","Analyst","Australia",{"$f":"VLOOKUP(Data!$J788,tblCountries[[Actual]:[Mapping]],2,FALSE)","v":"UK"},"4 to 6 hours a day",3,"Australia"]
[null,"ID1006","2012-05-28T10:29:41","$45,000  USD",45000,"USD",{"$f":"Data!$E808*VLOOKUP(Data!$F808,tblXrate[],2,FALSE)","v":24864},"Staff accountant -- Auditing","Accountant","USA",{"$f":"VLOOKUP(Data!$J808,tblCountries[[Actual]:[Mapping]],2,FALSE)","v":"Libya"},"All the 8 hours baby, all the 8!",3,"USA"]
[null,"ID1018","2012-05-28T12:00:14",3.65,365000,"INR",{"$f":"Data!$E818*VLOOKUP(Data!$F818,tblXrate[],2,FALSE)","v":65000},"associate analyst","Analyst","India",{"$f":"VLOOKUP(Data!$J818,tblCountries[[Actual]:[Mapping]],2,FALSE)","v":"USA"},"4 to 6 hours a day",3,"India"]
[null,"ID1038","2012-05-28T13:10:02",28000,28000,"USD",{"$f":"Data!$E833*VLOOKUP(Data!$F833,tblXrate[],2,FALSE)","v":23150.291693675339},"BI","Reporting","India",{"$f":"VLOOKUP(Data!$J833,tblCountries[[Actual]:[Mapping]],2,FALSE)","v":"India"},"2 to 3 hours per day",3,"India"]
[null,"ID1066","2012-05-28T14:45:04","2LAKHS",200000,"INR",{"$f":"Data!$E852*VLOOKUP(Data!$F852,tblXrate[],2,FALSE)","v":186983.12521814698},"MIS Executive","Reporting","India",{"$f":"VLOOKUP(Data!$J852,tblCountries[[Actual]:[Mapping]],2,FALSE)","v":"India"},"4 to 6 hours a day",3,"India"]
[null,"ID1089","2012-05-28T15:49:22",240000,240000,"INR",{"$f":"Data!$E874*VLOOKUP(Data!$F874,tblXrate[],2,FALSE)","v":3205.4250037396623},"Executive","Analyst","India",{"$f":"VLOOKUP(Data!$J874,tblCountries[[Actual]:[Mapping]],2,FALSE)","v":"India"},"2 to 3 hours per day",3,"India"]
[null,"ID1090","2012-05-28T15:49:54","Rs. 250000",250000,"INR",{"$f":"Data!$E875*VLOOKUP(Data!$F875,tblXrate[],2,FALSE)","v":7479.3250087258784},"MIS Executive","Reporting","India",{"$f":"VLOOKUP(Data!$J875,tblCountries[[Actual]:[Mapping]],2,FALSE)","v":"India"},"2 to 3 hours per day",3,"India"]
[null,"ID1096","2012-05-28T16:05:43","40000 euro",40000,"EUR",{"$f":"Data!$E881*VLOOKUP(Data!$F881,tblXrate[],2,FALSE)","v":47285.348162018527},"Accounting analyst","Analyst","Netherlands",{"$f":"VLOOKUP(Data!$J881,tblCountries[[Actual]:[Mapping]],2,FALSE)","v":"UK"},"4 to 6 hours a day",3,"Netherlands"]
[null,"ID1104","2012-05-28T16:26:14",43912.03,43912,"GBP",{"$f":"Data!$E888*VLOOKUP(Data!$F888,tblXrate[],2,FALSE)","v":53590.061250287661},"Senior Data Analyst","Analyst","UK",{"$f":"VLOOKUP(Data!$J888,tblCountries[[Actual]:[Mapping]],2,FALSE)","v":"UK"},"All the 8 hours baby, all the 8!",3,"UK"]
[null,"ID1112","2012-05-28T16:53:13","Rs. 15000",180000,"INR",{"$f":"Data!$E893*VLOOKUP(Data!$F893,tblXrate[],2,FALSE)","v":53590.061250287661},"Logistics Operation Analyst","Analyst","India",{"$f":"VLOOKUP(Data!$J893,tblCountries[[Actual]:[Mapping]],2,FALSE)","v":"UK"},"All the 8 hours baby, all the 8!",3,"India"]
[null,"ID1118","2012-05-28T17:09:40","Â£25000",25000,"GBP",{"$f":"Data!$E898*VLOOKUP(Data!$F898,tblXrate[],2,FALSE)","v":110000},"Developer","Analyst","UK",{"$f":"VLOOKUP(Data!$J898,tblCountries[[Actual]:[Mapping]],2,FALSE)","v":"USA"},"4 to 6 hours a day",3,"UK"]
[null,"ID1214","2012-05-29T00:28:38",500000,500000,"INR",{"$f":"Data!$E966*VLOOKUP(Data!$F966,tblXrate[],2,FALSE)","v":60000},"Consultant","Consultant","India",{"$f":"VLOOKUP(Data!$J966,tblCountries[[Actual]:[Mapping]],2,FALSE)","v":"Turkey"},"2 to 3 hours per day",3,"India"]
[null,"ID1217","2012-05-29T00:32:35","INR 750,000",750000,"INR",{"$f":"Data!$E969*VLOOKUP(Data!$F969,tblXrate[],2,FALSE)","v":24391.669228638868},"Assistant Manager","Manager","India",{"$f":"VLOOKUP(Data!$J969,tblCountries[[Actual]:[Mapping]],2,FALSE)","v":"italy"},"2 to 3 hours per day",3,"India"]
[null,"ID1273","2012-05-29T09:47:47",30000,30000,"USD",{"$f":"Data!$E1010*VLOOKUP(Data!$F1010,tblXrate[],2,FALSE)","v":20479.104190558952},"Practice Manager - Business Operations","Manager","India",{"$f":"VLOOKUP(Data!$J1010,tblCountries[[Actual]:[Mapping]],2,FALSE)","v":"India"},"2 to 3 hours per day",3,"India"]
[null,"ID1282","2012-05-29T10:51:31",50000,50000,"USD",{"$f":"Data!$E1017*VLOOKUP(Data!$F1017,tblXrate[],2,FALSE)","v":92000},"Data Analyst","Analyst","USA",{"$f":"VLOOKUP(Data!$J1017,tblCountries[[Actual]:[Mapping]],2,FALSE)","v":"USA"},"4 to 6 hours a day",3,"USA"]
[null,"ID1290","2012-05-29T12:20:32","400000INR",400000,"INR",{"$f":"Data!$E1024*VLOOKUP(Data!$F1024,tblXrate[],2,FALSE)","v":41712.231189497601},"PMO","Manager","India",{"$f":"VLOOKUP(Data!$J1024,tblCountries[[Actual]:[Mapping]],2,FALSE)","v":"India"},"All the 8 hours baby, all the 8!",3,"India"]
[null,"ID1313","2012-05-29T15:02:56","2 LPA",200000,"INR",{"$f":"Data!$E1040*VLOOKUP(Data!$F1040,tblXrate[],2,FALSE)","v":14246.333349954055},"MIS","Reporting","India",{"$f":"VLOOKUP(Data!$J1040,tblCountries[[Actual]:[Mapping]],2,FALSE)","v":"India"},"2 to 3 hours per day",3,"India"]
[null,"ID1338","2012-05-29T17:09:52",300000,300000,"INR",{"$f":"Data!$E1055*VLOOKUP(Data!$F1055,tblXrate[],2,FALSE)","v":13500},"Financial Modelling Analyst","Analyst","India",{"$f":"VLOOKUP(Data!$J1055,tblCountries[[Actual]:[Mapping]],2,FALSE)","v":"Montenegro"},"All the 8 hours baby, all the 8!",3,"India"]
[null,"ID1373","2012-05-29T20:03:07",33000,33000,"USD",{"$f":"Data!$E1084*VLOOKUP(Data!$F1084,tblXrate[],2,FALSE)","v":80000},"Quality Control Supervisor","Controller","USA",{"$f":"VLOOKUP(Data!$J1084,tblCountries[[Actual]:[Mapping]],2,FALSE)","v":"USA"},"4 to 6 hours a day",3,"USA"]
[null,"ID1433","2012-05-30T02:22:39",14000,14000,"USD",{"$f":"Data!$E1139*VLOOKUP(Data!$F1139,tblXrate[],2,FALSE)","v":24000},"Consultant","Consultant","India",{"$f":"VLOOKUP(Data!$J1139,tblCountries[[Actual]:[Mapping]],2,FALSE)","v":"UAE"},"4 to 6 hours a day",3,"India"]
[null,"ID1478","2012-05-30T17:18:38","INR 60000",720000,"INR",{"$f":"Data!$E1175*VLOOKUP(Data!$F1175,tblXrate[],2,FALSE)","v":65000},"DEO","Analyst","India",{"$f":"VLOOKUP(Data!$J1175,tblCountries[[Actual]:[Mapping]],2,FALSE)","v":"USA"},"4 to 6 hours a day",3,"India"]
[null,"ID1511","2012-05-31T01:17:16",74300,74300,"USD",{"$f":"Data!$E1199*VLOOKUP(Data!$F1199,tblXrate[],2,FALSE)","v":158085.99674240855},"Senior Business Research Analyst","Analyst","USA",{"$f":"VLOOKUP(Data!$J1199,tblCountries[[Actual]:[Mapping]],2,FALSE)","v":"Australia"},"4 to 6 hours a day",3,"USA"]
[null,"ID1526","2012-05-31T06:23:09",22000,22000,"USD",{"$f":"Data!$E1211*VLOOKUP(Data!$F1211,tblXrate[],2,FALSE)","v":10684.750012465542},"Data Manager","Manager","USA",{"$f":"VLOOKUP(Data!$J1211,tblCountries[[Actual]:[Mapping]],2,FALSE)","v":"India"},"4 to 6 hours a day",3,"USA"]
[null,"ID1531","2012-05-31T09:45:09",50000,50000,"CAD",{"$f":"Data!$E1216*VLOOKUP(Data!$F1216,tblXrate[],2,FALSE)","v":4273.9000049862161},"Business Analyst","Analyst","Canada",{"$f":"VLOOKUP(Data!$J1216,tblCountries[[Actual]:[Mapping]],2,FALSE)","v":"India"},"4 to 6 hours a day",3,"Canada"]
[null,"ID1536","2012-05-31T11:08:38","Rs. 200000/-",200000,"INR",{"$f":"Data!$E1219*VLOOKUP(Data!$F1219,tblXrate[],2,FALSE)","v":69000},"Accounts Executive","Accountant","India",{"$f":"VLOOKUP(Data!$J1219,tblCountries[[Actual]:[Mapping]],2,FALSE)","v":"USA"},"All the 8 hours baby, all the 8!",3,"India"]
[null,"ID1552","2012-05-31T20:14:20","Â£35000",35000,"GBP",{"$f":"Data!$E1231*VLOOKUP(Data!$F1231,tblXrate[],2,FALSE)","v":58318.59606648951},"Research Analyst","Analyst","UK",{"$f":"VLOOKUP(Data!$J1231,tblCountries[[Actual]:[Mapping]],2,FALSE)","v":"UK"},"4 to 6 hours a day",3,"UK"]
[null,"ID1607","2012-06-01T23:29:43","Â£20000",20000,"GBP",{"$f":"Data!$E1273*VLOOKUP(Data!$F1273,tblXrate[],2,FALSE)","v":16027.125018698311},"Operations Analyst","Analyst","UK",{"$f":"VLOOKUP(Data!$J1273,tblCountries[[Actual]:[Mapping]],2,FALSE)","v":"India"},"All the 8 hours baby, all the 8!",3,"UK"]
[null,"ID1648","2012-06-03T16:48:54",12000,12000,"USD",{"$f":"Data!$E1304*VLOOKUP(Data!$F1304,tblXrate[],2,FALSE)","v":50000},"MIS ","Reporting","India",{"$f":"VLOOKUP(Data!$J1304,tblCountries[[Actual]:[Mapping]],2,FALSE)","v":"Singapore"},"All the 8 hours baby, all the 8!",3,"India"]
[null,"ID1652","2012-06-04T02:03:53","280$/ month",3360,"USD",{"$f":"Data!$E1307*VLOOKUP(Data!$F1307,tblXrate[],2,FALSE)","v":176585.52201983347},"service executive","Analyst","India",{"$f":"VLOOKUP(Data!$J1307,tblCountries[[Actual]:[Mapping]],2,FALSE)","v":"Germany"},"1 or 2 hours a day",3,"India"]
[null,"ID1672","2012-06-04T23:41:47",49000,49000,"USD",{"$f":"Data!$E1323*VLOOKUP(Data!$F1323,tblXrate[],2,FALSE)","v":49975.573163729154},"Marketing Data Analyst","Analyst","USA",{"$f":"VLOOKUP(Data!$J1323,tblCountries[[Actual]:[Mapping]],2,FALSE)","v":"Australia"},"2 to 3 hours per day",3,"USA"]
[null,"ID1673","2012-06-05T00:22:14",59000,59000,"USD",{"$f":"Data!$E1324*VLOOKUP(Data!$F1324,tblXrate[],2,FALSE)","v":101990.96564026357},"Category Leader","Manager","USA",{"$f":"VLOOKUP(Data!$J1324,tblCountries[[Actual]:[Mapping]],2,FALSE)","v":"Australia"},"1 or 2 hours a day",3,"USA"]
[null,"ID1697","2012-06-05T22:05:10",75000,75000,"USD",{"$f":"Data!$E1340*VLOOKUP(Data!$F1340,tblXrate[],2,FALSE)","v":109729.60187662003},"Directer of Sales Support","CXO or Top Mgmt.","USA",{"$f":"VLOOKUP(Data!$J1340,tblCountries[[Actual]:[Mapping]],2,FALSE)","v":"South Africa"},"2 to 3 hours per day",3,"USA"]
[null,"ID1721","2012-06-06T20:07:43","1.5 LINR",150000,"INR",{"$f":"Data!$E1358*VLOOKUP(Data!$F1358,tblXrate[],2,FALSE)","v":16027.125018698311},"MIS Executive","Reporting","India",{"$f":"VLOOKUP(Data!$J1358,tblCountries[[Actual]:[Mapping]],2,FALSE)","v":"India"},"All the 8 hours baby, all the 8!",3,"India"]
[null,"ID1738","2012-06-07T20:10:41",60000,60000,"AUD",{"$f":"Data!$E1372*VLOOKUP(Data!$F1372,tblXrate[],2,FALSE)","v":14246.333349954055},"business analyst","Analyst","Australia",{"$f":"VLOOKUP(Data!$J1372,tblCountries[[Actual]:[Mapping]],2,FALSE)","v":"India"},"2 to 3 hours per day",3,"Australia"]
[null,"ID1759","2012-06-08T18:52:06",1230000,1230000,"INR",{"$f":"Data!$E1392*VLOOKUP(Data!$F1392,tblXrate[],2,FALSE)","v":75000},"Financial Analyst ","Analyst","India",{"$f":"VLOOKUP(Data!$J1392,tblCountries[[Actual]:[Mapping]],2,FALSE)","v":"USA"},"All the 8 hours baby, all the 8!",3,"India"]
[null,"ID1760","2012-06-08T18:52:44",1130000,1130000,"INR",{"$f":"Data!$E1393*VLOOKUP(Data!$F1393,tblXrate[],2,FALSE)","v":101990.96564026357},"Financial Analyst ","Analyst","India",{"$f":"VLOOKUP(Data!$J1393,tblCountries[[Actual]:[Mapping]],2,FALSE)","v":"Australia"},"All the 8 hours baby, all the 8!",3,"India"]
[null,"ID1770","2012-06-09T03:20:15",52500,52500,"USD",{"$f":"Data!$E1402*VLOOKUP(Data!$F1402,tblXrate[],2,FALSE)","v":8903.9583437212841},"Data Management Solutions Supervisor","Manager","USA",{"$f":"VLOOKUP(Data!$J1402,tblCountries[[Actual]:[Mapping]],2,FALSE)","v":"India"},"All the 8 hours baby, all the 8!",3,"USA"]
[null,"ID1786","2012-06-11T05:59:09",27000,27000,"GBP",{"$f":"Data!$E1413*VLOOKUP(Data!$F1413,tblXrate[],2,FALSE)","v":91000},"assistant account manager","Manager","UK",{"$f":"VLOOKUP(Data!$J1413,tblCountries[[Actual]:[Mapping]],2,FALSE)","v":"USA"},"4 to 6 hours a day",3,"UK"]
[null,"ID1787","2012-06-11T05:59:55",27000,27000,"GBP",{"$f":"Data!$E1414*VLOOKUP(Data!$F1414,tblXrate[],2,FALSE)","v":40000},"assistant account manager","Manager","UK",{"$f":"VLOOKUP(Data!$J1414,tblCountries[[Actual]:[Mapping]],2,FALSE)","v":"USA"},"4 to 6 hours a day",3,"UK"]
[null,"ID1791","2012-06-11T17:54:22",200,2400,"USD",{"$f":"Data!$E1418*VLOOKUP(Data!$F1418,tblXrate[],2,FALSE)","v":90000},"computer operator","Analyst","India",{"$f":"VLOOKUP(Data!$J1418,tblCountries[[Actual]:[Mapping]],2,FALSE)","v":"USA"},"2 to 3 hours per day",3,"India"]
[null,"ID1801","2012-06-12T01:58:00",400000,400000,"INR",{"$f":"Data!$E1425*VLOOKUP(Data!$F1425,tblXrate[],2,FALSE)","v":58000},"business analyst","Analyst","India",{"$f":"VLOOKUP(Data!$J1425,tblCountries[[Actual]:[Mapping]],2,FALSE)","v":"USA"},"2 to 3 hours per day",3,"India"]
[null,"ID1807","2012-06-12T08:36:15",87000,87000,"USD",{"$f":"Data!$E1431*VLOOKUP(Data!$F1431,tblXrate[],2,FALSE)","v":70000},"Ð˜Ð¨ Ð¤Ñ‚Ñ„Ð´Ð½Ñ‹Ðµ","Misc.","USA",{"$f":"VLOOKUP(Data!$J1431,tblCountries[[Actual]:[Mapping]],2,FALSE)","v":"USA"},"4 to 6 hours a day",3,"USA"]
[null,"ID1809","2012-06-12T12:15:46",85000,85000,"USD",{"$f":"Data!$E1433*VLOOKUP(Data!$F1433,tblXrate[],2,FALSE)","v":40958.208381117904},"Lead Financial Analyst","Analyst","USA",{"$f":"VLOOKUP(Data!$J1433,tblCountries[[Actual]:[Mapping]],2,FALSE)","v":"India"},"All the 8 hours baby, all the 8!",3,"USA"]
[null,"ID1819","2012-06-12T21:58:21",4800,4800,"USD",{"$f":"Data!$E1442*VLOOKUP(Data!$F1442,tblXrate[],2,FALSE)","v":110332.47904470989},"Sr Executive","Manager","India",{"$f":"VLOOKUP(Data!$J1442,tblCountries[[Actual]:[Mapping]],2,FALSE)","v":"UK"},"All the 8 hours baby, all the 8!",3,"India"]
[null,"ID1849","2012-06-15T01:02:48",60000,60000,"USD",{"$f":"Data!$E1467*VLOOKUP(Data!$F1467,tblXrate[],2,FALSE)","v":75000},"Business Analyst","Analyst","USA",{"$f":"VLOOKUP(Data!$J1467,tblCountries[[Actual]:[Mapping]],2,FALSE)","v":"USA"},"2 to 3 hours per day",3,"USA"]
[null,"ID1888","2012-06-17T13:26:38","AUD63000",63000,"AUD",{"$f":"Data!$E1498*VLOOKUP(Data!$F1498,tblXrate[],2,FALSE)","v":96000},"Financial Modelling adviser","Accountant","Australia",{"$f":"VLOOKUP(Data!$J1498,tblCountries[[Actual]:[Mapping]],2,FALSE)","v":"USA"},"All the 8 hours baby, all the 8!",3,"Australia"]
[null,"ID1893","2012-06-18T14:27:59","$AUD 76300",76300,"AUD",{"$f":"Data!$E1501*VLOOKUP(Data!$F1501,tblXrate[],2,FALSE)","v":4149.2445881741187},"Operations Analyst","Analyst","Australia",{"$f":"VLOOKUP(Data!$J1501,tblCountries[[Actual]:[Mapping]],2,FALSE)","v":"India"},"All the 8 hours baby, all the 8!",3,"Australia"]
[null,"ID1903","2012-06-19T15:15:38",250000,250000,"INR",{"$f":"Data!$E1510*VLOOKUP(Data!$F1510,tblXrate[],2,FALSE)","v":108160},"MIS EXECUTIVE","Reporting","India",{"$f":"VLOOKUP(Data!$J1510,tblCountries[[Actual]:[Mapping]],2,FALSE)","v":"USA"},"4 to 6 hours a day",3,"India"]
[null,"ID1905","2012-06-19T18:17:42",25000,25000,"GBP",{"$f":"Data!$E1511*VLOOKUP(Data!$F1511,tblXrate[],2,FALSE)","v":50000},"Data Analyst","Analyst","UK",{"$f":"VLOOKUP(Data!$J1511,tblCountries[[Actual]:[Mapping]],2,FALSE)","v":"USA"},"4 to 6 hours a day",3,"UK"]
[null,"ID1912","2012-06-19T22:42:55",5000,5000,"USD",{"$f":"Data!$E1518*VLOOKUP(Data!$F1518,tblXrate[],2,FALSE)","v":41600},"abc","Misc.","India",{"$f":"VLOOKUP(Data!$J1518,tblCountries[[Actual]:[Mapping]],2,FALSE)","v":"USA"},"4 to 6 hours a day",3,"India"]
[null,"ID1915","2012-06-20T00:55:28",75000,75000,"USD",{"$f":"Data!$E1520*VLOOKUP(Data!$F1520,tblXrate[],2,FALSE)","v":8903.9583437212841},"Data Analyst","Analyst","USA",{"$f":"VLOOKUP(Data!$J1520,tblCountries[[Actual]:[Mapping]],2,FALSE)","v":"India"},"1 or 2 hours a day",3,"USA"]
[null,"ID1924","2012-06-20T12:53:56",180000,180000,"INR",{"$f":"Data!$E1528*VLOOKUP(Data!$F1528,tblXrate[],2,FALSE)","v":3561.5833374885137},"Customer Resolution","Analyst","India",{"$f":"VLOOKUP(Data!$J1528,tblCountries[[Actual]:[Mapping]],2,FALSE)","v":"India"},"4 to 6 hours a day",3,"India"]
[null,"ID1930","2012-06-21T04:06:15",40000,40000,"USD",{"$f":"Data!$E1530*VLOOKUP(Data!$F1530,tblXrate[],2,FALSE)","v":114000},"Corporate Trainer","Analyst","USA",{"$f":"VLOOKUP(Data!$J1530,tblCountries[[Actual]:[Mapping]],2,FALSE)","v":"USA"},"1 or 2 hours a day",3,"USA"]
[null,"ID0774","2012-05-26T17:51:27",48000,48000,"USD",{"$f":"Data!$E1654*VLOOKUP(Data!$F1654,tblXrate[],2,FALSE)","v":78668.921842426149},"Consultant","Consultant","Singapore","Other Countries","All the 8 hours baby, all the 8!",3,"Singapore"]
[null,"ID0822","2012-05-26T22:45:14","R$3.000,00",300000,"BRL",{"$f":"Data!$E1661*VLOOKUP(Data!$F1661,tblXrate[],2,FALSE)","v":44132.991617883956},"Market Intelligence Analyst","Analyst","Brazil","Other Countries","All the 8 hours baby, all the 8!",3,"Brazil"]
[null,"ID0883","2012-05-27T12:41:29","US 2130",25560,"USD",{"$f":"Data!$E1678*VLOOKUP(Data!$F1678,tblXrate[],2,FALSE)","v":7123.1666749770275},"Training Coordinator","Manager","saudi arabia","Other Countries","4 to 6 hours a day",3,"Saudi Arabia"]
[null,"ID0944","2012-05-28T00:10:43",63200,63200,"EUR",{"$f":"Data!$E1697*VLOOKUP(Data!$F1697,tblXrate[],2,FALSE)","v":90000},"Consultant","Consultant","France","Other Countries","4 to 6 hours a day",3,"France"]
[null,"ID0951","2012-05-28T01:17:17","42000 â‚¬",42000,"EUR",{"$f":"Data!$E1699*VLOOKUP(Data!$F1699,tblXrate[],2,FALSE)","v":72000},"Consultant","Consultant","Germany","Other Countries","2 to 3 hours per day",3,"Germany"]
[null,"ID0988","2012-05-28T08:39:53",3000,36000,"USD",{"$f":"Data!$E1707*VLOOKUP(Data!$F1707,tblXrate[],2,FALSE)","v":108169.76753333595},"Project manager","Manager","malaysia","Other Countries","1 or 2 hours a day",3,"malaysia"]
[null,"ID0997","2012-05-28T09:40:10","US$12,000/year",12000,"USD",{"$f":"Data!$E1709*VLOOKUP(Data!$F1709,tblXrate[],2,FALSE)","v":5000},"Manager","Manager","Asia","Other Countries","All the 8 hours baby, all the 8!",3,"Asia"]
[null,"ID1014","2012-05-28T11:37:17","LKR 240000",240000,"LKR",{"$f":"Data!$E1712*VLOOKUP(Data!$F1712,tblXrate[],2,FALSE)","v":50000},"Management Trainee","Manager","Sri Lanka","Other Countries","4 to 6 hours a day",3,"Sri Lanka"]
[null,"ID1017","2012-05-28T11:58:39","R308 500",308500,"ZAR",{"$f":"Data!$E1713*VLOOKUP(Data!$F1713,tblXrate[],2,FALSE)","v":8903.9583437212841},"Management Information Consultant","Manager","South Africa","Other Countries","All the 8 hours baby, all the 8!",3,"South Africa"]
[null,"ID1052","2012-05-28T14:12:35","12000 $",12000,"USD",{"$f":"Data!$E1721*VLOOKUP(Data!$F1721,tblXrate[],2,FALSE)","v":52000},"planning & Sales Control emploee","Controller","Iran","Other Countries","4 to 6 hours a day",3,"iran"]
[null,"ID1165","2012-05-28T22:33:29",600000,600000,"DOP",{"$f":"Data!$E1745*VLOOKUP(Data!$F1745,tblXrate[],2,FALSE)","v":299473.87169278396},"Analista de Produccion","Analyst","Republica Dominicana","Other Countries","All the 8 hours baby, all the 8!",3,"Republica Dominicana"]
[null,"ID1201","2012-05-28T23:51:37","Euro 15.000",15000,"EUR",{"$f":"Data!$E1754*VLOOKUP(Data!$F1754,tblXrate[],2,FALSE)","v":77000},"business consultant","Consultant","Italy","Other Countries","4 to 6 hours a day",3,"italy"]
[null,"ID1242","2012-05-29T04:08:45",71000,71000,"EUR",{"$f":"Data!$E1763*VLOOKUP(Data!$F1763,tblXrate[],2,FALSE)","v":150000},"Consultant","Consultant","Germany","Other Countries","1 or 2 hours a day",3,"Germany"]
[null,"ID1353","2012-05-29T18:35:10","9 067",9067,"EUR",{"$f":"Data!$E1790*VLOOKUP(Data!$F1790,tblXrate[],2,FALSE)","v":50000},"assistant","Analyst","Hungary","Other Countries","2 to 3 hours per day",3,"Hungary"]
[null,"ID1446","2012-05-30T11:20:33","MYR60000",60000,"MYR",{"$f":"Data!$E1799*VLOOKUP(Data!$F1799,tblXrate[],2,FALSE)","v":41731},"Liquidity Management Executive","Manager","Malaysia","Other Countries","4 to 6 hours a day",3,"malaysia"]
[null,"ID1579","2012-06-01T05:52:11",17728.57,17728,"USD",{"$f":"Data!$E1828*VLOOKUP(Data!$F1828,tblXrate[],2,FALSE)","v":15500},"Financial analyst","Analyst","Mexico","Other Countries","4 to 6 hours a day",3,"Mexico"]
[null,"ID1645","2012-06-03T14:27:29",4019,4019,"USD",{"$f":"Data!$E1841*VLOOKUP(Data!$F1841,tblXrate[],2,FALSE)","v":27221.92126875931},"Clinical Intake Specialist","Specialist","Philippines","Other Countries","2 to 3 hours per day",3,"Philippines"]
[null,"ID1650","2012-06-03T19:40:18",86000,86000,"USD",{"$f":"Data!$E1842*VLOOKUP(Data!$F1842,tblXrate[],2,FALSE)","v":43200},"Analyst","Analyst","Philippines","Other Countries","All the 8 hours baby, all the 8!",3,"Philippines"]
[null,"ID1699","2012-06-05T22:50:20",40000,40000,"EUR",{"$f":"Data!$E1854*VLOOKUP(Data!$F1854,tblXrate[],2,FALSE)","v":22867.189901848938},"Financial Analyst","Analyst","Germany","Other Countries","2 to 3 hours per day",3,"Germany"]
[null,"ID1772","2012-06-09T20:38:03",1500,18000,"USD",{"$f":"Data!$E1862*VLOOKUP(Data!$F1862,tblXrate[],2,FALSE)","v":35000},"accountant","Accountant","uae","Other Countries","All the 8 hours baby, all the 8!",3,"UAE"]
[null,"ID1782","2012-06-10T17:21:08",72000,72000,"EUR",{"$f":"Data!$E1866*VLOOKUP(Data!$F1866,tblXrate[],2,FALSE)","v":30000},"regional sales manager","Manager","croatia","Other Countries","1 or 2 hours a day",3,"Croatia"]
[null,"ID1846","2012-06-14T22:03:05",1720,20640,"USD",{"$f":"Data!$E1873*VLOOKUP(Data!$F1873,tblXrate[],2,FALSE)","v":24000},"Programme Officer","Manager","Singapore","Other Countries","4 to 6 hours a day",3,"Singapore"]
[null,"ID1904","2012-06-19T17:01:38","52,224.00ETB",52224,"ETB",{"$f":"Data!$E1885*VLOOKUP(Data!$F1885,tblXrate[],2,FALSE)","v":50000},"Project Costing &Dashboard reporting","Reporting","Ethiopia","Other Countries","4 to 6 hours a day",3,"Ethiopia"]
[null,"ID0730","2012-05-26T15:06:00",4.8,480000,"INR",{"$f":"Data!$E609*VLOOKUP(Data!$F609,tblXrate[],2,FALSE)","v":6410.8500074793246},"Asst Mngr","Analyst","India",{"$f":"VLOOKUP(Data!$J609,tblCountries[[Actual]:[Mapping]],2,FALSE)","v":"India"},"2 to 3 hours per day",3.5,"India"]
[null,"ID0851","2012-05-27T01:46:00",650000,650000,"INR",{"$f":"Data!$E704*VLOOKUP(Data!$F704,tblXrate[],2,FALSE)","v":76223.966339496474},"Financial Analyist","Analyst","India",{"$f":"VLOOKUP(Data!$J704,tblCountries[[Actual]:[Mapping]],2,FALSE)","v":"Netherlands"},"All the 8 hours baby, all the 8!",3.5,"India"]
[null,"ID0904","2012-05-27T15:26:34","180000 INR",180000,"INR",{"$f":"Data!$E738*VLOOKUP(Data!$F738,tblXrate[],2,FALSE)","v":96000},"Executive","Analyst","India",{"$f":"VLOOKUP(Data!$J738,tblCountries[[Actual]:[Mapping]],2,FALSE)","v":"India"},"2 to 3 hours per day",3.5,"India"]
[null,"ID1029","2012-05-28T12:47:20",120000,120000,"INR",{"$f":"Data!$E826*VLOOKUP(Data!$F826,tblXrate[],2,FALSE)","v":85000},"Audit Assistant","Analyst","India",{"$f":"VLOOKUP(Data!$J826,tblCountries[[Actual]:[Mapping]],2,FALSE)","v":"USA"},"2 to 3 hours per day",3.5,"India"]
[null,"ID1036","2012-05-28T13:05:39",210000,210000,"INR",{"$f":"Data!$E832*VLOOKUP(Data!$F832,tblXrate[],2,FALSE)","v":16917.52085307044},"MIS executive","Reporting","India",{"$f":"VLOOKUP(Data!$J832,tblCountries[[Actual]:[Mapping]],2,FALSE)","v":"India"},"All the 8 hours baby, all the 8!",3.5,"India"]
[null,"ID1078","2012-05-28T15:29:24","INR 2.5 Lakh",250000,"INR",{"$f":"Data!$E863*VLOOKUP(Data!$F863,tblXrate[],2,FALSE)","v":17807.916687442568},"SR. MIS ","Reporting","India",{"$f":"VLOOKUP(Data!$J863,tblCountries[[Actual]:[Mapping]],2,FALSE)","v":"India"},"All the 8 hours baby, all the 8!",3.5,"India"]
[null,"ID1589","2012-06-01T13:03:18",44000,44000,"USD",{"$f":"Data!$E1259*VLOOKUP(Data!$F1259,tblXrate[],2,FALSE)","v":50815.977559664309},"Quality Assurance Analyst","Analyst","USA",{"$f":"VLOOKUP(Data!$J1259,tblCountries[[Actual]:[Mapping]],2,FALSE)","v":"Austria"},"4 to 6 hours a day",3.5,"USA"]
[null,"ID1920","2012-06-20T03:52:40",50000,50000,"USD",{"$f":"Data!$E1525*VLOOKUP(Data!$F1525,tblXrate[],2,FALSE)","v":50000},"Operations Analyst ","Analyst","USA",{"$f":"VLOOKUP(Data!$J1525,tblCountries[[Actual]:[Mapping]],2,FALSE)","v":"USA"},"All the 8 hours baby, all the 8!",3.5,"USA"]
[null,"ID0629","2012-05-26T11:09:27",4200,4200,"USD",{"$f":"Data!$E521*VLOOKUP(Data!$F521,tblXrate[],2,FALSE)","v":63047.130882691366},"MIS Executive","Reporting","India",{"$f":"VLOOKUP(Data!$J521,tblCountries[[Actual]:[Mapping]],2,FALSE)","v":"UK"},"All the 8 hours baby, all the 8!",4,"India"]
[null,"ID0635","2012-05-26T11:31:52",78000,78000,"AUD",{"$f":"Data!$E527*VLOOKUP(Data!$F527,tblXrate[],2,FALSE)","v":70000},"Corporate Accountant","Accountant","Australia",{"$f":"VLOOKUP(Data!$J527,tblCountries[[Actual]:[Mapping]],2,FALSE)","v":"USA"},"All the 8 hours baby, all the 8!",4,"Australia"]
[null,"ID0647","2012-05-26T11:55:17",4000,4000,"USD",{"$f":"Data!$E539*VLOOKUP(Data!$F539,tblXrate[],2,FALSE)","v":19831.432821021317},"MIS Executive","Reporting","India",{"$f":"VLOOKUP(Data!$J539,tblCountries[[Actual]:[Mapping]],2,FALSE)","v":"Egypt"},"All the 8 hours baby, all the 8!",4,"India"]
[null,"ID0679","2012-05-26T13:02:50",470000,470000,"INR",{"$f":"Data!$E565*VLOOKUP(Data!$F565,tblXrate[],2,FALSE)","v":6000},"Consultant","Consultant","India",{"$f":"VLOOKUP(Data!$J565,tblCountries[[Actual]:[Mapping]],2,FALSE)","v":"Armenia"},"All the 8 hours baby, all the 8!",4,"India"]
[null,"ID0686","2012-05-26T13:16:21",13000,13000,"USD",{"$f":"Data!$E571*VLOOKUP(Data!$F571,tblXrate[],2,FALSE)","v":69871.969144538423},"Analyst","Analyst","India",{"$f":"VLOOKUP(Data!$J571,tblCountries[[Actual]:[Mapping]],2,FALSE)","v":"Netherlands"},"1 or 2 hours a day",4,"India"]
[null,"ID0696","2012-05-26T13:29:35","250000 rupees",250000,"INR",{"$f":"Data!$E579*VLOOKUP(Data!$F579,tblXrate[],2,FALSE)","v":31250},"MIS executive","Reporting","India",{"$f":"VLOOKUP(Data!$J579,tblCountries[[Actual]:[Mapping]],2,FALSE)","v":"India"},"All the 8 hours baby, all the 8!",4,"India"]
[null,"ID0705","2012-05-26T13:57:11",720000,720000,"INR",{"$f":"Data!$E588*VLOOKUP(Data!$F588,tblXrate[],2,FALSE)","v":10000},"Cost Accountant","Accountant","India",{"$f":"VLOOKUP(Data!$J588,tblCountries[[Actual]:[Mapping]],2,FALSE)","v":"India"},"4 to 6 hours a day",4,"India"]
[null,"ID0709","2012-05-26T14:10:51","4,80,000 Ruppes",480000,"INR",{"$f":"Data!$E592*VLOOKUP(Data!$F592,tblXrate[],2,FALSE)","v":101990.96564026357},"Business Analyst","Analyst","India",{"$f":"VLOOKUP(Data!$J592,tblCountries[[Actual]:[Mapping]],2,FALSE)","v":"Australia"},"4 to 6 hours a day",4,"India"]
[null,"ID0724","2012-05-26T14:58:24","Rs.4lk ",400000,"INR",{"$f":"Data!$E604*VLOOKUP(Data!$F604,tblXrate[],2,FALSE)","v":80000},"sr. mis executive","Reporting","India",{"$f":"VLOOKUP(Data!$J604,tblCountries[[Actual]:[Mapping]],2,FALSE)","v":"USA"},"All the 8 hours baby, all the 8!",4,"India"]
[null,"ID0733","2012-05-26T15:21:41",180000,180000,"INR",{"$f":"Data!$E612*VLOOKUP(Data!$F612,tblXrate[],2,FALSE)","v":6410.8500074793246},"Accountant","Accountant","India",{"$f":"VLOOKUP(Data!$J612,tblCountries[[Actual]:[Mapping]],2,FALSE)","v":"India"},"All the 8 hours baby, all the 8!",4,"India"]
[null,"ID0768","2012-05-26T17:24:41",41000,41000,"USD",{"$f":"Data!$E638*VLOOKUP(Data!$F638,tblXrate[],2,FALSE)","v":118000},"Business Analyst","Analyst","USA",{"$f":"VLOOKUP(Data!$J638,tblCountries[[Actual]:[Mapping]],2,FALSE)","v":"USA"},"All the 8 hours baby, all the 8!",4,"USA"]
[null,"ID0773","2012-05-26T17:49:17","Rs. 300000",300000,"INR",{"$f":"Data!$E642*VLOOKUP(Data!$F642,tblXrate[],2,FALSE)","v":4914.9850057341491},"OPEX CONTROL","Controller","India",{"$f":"VLOOKUP(Data!$J642,tblCountries[[Actual]:[Mapping]],2,FALSE)","v":"India"},"All the 8 hours baby, all the 8!",4,"India"]
[null,"ID0787","2012-05-26T19:34:12",240000,240000,"INR",{"$f":"Data!$E653*VLOOKUP(Data!$F653,tblXrate[],2,FALSE)","v":177600},"Analyst","Analyst","India",{"$f":"VLOOKUP(Data!$J653,tblCountries[[Actual]:[Mapping]],2,FALSE)","v":"Lesotho"},"All the 8 hours baby, all the 8!",4,"India"]
[null,"ID0802","2012-05-26T21:13:02",600000,600000,"INR",{"$f":"Data!$E667*VLOOKUP(Data!$F667,tblXrate[],2,FALSE)","v":2564.3400029917298},"MIS Analyst","Analyst","India",{"$f":"VLOOKUP(Data!$J667,tblCountries[[Actual]:[Mapping]],2,FALSE)","v":"India"},"All the 8 hours baby, all the 8!",4,"India"]
[null,"ID0828","2012-05-26T23:03:59","30000 Rs",360000,"INR",{"$f":"Data!$E686*VLOOKUP(Data!$F686,tblXrate[],2,FALSE)","v":4314.929445034084},"Application Developer","Analyst","India",{"$f":"VLOOKUP(Data!$J686,tblCountries[[Actual]:[Mapping]],2,FALSE)","v":"India"},"All the 8 hours baby, all the 8!",4,"India"]
[null,"ID0858","2012-05-27T03:25:53",40000,40000,"USD",{"$f":"Data!$E710*VLOOKUP(Data!$F710,tblXrate[],2,FALSE)","v":21369.500024931083},"Data Research Assistant","Analyst","USA",{"$f":"VLOOKUP(Data!$J710,tblCountries[[Actual]:[Mapping]],2,FALSE)","v":"India"},"All the 8 hours baby, all the 8!",4,"USA"]
[null,"ID0882","2012-05-27T12:37:02",40000,40000,"EUR",{"$f":"Data!$E724*VLOOKUP(Data!$F724,tblXrate[],2,FALSE)","v":106000},"Medical information analist","Analyst","Netherlands",{"$f":"VLOOKUP(Data!$J724,tblCountries[[Actual]:[Mapping]],2,FALSE)","v":"Denmark"},"4 to 6 hours a day",4,"Netherlands"]
[null,"ID0886","2012-05-27T13:27:19","Rs. 35000",420000,"PKR",{"$f":"Data!$E727*VLOOKUP(Data!$F727,tblXrate[],2,FALSE)","v":22438.012440857987},"Assistant Manager","Manager","Pakistan",{"$f":"VLOOKUP(Data!$J727,tblCountries[[Actual]:[Mapping]],2,FALSE)","v":"Australia"},"All the 8 hours baby, all the 8!",4,"Pakistan"]
[null,"ID0923","2012-05-27T20:43:13","Rs. 144000",144000,"INR",{"$f":"Data!$E752*VLOOKUP(Data!$F752,tblXrate[],2,FALSE)","v":8476.5683432226633},"operation supervisor","Controller","India",{"$f":"VLOOKUP(Data!$J752,tblCountries[[Actual]:[Mapping]],2,FALSE)","v":"India"},"4 to 6 hours a day",4,"India"]
[null,"ID0945","2012-05-28T00:17:26",70000,70000,"USD",{"$f":"Data!$E764*VLOOKUP(Data!$F764,tblXrate[],2,FALSE)","v":38111.983169748237},"Client Manager","Manager","USA",{"$f":"VLOOKUP(Data!$J764,tblCountries[[Actual]:[Mapping]],2,FALSE)","v":"Netherlands"},"4 to 6 hours a day",4,"USA"]
[null,"ID0949","2012-05-28T00:43:40","600000 INR",600000,"INR",{"$f":"Data!$E767*VLOOKUP(Data!$F767,tblXrate[],2,FALSE)","v":45000},"Executive","Analyst","India",{"$f":"VLOOKUP(Data!$J767,tblCountries[[Actual]:[Mapping]],2,FALSE)","v":"Pakistan"},"2 to 3 hours per day",4,"India"]
[null,"ID0953","2012-05-28T01:30:29",57000,57000,"USD",{"$f":"Data!$E768*VLOOKUP(Data!$F768,tblXrate[],2,FALSE)","v":61614.372791092981},"Construction Engineer","Engineer","USA",{"$f":"VLOOKUP(Data!$J768,tblCountries[[Actual]:[Mapping]],2,FALSE)","v":"Netherlands"},"2 to 3 hours per day",4,"USA"]
[null,"ID0955","2012-05-28T02:25:13",75000,75000,"EUR",{"$f":"Data!$E770*VLOOKUP(Data!$F770,tblXrate[],2,FALSE)","v":36000},"Risk analyst","Analyst","Netherlands",{"$f":"VLOOKUP(Data!$J770,tblCountries[[Actual]:[Mapping]],2,FALSE)","v":"USA"},"4 to 6 hours a day",4,"Netherlands"]
[null,"ID0979","2012-05-28T07:33:29",65000,65000,"AUD",{"$f":"Data!$E787*VLOOKUP(Data!$F787,tblXrate[],2,FALSE)","v":65000},"Data Analyst","Analyst","Australia",{"$f":"VLOOKUP(Data!$J787,tblCountries[[Actual]:[Mapping]],2,FALSE)","v":"USA"},"4 to 6 hours a day",4,"Australia"]
[null,"ID0990","2012-05-28T08:47:39","AU$52.000",52000,"AUD",{"$f":"Data!$E796*VLOOKUP(Data!$F796,tblXrate[],2,FALSE)","v":122389.15876831629},"Shipping Administrator","Analyst","Australia",{"$f":"VLOOKUP(Data!$J796,tblCountries[[Actual]:[Mapping]],2,FALSE)","v":"Australia"},"4 to 6 hours a day",4,"Australia"]
[null,"ID0996","2012-05-28T09:38:29",35000,35000,"CAD",{"$f":"Data!$E801*VLOOKUP(Data!$F801,tblXrate[],2,FALSE)","v":9490.1984044603923},"Reporting Analyst","Analyst","Canada",{"$f":"VLOOKUP(Data!$J801,tblCountries[[Actual]:[Mapping]],2,FALSE)","v":"Brazil"},"All the 8 hours baby, all the 8!",4,"Canada"]
[null,"ID1016","2012-05-28T11:41:11",15000,15000,"USD",{"$f":"Data!$E817*VLOOKUP(Data!$F817,tblXrate[],2,FALSE)","v":10684.750012465542},"Operations Management","Manager","India",{"$f":"VLOOKUP(Data!$J817,tblCountries[[Actual]:[Mapping]],2,FALSE)","v":"India"},"4 to 6 hours a day",4,"India"]
[null,"ID1026","2012-05-28T12:32:12",300000,300000,"PKR",{"$f":"Data!$E823*VLOOKUP(Data!$F823,tblXrate[],2,FALSE)","v":21369.500024931083},"Banker","Manager","Pakistan",{"$f":"VLOOKUP(Data!$J823,tblCountries[[Actual]:[Mapping]],2,FALSE)","v":"India"},"4 to 6 hours a day",4,"Pakistan"]
[null,"ID1047","2012-05-28T13:43:01",1.8,180000,"INR",{"$f":"Data!$E840*VLOOKUP(Data!$F840,tblXrate[],2,FALSE)","v":51497.005988023957},"MIS EXCUTIVE","Reporting","India",{"$f":"VLOOKUP(Data!$J840,tblCountries[[Actual]:[Mapping]],2,FALSE)","v":"Kenya"},"All the 8 hours baby, all the 8!",4,"India"]
[null,"ID1056","2012-05-28T14:21:27",50000,50000,"AUD",{"$f":"Data!$E846*VLOOKUP(Data!$F846,tblXrate[],2,FALSE)","v":104030.78495306884},"BA","Analyst","Australia",{"$f":"VLOOKUP(Data!$J846,tblCountries[[Actual]:[Mapping]],2,FALSE)","v":"Australia"},"4 to 6 hours a day",4,"Australia"]
[null,"ID1082","2012-05-28T15:34:12",140000,140000,"INR",{"$f":"Data!$E867*VLOOKUP(Data!$F867,tblXrate[],2,FALSE)","v":5342.3750062327708},"Accountant","Accountant","India",{"$f":"VLOOKUP(Data!$J867,tblCountries[[Actual]:[Mapping]],2,FALSE)","v":"India"},"4 to 6 hours a day",4,"India"]
[null,"ID1097","2012-05-28T16:07:51","Â£30000",30000,"GBP",{"$f":"Data!$E882*VLOOKUP(Data!$F882,tblXrate[],2,FALSE)","v":118213.37040504631},"Information Analyst","Analyst","UK",{"$f":"VLOOKUP(Data!$J882,tblCountries[[Actual]:[Mapping]],2,FALSE)","v":"UK"},"4 to 6 hours a day",4,"UK"]
[null,"ID1105","2012-05-28T16:28:25",3500,3500,"USD",{"$f":"Data!$E889*VLOOKUP(Data!$F889,tblXrate[],2,FALSE)","v":53590.061250287661},"OFFICER","Manager","PAKISTAN",{"$f":"VLOOKUP(Data!$J889,tblCountries[[Actual]:[Mapping]],2,FALSE)","v":"UK"},"4 to 6 hours a day",4,"Pakistan"]
[null,"ID1144","2012-05-28T19:19:51",5000,60000,"USD",{"$f":"Data!$E916*VLOOKUP(Data!$F916,tblXrate[],2,FALSE)","v":17807.916687442568},"Business Anaylyst","Analyst","USA",{"$f":"VLOOKUP(Data!$J916,tblCountries[[Actual]:[Mapping]],2,FALSE)","v":"India"},"2 to 3 hours per day",4,"USA"]
[null,"ID1164","2012-05-28T22:25:04","Â£51,000/$81,600",81600,"USD",{"$f":"Data!$E930*VLOOKUP(Data!$F930,tblXrate[],2,FALSE)","v":17807.916687442568},"Business Analyst - Central Finance","Analyst","UK",{"$f":"VLOOKUP(Data!$J930,tblCountries[[Actual]:[Mapping]],2,FALSE)","v":"India"},"4 to 6 hours a day",4,"UK"]
[null,"ID1175","2012-05-28T22:44:48","Â£32000",32000,"GBP",{"$f":"Data!$E938*VLOOKUP(Data!$F938,tblXrate[],2,FALSE)","v":60000},"Service Analyst","Analyst","UK",{"$f":"VLOOKUP(Data!$J938,tblCountries[[Actual]:[Mapping]],2,FALSE)","v":"Canada"},"4 to 6 hours a day",4,"UK"]
[null,"ID1216","2012-05-29T00:30:42",2600000,2600000,"INR",{"$f":"Data!$E968*VLOOKUP(Data!$F968,tblXrate[],2,FALSE)","v":59819.107020370408},"Practice Manager","Manager","India",{"$f":"VLOOKUP(Data!$J968,tblCountries[[Actual]:[Mapping]],2,FALSE)","v":"New Zealand"},"4 to 6 hours a day",4,"India"]
[null,"ID1270","2012-05-29T09:37:40","AUD $43000",43000,"USD",{"$f":"Data!$E1008*VLOOKUP(Data!$F1008,tblXrate[],2,FALSE)","v":81000},"Operations Support Officer","Manager","Australia",{"$f":"VLOOKUP(Data!$J1008,tblCountries[[Actual]:[Mapping]],2,FALSE)","v":"USA"},"2 to 3 hours per day",4,"Australia"]
[null,"ID1294","2012-05-29T13:06:30",8000,8000,"USD",{"$f":"Data!$E1026*VLOOKUP(Data!$F1026,tblXrate[],2,FALSE)","v":24000},"Data Analyst","Analyst","India",{"$f":"VLOOKUP(Data!$J1026,tblCountries[[Actual]:[Mapping]],2,FALSE)","v":"Saudi Arabia"},"All the 8 hours baby, all the 8!",4,"India"]
[null,"ID1332","2012-05-29T16:39:11","Â£45000",45000,"GBP",{"$f":"Data!$E1053*VLOOKUP(Data!$F1053,tblXrate[],2,FALSE)","v":5000},"Senior Consultant","Consultant","UK",{"$f":"VLOOKUP(Data!$J1053,tblCountries[[Actual]:[Mapping]],2,FALSE)","v":"Aruba"},"2 to 3 hours per day",4,"UK"]
[null,"ID1334","2012-05-29T16:49:44",275000,275000,"INR",{"$f":"Data!$E1054*VLOOKUP(Data!$F1054,tblXrate[],2,FALSE)","v":15600},"TL WFM","Manager","India",{"$f":"VLOOKUP(Data!$J1054,tblCountries[[Actual]:[Mapping]],2,FALSE)","v":"Kuwait "},"All the 8 hours baby, all the 8!",4,"India"]
[null,"ID1345","2012-05-29T17:45:59","16,00,000",1600000,"INR",{"$f":"Data!$E1060*VLOOKUP(Data!$F1060,tblXrate[],2,FALSE)","v":124518.08349331544},"Senior Associate ","Analyst","India",{"$f":"VLOOKUP(Data!$J1060,tblCountries[[Actual]:[Mapping]],2,FALSE)","v":"UK"},"2 to 3 hours per day",4,"India"]
[null,"ID1448","2012-05-30T11:43:50",300000,300000,"INR",{"$f":"Data!$E1152*VLOOKUP(Data!$F1152,tblXrate[],2,FALSE)","v":38111.983169748237},"accountant","Accountant","India",{"$f":"VLOOKUP(Data!$J1152,tblCountries[[Actual]:[Mapping]],2,FALSE)","v":"Belgium"},"4 to 6 hours a day",4,"India"]
[null,"ID1451","2012-05-30T12:35:08","Rs. 900000 per annum",900000,"INR",{"$f":"Data!$E1155*VLOOKUP(Data!$F1155,tblXrate[],2,FALSE)","v":63519.971949580387},"Data Analyst","Analyst","India",{"$f":"VLOOKUP(Data!$J1155,tblCountries[[Actual]:[Mapping]],2,FALSE)","v":"italy"},"4 to 6 hours a day",4,"India"]
[null,"ID1459","2012-05-30T13:41:41",60000,60000,"USD",{"$f":"Data!$E1161*VLOOKUP(Data!$F1161,tblXrate[],2,FALSE)","v":100000},"Business Intelligence Supervisor","Manager","USA",{"$f":"VLOOKUP(Data!$J1161,tblCountries[[Actual]:[Mapping]],2,FALSE)","v":"UAE"},"2 to 3 hours per day",4,"USA"]
[null,"ID1487","2012-05-30T19:43:43",25000,25000,"USD",{"$f":"Data!$E1182*VLOOKUP(Data!$F1182,tblXrate[],2,FALSE)","v":76906.906752939132},"data analyst","Analyst","India",{"$f":"VLOOKUP(Data!$J1182,tblCountries[[Actual]:[Mapping]],2,FALSE)","v":"Denmark"},"All the 8 hours baby, all the 8!",4,"India"]
[null,"ID1497","2012-05-30T21:26:04",5000,5000,"USD",{"$f":"Data!$E1189*VLOOKUP(Data!$F1189,tblXrate[],2,FALSE)","v":40000},"Officer MIS","Manager","India",{"$f":"VLOOKUP(Data!$J1189,tblCountries[[Actual]:[Mapping]],2,FALSE)","v":"USA"},"All the 8 hours baby, all the 8!",4,"India"]
[null,"ID1513","2012-05-31T01:45:48","Rs 5,36,000",536000,"INR",{"$f":"Data!$E1201*VLOOKUP(Data!$F1201,tblXrate[],2,FALSE)","v":101990.96564026357},"Team Lead","Manager","India",{"$f":"VLOOKUP(Data!$J1201,tblCountries[[Actual]:[Mapping]],2,FALSE)","v":"Australia"},"4 to 6 hours a day",4,"India"]
[null,"ID1546","2012-05-31T17:21:45",34000,34000,"USD",{"$f":"Data!$E1227*VLOOKUP(Data!$F1227,tblXrate[],2,FALSE)","v":45000},"Sr Analyst","Analyst","India",{"$f":"VLOOKUP(Data!$J1227,tblCountries[[Actual]:[Mapping]],2,FALSE)","v":"USA"},"All the 8 hours baby, all the 8!",4,"India"]
[null,"ID1567","2012-06-01T00:23:54",30000,30000,"USD",{"$f":"Data!$E1243*VLOOKUP(Data!$F1243,tblXrate[],2,FALSE)","v":120000},"SME","Analyst","India",{"$f":"VLOOKUP(Data!$J1243,tblCountries[[Actual]:[Mapping]],2,FALSE)","v":"USA"},"All the 8 hours baby, all the 8!",4,"India"]
[null,"ID1595","2012-06-01T18:18:31","Rs 1000000",1000000,"INR",{"$f":"Data!$E1264*VLOOKUP(Data!$F1264,tblXrate[],2,FALSE)","v":76223.966339496474},"Senior Analyst","Analyst","India",{"$f":"VLOOKUP(Data!$J1264,tblCountries[[Actual]:[Mapping]],2,FALSE)","v":"Europe"},"All the 8 hours baby, all the 8!",4,"India"]
[null,"ID1636","2012-06-03T04:14:45","Rs. 3.70 lacs",3700000,"INR",{"$f":"Data!$E1296*VLOOKUP(Data!$F1296,tblXrate[],2,FALSE)","v":62000},"Senior Officer","Manager","India",{"$f":"VLOOKUP(Data!$J1296,tblCountries[[Actual]:[Mapping]],2,FALSE)","v":"USA"},"All the 8 hours baby, all the 8!",4,"India"]
[null,"ID1643","2012-06-03T12:27:07",100000,100000,"USD",{"$f":"Data!$E1300*VLOOKUP(Data!$F1300,tblXrate[],2,FALSE)","v":63047.130882691366},"Consultant","Consultant","USA",{"$f":"VLOOKUP(Data!$J1300,tblCountries[[Actual]:[Mapping]],2,FALSE)","v":"UK"},"2 to 3 hours per day",4,"USA"]
[null,"ID1647","2012-06-03T14:52:21","INR 1000000",1000000,"INR",{"$f":"Data!$E1303*VLOOKUP(Data!$F1303,tblXrate[],2,FALSE)","v":143565.85684888897},"Senior Associate, Finance","Analyst","India",{"$f":"VLOOKUP(Data!$J1303,tblCountries[[Actual]:[Mapping]],2,FALSE)","v":"New Zealand"},"All the 8 hours baby, all the 8!",4,"India"]
[null,"ID1649","2012-06-03T17:39:14","Rs. 125000",125000,"INR",{"$f":"Data!$E1305*VLOOKUP(Data!$F1305,tblXrate[],2,FALSE)","v":106815.148267971},"No","Analyst","India",{"$f":"VLOOKUP(Data!$J1305,tblCountries[[Actual]:[Mapping]],2,FALSE)","v":"Denmark"},"2 to 3 hours per day",4,"India"]
[null,"ID1686","2012-06-05T17:59:39","INR 450000",450000,"INR",{"$f":"Data!$E1332*VLOOKUP(Data!$F1332,tblXrate[],2,FALSE)","v":86692.320794224041},"Sr Executive - MIS","Reporting","India",{"$f":"VLOOKUP(Data!$J1332,tblCountries[[Actual]:[Mapping]],2,FALSE)","v":"Australia"},"All the 8 hours baby, all the 8!",4,"India"]
[null,"ID1701","2012-06-06T00:49:15",45000,45000,"USD",{"$f":"Data!$E1343*VLOOKUP(Data!$F1343,tblXrate[],2,FALSE)","v":48000},"Bussiness Analyst","Analyst","USA",{"$f":"VLOOKUP(Data!$J1343,tblCountries[[Actual]:[Mapping]],2,FALSE)","v":"Pakistan"},"2 to 3 hours per day",4,"USA"]
[null,"ID1702","2012-06-06T01:04:35","4 lacs INR",400000,"INR",{"$f":"Data!$E1344*VLOOKUP(Data!$F1344,tblXrate[],2,FALSE)","v":54000},"Analyst","Analyst","India",{"$f":"VLOOKUP(Data!$J1344,tblCountries[[Actual]:[Mapping]],2,FALSE)","v":"USA"},"4 to 6 hours a day",4,"India"]
[null,"ID1706","2012-06-06T02:17:14",65000,65000,"USD",{"$f":"Data!$E1346*VLOOKUP(Data!$F1346,tblXrate[],2,FALSE)","v":13338.129598894484},"Actuarial Analyst","Analyst","USA",{"$f":"VLOOKUP(Data!$J1346,tblCountries[[Actual]:[Mapping]],2,FALSE)","v":"India"},"All the 8 hours baby, all the 8!",4,"USA"]
[null,"ID1716","2012-06-06T16:03:39",500000,500000,"INR",{"$f":"Data!$E1354*VLOOKUP(Data!$F1354,tblXrate[],2,FALSE)","v":17807.916687442568},"Sr. Associate","Analyst","India",{"$f":"VLOOKUP(Data!$J1354,tblCountries[[Actual]:[Mapping]],2,FALSE)","v":"India"},"4 to 6 hours a day",4,"India"]
[null,"ID1734","2012-06-07T16:45:01",421000,421000,"INR",{"$f":"Data!$E1368*VLOOKUP(Data!$F1368,tblXrate[],2,FALSE)","v":14500},"PMO Analyst","Analyst","India",{"$f":"VLOOKUP(Data!$J1368,tblCountries[[Actual]:[Mapping]],2,FALSE)","v":"India"},"4 to 6 hours a day",4,"India"]
[null,"ID1741","2012-06-07T23:48:29",36000,36000,"USD",{"$f":"Data!$E1375*VLOOKUP(Data!$F1375,tblXrate[],2,FALSE)","v":57167.974754622352},"clerk","Analyst","USA",{"$f":"VLOOKUP(Data!$J1375,tblCountries[[Actual]:[Mapping]],2,FALSE)","v":"Netherlands"},"4 to 6 hours a day",4,"USA"]
[null,"ID1745","2012-06-08T02:28:45","Rs. 21500",258000,"INR",{"$f":"Data!$E1379*VLOOKUP(Data!$F1379,tblXrate[],2,FALSE)","v":62000},"Senior Data Associate","Analyst","India",{"$f":"VLOOKUP(Data!$J1379,tblCountries[[Actual]:[Mapping]],2,FALSE)","v":"USA"},"4 to 6 hours a day",4,"India"]
[null,"ID1763","2012-06-08T21:02:48",30000,30000,"USD",{"$f":"Data!$E1396*VLOOKUP(Data!$F1396,tblXrate[],2,FALSE)","v":60000},"Customer Service","Analyst","USA",{"$f":"VLOOKUP(Data!$J1396,tblCountries[[Actual]:[Mapping]],2,FALSE)","v":"Canada"},"2 to 3 hours per day",4,"USA"]
[null,"ID1783","2012-06-10T20:30:23","Â£22300",22300,"GBP",{"$f":"Data!$E1410*VLOOKUP(Data!$F1410,tblXrate[],2,FALSE)","v":75000},"Analysis & insight consultant","Analyst","UK",{"$f":"VLOOKUP(Data!$J1410,tblCountries[[Actual]:[Mapping]],2,FALSE)","v":"USA"},"All the 8 hours baby, all the 8!",4,"UK"]
[null,"ID1805","2012-06-12T03:45:25",78000,78000,"CAD",{"$f":"Data!$E1429*VLOOKUP(Data!$F1429,tblXrate[],2,FALSE)","v":52000},"SFA","Analyst","Canada",{"$f":"VLOOKUP(Data!$J1429,tblCountries[[Actual]:[Mapping]],2,FALSE)","v":"USA"},"All the 8 hours baby, all the 8!",4,"Canada"]
[null,"ID1808","2012-06-12T08:46:15",45000,45000,"USD",{"$f":"Data!$E1432*VLOOKUP(Data!$F1432,tblXrate[],2,FALSE)","v":50000},"ba","Analyst","USA",{"$f":"VLOOKUP(Data!$J1432,tblCountries[[Actual]:[Mapping]],2,FALSE)","v":"USA"},"4 to 6 hours a day",4,"USA"]
[null,"ID1811","2012-06-12T15:58:36",560000,560000,"INR",{"$f":"Data!$E1435*VLOOKUP(Data!$F1435,tblXrate[],2,FALSE)","v":128000},"Associate Manager","Manager","India",{"$f":"VLOOKUP(Data!$J1435,tblCountries[[Actual]:[Mapping]],2,FALSE)","v":"USA"},"2 to 3 hours per day",4,"India"]
[null,"ID1820","2012-06-13T00:20:14","4.5 Laks",450000,"INR",{"$f":"Data!$E1443*VLOOKUP(Data!$F1443,tblXrate[],2,FALSE)","v":71000},"MIS Executive","Reporting","India",{"$f":"VLOOKUP(Data!$J1443,tblCountries[[Actual]:[Mapping]],2,FALSE)","v":"USA"},"4 to 6 hours a day",4,"India"]
[null,"ID1862","2012-06-15T17:16:19","INR 700000",700000,"INR",{"$f":"Data!$E1477*VLOOKUP(Data!$F1477,tblXrate[],2,FALSE)","v":3205.4250037396623},"Sr. System Analyst","Analyst","India",{"$f":"VLOOKUP(Data!$J1477,tblCountries[[Actual]:[Mapping]],2,FALSE)","v":"India"},"2 to 3 hours per day",4,"India"]
[null,"ID1902","2012-06-19T12:39:16",4000,4000,"USD",{"$f":"Data!$E1509*VLOOKUP(Data!$F1509,tblXrate[],2,FALSE)","v":47285.348162018527},"operator","Analyst","India",{"$f":"VLOOKUP(Data!$J1509,tblCountries[[Actual]:[Mapping]],2,FALSE)","v":"UK"},"2 to 3 hours per day",4,"India"]
[null,"ID1910","2012-06-19T21:06:16",62000,62000,"USD",{"$f":"Data!$E1516*VLOOKUP(Data!$F1516,tblXrate[],2,FALSE)","v":42140},"Analyst","Analyst","USA",{"$f":"VLOOKUP(Data!$J1516,tblCountries[[Actual]:[Mapping]],2,FALSE)","v":"USA"},"4 to 6 hours a day",4,"USA"]
[null,"ID0595","2012-05-26T08:30:00","â‚¬ 50000",50000,"EUR",{"$f":"Data!$E1629*VLOOKUP(Data!$F1629,tblXrate[],2,FALSE)","v":55068.245289698301},"Analyst","Analyst","Germany","Other Countries","2 to 3 hours per day",4,"Germany"]
[null,"ID0872","2012-05-27T08:54:28",4500,4500,"USD",{"$f":"Data!$E1674*VLOOKUP(Data!$F1674,tblXrate[],2,FALSE)","v":70802.029658183528},"senior associate","Analyst","indonesia","Other Countries","2 to 3 hours per day",4,"Indonesia"]
[null,"ID0890","2012-05-27T13:41:05",10000,10000,"USD",{"$f":"Data!$E1680*VLOOKUP(Data!$F1680,tblXrate[],2,FALSE)","v":60000},"Finance Staff","Accountant","Viet Nam","Other Countries","4 to 6 hours a day",4,"Viet Nam"]
[null,"ID0929","2012-05-27T21:44:39","15000 â‚¬",15000,"EUR",{"$f":"Data!$E1690*VLOOKUP(Data!$F1690,tblXrate[],2,FALSE)","v":250000},"analytic","Analyst","Slovenia","Other Countries","4 to 6 hours a day",4,"Slovenia"]
[null,"ID1030","2012-05-28T12:51:53",45000,45000,"USD",{"$f":"Data!$E1716*VLOOKUP(Data!$F1716,tblXrate[],2,FALSE)","v":14246.333349954055},"Engineer","Engineer","singapore","Other Countries","2 to 3 hours per day",4,"Singapore"]
[null,"ID1126","2012-05-28T17:42:11",5000,60000,"EUR",{"$f":"Data!$E1732*VLOOKUP(Data!$F1732,tblXrate[],2,FALSE)","v":20000},"Development Manager","Manager","Finland","Other Countries","1 or 2 hours a day",4,"Finland"]
[null,"ID1344","2012-05-29T17:39:55","41000 $",41000,"USD",{"$f":"Data!$E1789*VLOOKUP(Data!$F1789,tblXrate[],2,FALSE)","v":45000},"PO/PMO/Planner/PM","Manager","Israel","Other Countries","2 to 3 hours per day",4,"Israel"]
[null,"ID1411","2012-05-29T23:31:03","36000 euros",36000,"EUR",{"$f":"Data!$E1797*VLOOKUP(Data!$F1797,tblXrate[],2,FALSE)","v":35000},"Data Analytics Consultant","Analyst","Ireland","Other Countries","2 to 3 hours per day",4,"Ireland"]
[null,"ID1621","2012-06-02T11:11:18","U$13,000",13000,"USD",{"$f":"Data!$E1834*VLOOKUP(Data!$F1834,tblXrate[],2,FALSE)","v":15244.793267899293},"Dss Analyst","Analyst","Brazil","Other Countries","All the 8 hours baby, all the 8!",4,"Brazil"]
[null,"ID1750","2012-06-08T08:15:54",31200,31200,"USD",{"$f":"Data!$E1860*VLOOKUP(Data!$F1860,tblXrate[],2,FALSE)","v":19200},"Risk analyst","Analyst","Brazil","Other Countries","4 to 6 hours a day",4,"Brazil"]
[null,"ID1885","2012-06-17T11:38:53",75000,75000,"NZD",{"$f":"Data!$E1881*VLOOKUP(Data!$F1881,tblXrate[],2,FALSE)","v":57000},"Commercial Accountant","Accountant","New Zealand","Other Countries","4 to 6 hours a day",4,"New Zealand"]
[null,"ID1928","2012-06-20T20:58:23",8400,100800,"USD",{"$f":"Data!$E1888*VLOOKUP(Data!$F1888,tblXrate[],2,FALSE)","v":63519.971949580387},"AVP","CXO or Top Mgmt.","Oman","Other Countries","4 to 6 hours a day",4,"Oman"]
[null,"ID0664","2012-05-26T12:33:48","Rs 300000",300000,"INR",{"$f":"Data!$E554*VLOOKUP(Data!$F554,tblXrate[],2,FALSE)","v":24000},"Mis Analyst","Analyst","India",{"$f":"VLOOKUP(Data!$J554,tblCountries[[Actual]:[Mapping]],2,FALSE)","v":"Saudi Arabia"},"4 to 6 hours a day",4.5,"India"]
[null,"ID0675","2012-05-26T12:59:13",10200,10200,"USD",{"$f":"Data!$E561*VLOOKUP(Data!$F561,tblXrate[],2,FALSE)","v":50307.817784067665},"business analyst","Analyst","India",{"$f":"VLOOKUP(Data!$J561,tblCountries[[Actual]:[Mapping]],2,FALSE)","v":"Europe"},"4 to 6 hours a day",4.5,"India"]
[null,"ID0676","2012-05-26T12:59:41",325000,325000,"INR",{"$f":"Data!$E562*VLOOKUP(Data!$F562,tblXrate[],2,FALSE)","v":26678.388218823762},"MIS Executive","Reporting","India",{"$f":"VLOOKUP(Data!$J562,tblCountries[[Actual]:[Mapping]],2,FALSE)","v":"Portugal"},"All the 8 hours baby, all the 8!",4.5,"India"]
[null,"ID0697","2012-05-26T13:31:20","Rs. 150000",150000,"INR",{"$f":"Data!$E580*VLOOKUP(Data!$F580,tblXrate[],2,FALSE)","v":4451.9791718606421},"Oprations head","CXO or Top Mgmt.","India",{"$f":"VLOOKUP(Data!$J580,tblCountries[[Actual]:[Mapping]],2,FALSE)","v":"India"},"4 to 6 hours a day",4.5,"India"]
[null,"ID1311","2012-05-29T14:55:29","210000 per annum",210000,"INR",{"$f":"Data!$E1038*VLOOKUP(Data!$F1038,tblXrate[],2,FALSE)","v":30000},"MIS cum Purchase Executive","Reporting","India",{"$f":"VLOOKUP(Data!$J1038,tblCountries[[Actual]:[Mapping]],2,FALSE)","v":"malaysia"},"1 or 2 hours a day",4.5,"India"]
[null,"ID1346","2012-05-29T17:48:04",49500,49500,"USD",{"$f":"Data!$E1061*VLOOKUP(Data!$F1061,tblXrate[],2,FALSE)","v":60000},"Financial Analyst II","Analyst","USA",{"$f":"VLOOKUP(Data!$J1061,tblCountries[[Actual]:[Mapping]],2,FALSE)","v":"India"},"4 to 6 hours a day",4.5,"USA"]
[null,"ID0756","2012-05-26T16:50:08","US $ 11,000",11000,"USD",{"$f":"Data!$E1649*VLOOKUP(Data!$F1649,tblXrate[],2,FALSE)","v":8547.8000099724322},"Assistant Manager - Group MIS","Manager","Sri Lanka","Other Countries","All the 8 hours baby, all the 8!",4.5,"Sri Lanka"]
[null,"ID0952","2012-05-28T01:29:19",3000,36000,"USD",{"$f":"Data!$E1700*VLOOKUP(Data!$F1700,tblXrate[],2,FALSE)","v":65000},"Accountant","Accountant","United Arab Emirates","Other Countries","4 to 6 hours a day",4.5,"UAE"]
[null,"ID1033","2012-05-28T12:59:59",18000,18000,"USD",{"$f":"Data!$E829*VLOOKUP(Data!$F829,tblXrate[],2,FALSE)","v":6545},"Area Sales Manager","Manager","India",{"$f":"VLOOKUP(Data!$J829,tblCountries[[Actual]:[Mapping]],2,FALSE)","v":"India"},"2 to 3 hours per day",4.5999999999999996,"India"]
[null,"ID0560","2012-05-26T05:55:22",54000,54000,"USD",{"$f":"Data!$E463*VLOOKUP(Data!$F463,tblXrate[],2,FALSE)","v":5342.3750062327708},"IT Specialist","Specialist","USA",{"$f":"VLOOKUP(Data!$J463,tblCountries[[Actual]:[Mapping]],2,FALSE)","v":"India"},"All the 8 hours baby, all the 8!",5,"USA"]
[null,"ID0597","2012-05-26T08:45:34",75000,75000,"USD",{"$f":"Data!$E493*VLOOKUP(Data!$F493,tblXrate[],2,FALSE)","v":71393.675948184507},"Financial Analyst","Analyst","USA",{"$f":"VLOOKUP(Data!$J493,tblCountries[[Actual]:[Mapping]],2,FALSE)","v":"Australia"},"4 to 6 hours a day",5,"USA"]
[null,"ID0603","2012-05-26T08:58:55","Rs. 20000",240000,"INR",{"$f":"Data!$E499*VLOOKUP(Data!$F499,tblXrate[],2,FALSE)","v":71231.666749770273},"Talati","Analyst","India",{"$f":"VLOOKUP(Data!$J499,tblCountries[[Actual]:[Mapping]],2,FALSE)","v":"India"},"2 to 3 hours per day",5,"India"]
[null,"ID0608","2012-05-26T09:51:47",160000,160000,"USD",{"$f":"Data!$E503*VLOOKUP(Data!$F503,tblXrate[],2,FALSE)","v":3205.4250037396623},"Director, Analytics","Analyst","USA",{"$f":"VLOOKUP(Data!$J503,tblCountries[[Actual]:[Mapping]],2,FALSE)","v":"India"},"4 to 6 hours a day",5,"USA"]
[null,"ID0614","2012-05-26T10:31:42",61000,61000,"USD",{"$f":"Data!$E508*VLOOKUP(Data!$F508,tblXrate[],2,FALSE)","v":52000},"Sales ops","Manager","USA",{"$f":"VLOOKUP(Data!$J508,tblCountries[[Actual]:[Mapping]],2,FALSE)","v":"USA"},"4 to 6 hours a day",5,"USA"]
[null,"ID0642","2012-05-26T11:46:20",55000,55000,"CAD",{"$f":"Data!$E534*VLOOKUP(Data!$F534,tblXrate[],2,FALSE)","v":13355.937515581925},"Project coordinator","Manager","Canada",{"$f":"VLOOKUP(Data!$J534,tblCountries[[Actual]:[Mapping]],2,FALSE)","v":"India"},"4 to 6 hours a day",5,"Canada"]
[null,"ID0645","2012-05-26T11:50:03","Rs 4,00,000",400000,"INR",{"$f":"Data!$E537*VLOOKUP(Data!$F537,tblXrate[],2,FALSE)","v":46359},"Sr Processor","Manager","India",{"$f":"VLOOKUP(Data!$J537,tblCountries[[Actual]:[Mapping]],2,FALSE)","v":"USA"},"1 or 2 hours a day",5,"India"]
[null,"ID0649","2012-05-26T12:05:35",150000,150000,"INR",{"$f":"Data!$E540*VLOOKUP(Data!$F540,tblXrate[],2,FALSE)","v":9171.0323574730355},"Executive","Manager","India",{"$f":"VLOOKUP(Data!$J540,tblCountries[[Actual]:[Mapping]],2,FALSE)","v":"Nigeria"},"2 to 3 hours per day",5,"India"]
[null,"ID0652","2012-05-26T12:19:47","Rs. 4.32 Lakhs",432000,"INR",{"$f":"Data!$E543*VLOOKUP(Data!$F543,tblXrate[],2,FALSE)","v":19818.231248269083},"Assistant Manager - IT","Manager","India",{"$f":"VLOOKUP(Data!$J543,tblCountries[[Actual]:[Mapping]],2,FALSE)","v":"Portugal"},"2 to 3 hours per day",5,"India"]
[null,"ID0678","2012-05-26T13:01:53","2.5lakh",250000,"INR",{"$f":"Data!$E564*VLOOKUP(Data!$F564,tblXrate[],2,FALSE)","v":45000},"ASM","Manager","India",{"$f":"VLOOKUP(Data!$J564,tblCountries[[Actual]:[Mapping]],2,FALSE)","v":"Mexico"},"2 to 3 hours per day",5,"India"]
[null,"ID0698","2012-05-26T13:37:50",278400,278400,"INR",{"$f":"Data!$E581*VLOOKUP(Data!$F581,tblXrate[],2,FALSE)","v":6000},"Asst. Manager","Manager","India",{"$f":"VLOOKUP(Data!$J581,tblCountries[[Actual]:[Mapping]],2,FALSE)","v":"India"},"4 to 6 hours a day",5,"India"]
[null,"ID0712","2012-05-26T14:16:14","inr 2300000",2300000,"INR",{"$f":"Data!$E595*VLOOKUP(Data!$F595,tblXrate[],2,FALSE)","v":9705.3145946561999},"analyst","Analyst","India",{"$f":"VLOOKUP(Data!$J595,tblCountries[[Actual]:[Mapping]],2,FALSE)","v":"India"},"All the 8 hours baby, all the 8!",5,"India"]
[null,"ID0739","2012-05-26T15:51:11",410000,410000,"INR",{"$f":"Data!$E617*VLOOKUP(Data!$F617,tblXrate[],2,FALSE)","v":17807.916687442568},"MIS Analyst","Analyst","India",{"$f":"VLOOKUP(Data!$J617,tblCountries[[Actual]:[Mapping]],2,FALSE)","v":"India"},"All the 8 hours baby, all the 8!",5,"India"]
[null,"ID0741","2012-05-26T15:54:00","50 k per month",600000,"INR",{"$f":"Data!$E618*VLOOKUP(Data!$F618,tblXrate[],2,FALSE)","v":7123.1666749770275},"Finance Manager","Manager","India",{"$f":"VLOOKUP(Data!$J618,tblCountries[[Actual]:[Mapping]],2,FALSE)","v":"India"},"4 to 6 hours a day",5,"India"]
[null,"ID0746","2012-05-26T16:10:08",74000,74000,"GBP",{"$f":"Data!$E621*VLOOKUP(Data!$F621,tblXrate[],2,FALSE)","v":18000},"Corporate Finance Manager","Manager","UK",{"$f":"VLOOKUP(Data!$J621,tblCountries[[Actual]:[Mapping]],2,FALSE)","v":"India"},"4 to 6 hours a day",5,"UK"]
[null,"ID0749","2012-05-26T16:23:30",16000,16000,"USD",{"$f":"Data!$E624*VLOOKUP(Data!$F624,tblXrate[],2,FALSE)","v":100614.72928405051},"Engineer","Engineer","India",{"$f":"VLOOKUP(Data!$J624,tblCountries[[Actual]:[Mapping]],2,FALSE)","v":"India"},"2 to 3 hours per day",5,"India"]
[null,"ID0761","2012-05-26T17:04:23","INR 700000",700000,"INR",{"$f":"Data!$E633*VLOOKUP(Data!$F633,tblXrate[],2,FALSE)","v":22000},"Sales Management Analyst","Analyst","India",{"$f":"VLOOKUP(Data!$J633,tblCountries[[Actual]:[Mapping]],2,FALSE)","v":"India"},"All the 8 hours baby, all the 8!",5,"India"]
[null,"ID0767","2012-05-26T17:24:41",30232,30232,"USD",{"$f":"Data!$E637*VLOOKUP(Data!$F637,tblXrate[],2,FALSE)","v":7568.3645921630914},"Accounts Supervisor","Accountant","KSA",{"$f":"VLOOKUP(Data!$J637,tblCountries[[Actual]:[Mapping]],2,FALSE)","v":"India"},"2 to 3 hours per day",5,"USA"]
[null,"ID0785","2012-05-26T19:29:23","2.25 lakhs per year(prof income)",2250000,"INR",{"$f":"Data!$E651*VLOOKUP(Data!$F651,tblXrate[],2,FALSE)","v":80000},"company secretary","Accountant","India",{"$f":"VLOOKUP(Data!$J651,tblCountries[[Actual]:[Mapping]],2,FALSE)","v":"Singapore"},"1 or 2 hours a day",5,"India"]
[null,"ID0793","2012-05-26T20:27:19",100000,100000,"CAD",{"$f":"Data!$E659*VLOOKUP(Data!$F659,tblXrate[],2,FALSE)","v":148102.22862117883},"VP Infrastructure","CXO or Top Mgmt.","Canada",{"$f":"VLOOKUP(Data!$J659,tblCountries[[Actual]:[Mapping]],2,FALSE)","v":"Switzerland"},"4 to 6 hours a day",5,"Canada"]
[null,"ID0810","2012-05-26T21:56:49",13100,13100,"USD",{"$f":"Data!$E674*VLOOKUP(Data!$F674,tblXrate[],2,FALSE)","v":11325.835013213473},"accountant","Accountant","India",{"$f":"VLOOKUP(Data!$J674,tblCountries[[Actual]:[Mapping]],2,FALSE)","v":"India"},"2 to 3 hours per day",5,"India"]
[null,"ID0814","2012-05-26T22:16:10","INR 650000",650000,"INR",{"$f":"Data!$E676*VLOOKUP(Data!$F676,tblXrate[],2,FALSE)","v":7123.1666749770275},"Deputy Manager","Manager","India",{"$f":"VLOOKUP(Data!$J676,tblCountries[[Actual]:[Mapping]],2,FALSE)","v":"India"},"2 to 3 hours per day",5,"India"]
[null,"ID0823","2012-05-26T22:48:11",600000,600000,"INR",{"$f":"Data!$E683*VLOOKUP(Data!$F683,tblXrate[],2,FALSE)","v":9438.1958443445619},"Reporting Analyst","Analyst","India",{"$f":"VLOOKUP(Data!$J683,tblCountries[[Actual]:[Mapping]],2,FALSE)","v":"India"},"All the 8 hours baby, all the 8!",5,"India"]
[null,"ID0860","2012-05-27T03:37:36",43600,43600,"USD",{"$f":"Data!$E712*VLOOKUP(Data!$F712,tblXrate[],2,FALSE)","v":83846.362973446114},"Data Analyst","Analyst","USA",{"$f":"VLOOKUP(Data!$J712,tblCountries[[Actual]:[Mapping]],2,FALSE)","v":"Germany"},"4 to 6 hours a day",5,"USA"]
[null,"ID0885","2012-05-27T13:06:50",600000,600000,"INR",{"$f":"Data!$E726*VLOOKUP(Data!$F726,tblXrate[],2,FALSE)","v":9616.275011218986},"Asst Manager","Manager","India",{"$f":"VLOOKUP(Data!$J726,tblCountries[[Actual]:[Mapping]],2,FALSE)","v":"India"},"All the 8 hours baby, all the 8!",5,"India"]
[null,"ID0891","2012-05-27T13:42:15","inr 500000",500000,"INR",{"$f":"Data!$E730*VLOOKUP(Data!$F730,tblXrate[],2,FALSE)","v":80000},"team coach","Manager","India",{"$f":"VLOOKUP(Data!$J730,tblCountries[[Actual]:[Mapping]],2,FALSE)","v":"USA"},"1 or 2 hours a day",5,"India"]
[null,"ID0897","2012-05-27T14:47:21",120000,120000,"INR",{"$f":"Data!$E734*VLOOKUP(Data!$F734,tblXrate[],2,FALSE)","v":8013.5625093491553},"co ordinator","Manager","India",{"$f":"VLOOKUP(Data!$J734,tblCountries[[Actual]:[Mapping]],2,FALSE)","v":"India"},"4 to 6 hours a day",5,"India"]
[null,"ID0899","2012-05-27T14:50:56",1000000,1000000,"INR",{"$f":"Data!$E736*VLOOKUP(Data!$F736,tblXrate[],2,FALSE)","v":4273.9000049862161},"Engagement Lead","Manager","India",{"$f":"VLOOKUP(Data!$J736,tblCountries[[Actual]:[Mapping]],2,FALSE)","v":"India"},"4 to 6 hours a day",5,"India"]
[null,"ID0908","2012-05-27T15:48:03",16350,16350,"USD",{"$f":"Data!$E742*VLOOKUP(Data!$F742,tblXrate[],2,FALSE)","v":7123.1666749770275},"Estimator","Manager","India",{"$f":"VLOOKUP(Data!$J742,tblCountries[[Actual]:[Mapping]],2,FALSE)","v":"India"},"4 to 6 hours a day",5,"India"]
[null,"ID0913","2012-05-27T16:50:50","1050000 INR",1050000,"INR",{"$f":"Data!$E746*VLOOKUP(Data!$F746,tblXrate[],2,FALSE)","v":17807.916687442568},"Manager Market Reesrach","Manager","India",{"$f":"VLOOKUP(Data!$J746,tblCountries[[Actual]:[Mapping]],2,FALSE)","v":"India"},"All the 8 hours baby, all the 8!",5,"India"]
[null,"ID0959","2012-05-28T04:05:14",8000,8000,"USD",{"$f":"Data!$E772*VLOOKUP(Data!$F772,tblXrate[],2,FALSE)","v":40000},"IT Analyst","Analyst","India",{"$f":"VLOOKUP(Data!$J772,tblCountries[[Actual]:[Mapping]],2,FALSE)","v":"USA"},"1 or 2 hours a day",5,"India"]
[null,"ID0968","2012-05-28T06:25:36","AU$65",65000,"AUD",{"$f":"Data!$E777*VLOOKUP(Data!$F777,tblXrate[],2,FALSE)","v":8903.9583437212841},"Business Support ","Manager","Australia",{"$f":"VLOOKUP(Data!$J777,tblCountries[[Actual]:[Mapping]],2,FALSE)","v":"India"},"2 to 3 hours per day",5,"Australia"]
[null,"ID0977","2012-05-28T07:28:34",50000,50000,"AUD",{"$f":"Data!$E785*VLOOKUP(Data!$F785,tblXrate[],2,FALSE)","v":5342.3750062327708},"Operations","Controller","Australia",{"$f":"VLOOKUP(Data!$J785,tblCountries[[Actual]:[Mapping]],2,FALSE)","v":"India"},"1 or 2 hours a day",5,"Australia"]
[null,"ID0995","2012-05-28T09:26:10",120000,120000,"AUD",{"$f":"Data!$E800*VLOOKUP(Data!$F800,tblXrate[],2,FALSE)","v":26043.18849932796},"HSLP Data Analyst","Analyst","Australia",{"$f":"VLOOKUP(Data!$J800,tblCountries[[Actual]:[Mapping]],2,FALSE)","v":"Poland"},"4 to 6 hours a day",5,"Australia"]
[null,"ID1024","2012-05-28T12:26:01","Rs.5.7 lacs",570000,"INR",{"$f":"Data!$E821*VLOOKUP(Data!$F821,tblXrate[],2,FALSE)","v":7123.1666749770275},"MIS & Analysis","Analyst","India",{"$f":"VLOOKUP(Data!$J821,tblCountries[[Actual]:[Mapping]],2,FALSE)","v":"India"},"4 to 6 hours a day",5,"India"]
[null,"ID1028","2012-05-28T12:40:26",900,10800,"USD",{"$f":"Data!$E825*VLOOKUP(Data!$F825,tblXrate[],2,FALSE)","v":92000},"Project Managment Office","Manager","Pakistan",{"$f":"VLOOKUP(Data!$J825,tblCountries[[Actual]:[Mapping]],2,FALSE)","v":"USA"},"All the 8 hours baby, all the 8!",5,"Pakistan"]
[null,"ID1031","2012-05-28T12:57:13","Rs. 4,00,000/-",400000,"INR",{"$f":"Data!$E827*VLOOKUP(Data!$F827,tblXrate[],2,FALSE)","v":8903.9583437212841},"Sr. Executive","Manager","India",{"$f":"VLOOKUP(Data!$J827,tblCountries[[Actual]:[Mapping]],2,FALSE)","v":"India"},"2 to 3 hours per day",5,"India"]
[null,"ID1032","2012-05-28T12:58:44","3 Lakh ",300000,"INR",{"$f":"Data!$E828*VLOOKUP(Data!$F828,tblXrate[],2,FALSE)","v":58318.59606648951},"ACCOUNTS","Accountant","India",{"$f":"VLOOKUP(Data!$J828,tblCountries[[Actual]:[Mapping]],2,FALSE)","v":"UK"},"2 to 3 hours per day",5,"India"]
[null,"ID1039","2012-05-28T13:11:42",6000,6000,"USD",{"$f":"Data!$E834*VLOOKUP(Data!$F834,tblXrate[],2,FALSE)","v":74461},"Manager","Manager","India",{"$f":"VLOOKUP(Data!$J834,tblCountries[[Actual]:[Mapping]],2,FALSE)","v":"USA"},"4 to 6 hours a day",5,"India"]
[null,"ID1048","2012-05-28T13:46:17",252000,252000,"INR",{"$f":"Data!$E841*VLOOKUP(Data!$F841,tblXrate[],2,FALSE)","v":75000},"Accounts Exec","Accountant","India",{"$f":"VLOOKUP(Data!$J841,tblCountries[[Actual]:[Mapping]],2,FALSE)","v":"Germany"},"1 or 2 hours a day",5,"India"]
[null,"ID1049","2012-05-28T13:54:57","Rs. 700000",700000,"INR",{"$f":"Data!$E842*VLOOKUP(Data!$F842,tblXrate[],2,FALSE)","v":80000},"Credit Analyst","Analyst","India",{"$f":"VLOOKUP(Data!$J842,tblCountries[[Actual]:[Mapping]],2,FALSE)","v":"Brazil"},"4 to 6 hours a day",5,"India"]
[null,"ID1061","2012-05-28T14:34:34",408000,408000,"INR",{"$f":"Data!$E848*VLOOKUP(Data!$F848,tblXrate[],2,FALSE)","v":6767.0083412281756},"Sr Exec - Finance","Accountant","India",{"$f":"VLOOKUP(Data!$J848,tblCountries[[Actual]:[Mapping]],2,FALSE)","v":"India"},"All the 8 hours baby, all the 8!",5,"India"]
[null,"ID1065","2012-05-28T14:44:26","Rs 200000",200000,"INR",{"$f":"Data!$E851*VLOOKUP(Data!$F851,tblXrate[],2,FALSE)","v":173384.64158844808},"Business Development Executive","Manager","India",{"$f":"VLOOKUP(Data!$J851,tblCountries[[Actual]:[Mapping]],2,FALSE)","v":"Australia"},"2 to 3 hours per day",5,"India"]
[null,"ID1074","2012-05-28T15:12:38",7000,7000,"USD",{"$f":"Data!$E859*VLOOKUP(Data!$F859,tblXrate[],2,FALSE)","v":66294.12766617132},"MIS Executive","Reporting","India",{"$f":"VLOOKUP(Data!$J859,tblCountries[[Actual]:[Mapping]],2,FALSE)","v":"Australia"},"All the 8 hours baby, all the 8!",5,"India"]
[null,"ID1093","2012-05-28T16:01:05","Â£23000",23000,"GBP",{"$f":"Data!$E878*VLOOKUP(Data!$F878,tblXrate[],2,FALSE)","v":126094.26176538273},"Data Analyst","Analyst","UK",{"$f":"VLOOKUP(Data!$J878,tblCountries[[Actual]:[Mapping]],2,FALSE)","v":"UK"},"All the 8 hours baby, all the 8!",5,"UK"]
[null,"ID1110","2012-05-28T16:45:28",100000,1200000,"INR",{"$f":"Data!$E891*VLOOKUP(Data!$F891,tblXrate[],2,FALSE)","v":152986.44846039536},"coordinator","Manager","India",{"$f":"VLOOKUP(Data!$J891,tblCountries[[Actual]:[Mapping]],2,FALSE)","v":"Australia"},"2 to 3 hours per day",5,"India"]
[null,"ID1114","2012-05-28T16:59:48","INR 300000",300000,"INR",{"$f":"Data!$E895*VLOOKUP(Data!$F895,tblXrate[],2,FALSE)","v":11800},"Analyst","Analyst","India",{"$f":"VLOOKUP(Data!$J895,tblCountries[[Actual]:[Mapping]],2,FALSE)","v":"India"},"4 to 6 hours a day",5,"India"]
[null,"ID1122","2012-05-28T17:18:47","GBP Â£45200",45200,"GBP",{"$f":"Data!$E901*VLOOKUP(Data!$F901,tblXrate[],2,FALSE)","v":136000},"Clinical audit manager","Manager","UK",{"$f":"VLOOKUP(Data!$J901,tblCountries[[Actual]:[Mapping]],2,FALSE)","v":"USA"},"2 to 3 hours per day",5,"UK"]
[null,"ID1132","2012-05-28T18:05:13",150252,150252,"INR",{"$f":"Data!$E908*VLOOKUP(Data!$F908,tblXrate[],2,FALSE)","v":20000},"KEY","Manager","India",{"$f":"VLOOKUP(Data!$J908,tblCountries[[Actual]:[Mapping]],2,FALSE)","v":"India"},"2 to 3 hours per day",5,"India"]
[null,"ID1138","2012-05-28T18:39:19",90000,90000,"USD",{"$f":"Data!$E911*VLOOKUP(Data!$F911,tblXrate[],2,FALSE)","v":76000},"Performance manager","Manager","USA",{"$f":"VLOOKUP(Data!$J911,tblCountries[[Actual]:[Mapping]],2,FALSE)","v":"USA"},"4 to 6 hours a day",5,"USA"]
[null,"ID1140","2012-05-28T18:45:00",10000,10000,"USD",{"$f":"Data!$E913*VLOOKUP(Data!$F913,tblXrate[],2,FALSE)","v":32000},"Business analyst","Analyst","India",{"$f":"VLOOKUP(Data!$J913,tblCountries[[Actual]:[Mapping]],2,FALSE)","v":"USA"},"2 to 3 hours per day",5,"India"]
[null,"ID1142","2012-05-28T19:05:22","200000 rupees",200000,"INR",{"$f":"Data!$E915*VLOOKUP(Data!$F915,tblXrate[],2,FALSE)","v":89000},"MIS Sr. Executive","Reporting","India",{"$f":"VLOOKUP(Data!$J915,tblCountries[[Actual]:[Mapping]],2,FALSE)","v":"USA"},"All the 8 hours baby, all the 8!",5,"India"]
[null,"ID1149","2012-05-28T19:53:14","Â£30000",30000,"GBP",{"$f":"Data!$E920*VLOOKUP(Data!$F920,tblXrate[],2,FALSE)","v":63519.971949580387},"Reporting Accountant","Accountant","UK",{"$f":"VLOOKUP(Data!$J920,tblCountries[[Actual]:[Mapping]],2,FALSE)","v":"Netherlands"},"2 to 3 hours per day",5,"UK"]
[null,"ID1156","2012-05-28T20:51:37","Â£37500",37500,"GBP",{"$f":"Data!$E924*VLOOKUP(Data!$F924,tblXrate[],2,FALSE)","v":75000},"Corporate Finance Executive","Accountant","UK",{"$f":"VLOOKUP(Data!$J924,tblCountries[[Actual]:[Mapping]],2,FALSE)","v":"USA"},"2 to 3 hours per day",5,"UK"]
[null,"ID1157","2012-05-28T20:54:29","Rs. 59,000 (Per Month)",708000,"INR",{"$f":"Data!$E925*VLOOKUP(Data!$F925,tblXrate[],2,FALSE)","v":78808.913603364199},"Manager-Operation","Manager","India",{"$f":"VLOOKUP(Data!$J925,tblCountries[[Actual]:[Mapping]],2,FALSE)","v":"UK"},"4 to 6 hours a day",5,"India"]
[null,"ID1169","2012-05-28T22:38:37","$50,000 U.S.",50000,"USD",{"$f":"Data!$E934*VLOOKUP(Data!$F934,tblXrate[],2,FALSE)","v":17807.916687442568},"Program Manager","Manager","Canada",{"$f":"VLOOKUP(Data!$J934,tblCountries[[Actual]:[Mapping]],2,FALSE)","v":"India"},"1 or 2 hours a day",5,"Canada"]
[null,"ID1212","2012-05-29T00:25:46",800,4800,"USD",{"$f":"Data!$E965*VLOOKUP(Data!$F965,tblXrate[],2,FALSE)","v":20400},"Financial Analyst","Analyst","India",{"$f":"VLOOKUP(Data!$J965,tblCountries[[Actual]:[Mapping]],2,FALSE)","v":"Myanmar"},"4 to 6 hours a day",5,"India"]
[null,"ID1248","2012-05-29T05:08:57","85000 USD",85000,"USD",{"$f":"Data!$E992*VLOOKUP(Data!$F992,tblXrate[],2,FALSE)","v":17807.916687442568},"Senior Executive Compensation Analyst ","Analyst","USA",{"$f":"VLOOKUP(Data!$J992,tblCountries[[Actual]:[Mapping]],2,FALSE)","v":"India"},"4 to 6 hours a day",5,"USA"]
[null,"ID1255","2012-05-29T06:26:05",80000,80000,"AUD",{"$f":"Data!$E998*VLOOKUP(Data!$F998,tblXrate[],2,FALSE)","v":10684.750012465542},"systems accountant","Accountant","Australia",{"$f":"VLOOKUP(Data!$J998,tblCountries[[Actual]:[Mapping]],2,FALSE)","v":"India"},"4 to 6 hours a day",5,"Australia"]
[null,"ID1263","2012-05-29T08:41:02",90000,90000,"AUD",{"$f":"Data!$E1002*VLOOKUP(Data!$F1002,tblXrate[],2,FALSE)","v":107000},"Business Analyst","Analyst","Australia",{"$f":"VLOOKUP(Data!$J1002,tblCountries[[Actual]:[Mapping]],2,FALSE)","v":"USA"},"4 to 6 hours a day",5,"Australia"]
[null,"ID1289","2012-05-29T12:19:39","3,00,000.00",300000,"INR",{"$f":"Data!$E1023*VLOOKUP(Data!$F1023,tblXrate[],2,FALSE)","v":10684.750012465542},"MIS OFFICER","Reporting","India",{"$f":"VLOOKUP(Data!$J1023,tblCountries[[Actual]:[Mapping]],2,FALSE)","v":"India"},"2 to 3 hours per day",5,"India"]
[null,"ID1308","2012-05-29T14:16:06","5,75,000",575000,"INR",{"$f":"Data!$E1036*VLOOKUP(Data!$F1036,tblXrate[],2,FALSE)","v":57167.974754622352},"Asst Manager HR","Manager","India",{"$f":"VLOOKUP(Data!$J1036,tblCountries[[Actual]:[Mapping]],2,FALSE)","v":"Germany"},"2 to 3 hours per day",5,"India"]
[null,"ID1315","2012-05-29T15:08:12","â‚¬ 28500",28500,"EUR",{"$f":"Data!$E1042*VLOOKUP(Data!$F1042,tblXrate[],2,FALSE)","v":91791.869076237213},"Salary Professsional","Analyst","Netherlands",{"$f":"VLOOKUP(Data!$J1042,tblCountries[[Actual]:[Mapping]],2,FALSE)","v":"Australia"},"1 or 2 hours a day",5,"Netherlands"]
[null,"ID1339","2012-05-29T17:16:20",500000,500000,"INR",{"$f":"Data!$E1056*VLOOKUP(Data!$F1056,tblXrate[],2,FALSE)","v":50000},"support manager","Manager","India",{"$f":"VLOOKUP(Data!$J1056,tblCountries[[Actual]:[Mapping]],2,FALSE)","v":"Kuwait"},"2 to 3 hours per day",5,"India"]
[null,"ID1350","2012-05-29T18:14:53","USD 5300",5300,"USD",{"$f":"Data!$E1065*VLOOKUP(Data!$F1065,tblXrate[],2,FALSE)","v":80000},"Asst. Production Manager","Manager","Pakistan",{"$f":"VLOOKUP(Data!$J1065,tblCountries[[Actual]:[Mapping]],2,FALSE)","v":"USA"},"4 to 6 hours a day",5,"Pakistan"]
[null,"ID1385","2012-05-29T21:42:44",120000,120000,"USD",{"$f":"Data!$E1095*VLOOKUP(Data!$F1095,tblXrate[],2,FALSE)","v":102451.58768437347},"Finance Manager","Manager","USA",{"$f":"VLOOKUP(Data!$J1095,tblCountries[[Actual]:[Mapping]],2,FALSE)","v":"UK"},"2 to 3 hours per day",5,"USA"]
[null,"ID1422","2012-05-30T01:12:04",49000,49000,"USD",{"$f":"Data!$E1128*VLOOKUP(Data!$F1128,tblXrate[],2,FALSE)","v":225000},"Clinical Data Specialist","Specialist","USA",{"$f":"VLOOKUP(Data!$J1128,tblCountries[[Actual]:[Mapping]],2,FALSE)","v":"USA"},"4 to 6 hours a day",5,"USA"]
[null,"ID1442","2012-05-30T09:42:01",70000,70000,"AUD",{"$f":"Data!$E1147*VLOOKUP(Data!$F1147,tblXrate[],2,FALSE)","v":72412.768022521646},"Assistant Accountant","Accountant","Australia",{"$f":"VLOOKUP(Data!$J1147,tblCountries[[Actual]:[Mapping]],2,FALSE)","v":"Norway"},"2 to 3 hours per day",5,"Australia"]
[null,"ID1445","2012-05-30T10:57:38",8500,102000,"USD",{"$f":"Data!$E1150*VLOOKUP(Data!$F1150,tblXrate[],2,FALSE)","v":44654.095718350931},"Sales Analyst","Analyst","USA",{"$f":"VLOOKUP(Data!$J1150,tblCountries[[Actual]:[Mapping]],2,FALSE)","v":"South Africa"},"4 to 6 hours a day",5,"USA"]
[null,"ID1447","2012-05-30T11:38:53",363,4356,"USD",{"$f":"Data!$E1151*VLOOKUP(Data!$F1151,tblXrate[],2,FALSE)","v":50700},"Business Analyst","Analyst","India",{"$f":"VLOOKUP(Data!$J1151,tblCountries[[Actual]:[Mapping]],2,FALSE)","v":"Brazil"},"4 to 6 hours a day",5,"India"]
[null,"ID1467","2012-05-30T14:31:33",620000,620000,"INR",{"$f":"Data!$E1167*VLOOKUP(Data!$F1167,tblXrate[],2,FALSE)","v":63000},"Catalog Auditor","Analyst","India",{"$f":"VLOOKUP(Data!$J1167,tblCountries[[Actual]:[Mapping]],2,FALSE)","v":"USA"},"1 or 2 hours a day",5,"India"]
[null,"ID1470","2012-05-30T16:22:19","Â£17000",17000,"GBP",{"$f":"Data!$E1170*VLOOKUP(Data!$F1170,tblXrate[],2,FALSE)","v":3561.5833374885137},"Verification Agent","Analyst","UK",{"$f":"VLOOKUP(Data!$J1170,tblCountries[[Actual]:[Mapping]],2,FALSE)","v":"India"},"2 to 3 hours per day",5,"UK"]
[null,"ID1501","2012-05-30T22:31:35","61K",61000,"USD",{"$f":"Data!$E1191*VLOOKUP(Data!$F1191,tblXrate[],2,FALSE)","v":170000},"Financial Analyst","Analyst","USA",{"$f":"VLOOKUP(Data!$J1191,tblCountries[[Actual]:[Mapping]],2,FALSE)","v":"USA"},"4 to 6 hours a day",5,"USA"]
[null,"ID1509","2012-05-31T00:46:55","4.00 lac",4000000,"INR",{"$f":"Data!$E1198*VLOOKUP(Data!$F1198,tblXrate[],2,FALSE)","v":188000},"Operational Specialist","Specialist","India",{"$f":"VLOOKUP(Data!$J1198,tblCountries[[Actual]:[Mapping]],2,FALSE)","v":"USA"},"All the 8 hours baby, all the 8!",5,"India"]
[null,"ID1521","2012-05-31T05:02:59",45000,45000,"USD",{"$f":"Data!$E1207*VLOOKUP(Data!$F1207,tblXrate[],2,FALSE)","v":4273.9000049862161},"Excel Business Analyst","Analyst","USA",{"$f":"VLOOKUP(Data!$J1207,tblCountries[[Actual]:[Mapping]],2,FALSE)","v":"India"},"All the 8 hours baby, all the 8!",5,"USA"]
[null,"ID1537","2012-05-31T13:25:49","85,000 AUD",85000,"AUD",{"$f":"Data!$E1220*VLOOKUP(Data!$F1220,tblXrate[],2,FALSE)","v":63918.498996971248},"Demand Planner","Analyst","Australia",{"$f":"VLOOKUP(Data!$J1220,tblCountries[[Actual]:[Mapping]],2,FALSE)","v":"Canada"},"1 or 2 hours a day",5,"Australia"]
[null,"ID1545","2012-05-31T17:08:59",30000,30000,"USD",{"$f":"Data!$E1226*VLOOKUP(Data!$F1226,tblXrate[],2,FALSE)","v":60000},"Marketing Services Manager","Manager","Pakistan",{"$f":"VLOOKUP(Data!$J1226,tblCountries[[Actual]:[Mapping]],2,FALSE)","v":"USA"},"4 to 6 hours a day",5,"Pakistan"]
[null,"ID1547","2012-05-31T17:34:34","Rs. 180000",180000,"INR",{"$f":"Data!$E1228*VLOOKUP(Data!$F1228,tblXrate[],2,FALSE)","v":72000},"Asst Store Manager","Manager","India",{"$f":"VLOOKUP(Data!$J1228,tblCountries[[Actual]:[Mapping]],2,FALSE)","v":"USA"},"4 to 6 hours a day",5,"India"]
[null,"ID1553","2012-05-31T21:05:02","55000 EUR",55000,"EUR",{"$f":"Data!$E1232*VLOOKUP(Data!$F1232,tblXrate[],2,FALSE)","v":75473.31457379504},"Risk Officer","Manager","The Netherlands",{"$f":"VLOOKUP(Data!$J1232,tblCountries[[Actual]:[Mapping]],2,FALSE)","v":"Australia"},"1 or 2 hours a day",5,"Netherlands"]
[null,"ID1561","2012-05-31T23:08:12",71500,71500,"USD",{"$f":"Data!$E1238*VLOOKUP(Data!$F1238,tblXrate[],2,FALSE)","v":85000},"Management Reporting Analyst","Analyst","USA",{"$f":"VLOOKUP(Data!$J1238,tblCountries[[Actual]:[Mapping]],2,FALSE)","v":"USA"},"4 to 6 hours a day",5,"USA"]
[null,"ID1574","2012-06-01T03:07:31","INR 850000",850000,"INR",{"$f":"Data!$E1248*VLOOKUP(Data!$F1248,tblXrate[],2,FALSE)","v":19068},"Sr Business analyst","Analyst","India",{"$f":"VLOOKUP(Data!$J1248,tblCountries[[Actual]:[Mapping]],2,FALSE)","v":"Philippines"},"4 to 6 hours a day",5,"India"]
[null,"ID1587","2012-06-01T10:55:27","AU $120000",120000,"AUD",{"$f":"Data!$E1257*VLOOKUP(Data!$F1257,tblXrate[],2,FALSE)","v":28353.650809742252},"Reporting Analyst","Analyst","Australia",{"$f":"VLOOKUP(Data!$J1257,tblCountries[[Actual]:[Mapping]],2,FALSE)","v":"malaysia"},"2 to 3 hours per day",5,"Australia"]
[null,"ID1593","2012-06-01T15:39:20","U$52,000/annual",52000,"USD",{"$f":"Data!$E1263*VLOOKUP(Data!$F1263,tblXrate[],2,FALSE)","v":102542.54233725216},"Planner","Analyst","USA",{"$f":"VLOOKUP(Data!$J1263,tblCountries[[Actual]:[Mapping]],2,FALSE)","v":"Denmark"},"All the 8 hours baby, all the 8!",5,"USA"]
[null,"ID1597","2012-06-01T19:42:46",650000,650000,"INR",{"$f":"Data!$E1265*VLOOKUP(Data!$F1265,tblXrate[],2,FALSE)","v":8013.5625093491553},"Associate","Analyst","India",{"$f":"VLOOKUP(Data!$J1265,tblCountries[[Actual]:[Mapping]],2,FALSE)","v":"India"},"4 to 6 hours a day",5,"India"]
[null,"ID1614","2012-06-02T03:23:09",62000,62000,"USD",{"$f":"Data!$E1279*VLOOKUP(Data!$F1279,tblXrate[],2,FALSE)","v":8903.9583437212841},"Financial Analyst","Analyst","USA",{"$f":"VLOOKUP(Data!$J1279,tblCountries[[Actual]:[Mapping]],2,FALSE)","v":"India"},"2 to 3 hours per day",5,"USA"]
[null,"ID1623","2012-06-02T13:58:46",15000,15000,"USD",{"$f":"Data!$E1286*VLOOKUP(Data!$F1286,tblXrate[],2,FALSE)","v":150000},"Business Analysis & MIS ","Analyst","India",{"$f":"VLOOKUP(Data!$J1286,tblCountries[[Actual]:[Mapping]],2,FALSE)","v":"USA"},"4 to 6 hours a day",5,"India"]
[null,"ID1632","2012-06-03T01:33:57",320000,320000,"INR",{"$f":"Data!$E1294*VLOOKUP(Data!$F1294,tblXrate[],2,FALSE)","v":125000},"senior executive","Manager","India",{"$f":"VLOOKUP(Data!$J1294,tblCountries[[Actual]:[Mapping]],2,FALSE)","v":"USA"},"4 to 6 hours a day",5,"India"]
[null,"ID1634","2012-06-03T02:06:44","Â£60000",60000,"GBP",{"$f":"Data!$E1295*VLOOKUP(Data!$F1295,tblXrate[],2,FALSE)","v":85000},"Data Analyst","Analyst","UK",{"$f":"VLOOKUP(Data!$J1295,tblCountries[[Actual]:[Mapping]],2,FALSE)","v":"USA"},"4 to 6 hours a day",5,"UK"]
[null,"ID1644","2012-06-03T13:30:47",50000,50000,"CAD",{"$f":"Data!$E1301*VLOOKUP(Data!$F1301,tblXrate[],2,FALSE)","v":56742.417794422225},"Application Developer","Analyst","Canada",{"$f":"VLOOKUP(Data!$J1301,tblCountries[[Actual]:[Mapping]],2,FALSE)","v":"UK"},"4 to 6 hours a day",5,"Canada"]
[null,"ID1646","2012-06-03T14:34:56",15000,15000,"USD",{"$f":"Data!$E1302*VLOOKUP(Data!$F1302,tblXrate[],2,FALSE)","v":42307},"Marketing services","Analyst","Pakistan",{"$f":"VLOOKUP(Data!$J1302,tblCountries[[Actual]:[Mapping]],2,FALSE)","v":"USA"},"4 to 6 hours a day",5,"Pakistan"]
[null,"ID1651","2012-06-04T01:45:03",340000,340000,"INR",{"$f":"Data!$E1306*VLOOKUP(Data!$F1306,tblXrate[],2,FALSE)","v":49200},"Assistant Manager","Manager","India",{"$f":"VLOOKUP(Data!$J1306,tblCountries[[Actual]:[Mapping]],2,FALSE)","v":"Qatar"},"4 to 6 hours a day",5,"India"]
[null,"ID1683","2012-06-05T07:05:12","Rs 16000",192000,"INR",{"$f":"Data!$E1331*VLOOKUP(Data!$F1331,tblXrate[],2,FALSE)","v":55166.239522354947},"Sr Associate","Analyst","India",{"$f":"VLOOKUP(Data!$J1331,tblCountries[[Actual]:[Mapping]],2,FALSE)","v":"UK"},"4 to 6 hours a day",5,"India"]
[null,"ID1690","2012-06-05T19:37:13","Â£45000",45000,"GBP",{"$f":"Data!$E1335*VLOOKUP(Data!$F1335,tblXrate[],2,FALSE)","v":24000},"Data Analyst","Analyst","UK",{"$f":"VLOOKUP(Data!$J1335,tblCountries[[Actual]:[Mapping]],2,FALSE)","v":"USA"},"All the 8 hours baby, all the 8!",5,"UK"]
[null,"ID1713","2012-06-06T09:31:47",80000,80000,"AUD",{"$f":"Data!$E1352*VLOOKUP(Data!$F1352,tblXrate[],2,FALSE)","v":13500},"PPC Search Specialist","Specialist","Australia",{"$f":"VLOOKUP(Data!$J1352,tblCountries[[Actual]:[Mapping]],2,FALSE)","v":"India"},"4 to 6 hours a day",5,"Australia"]
[null,"ID1717","2012-06-06T17:41:41",600000,600000,"INR",{"$f":"Data!$E1355*VLOOKUP(Data!$F1355,tblXrate[],2,FALSE)","v":75000},"admin","Analyst","India",{"$f":"VLOOKUP(Data!$J1355,tblCountries[[Actual]:[Mapping]],2,FALSE)","v":"USA"},"All the 8 hours baby, all the 8!",5,"India"]
[null,"ID1737","2012-06-07T17:13:42",40000,40000,"GBP",{"$f":"Data!$E1371*VLOOKUP(Data!$F1371,tblXrate[],2,FALSE)","v":90000},"Analyst","Analyst","UK",{"$f":"VLOOKUP(Data!$J1371,tblCountries[[Actual]:[Mapping]],2,FALSE)","v":"USA"},"4 to 6 hours a day",5,"UK"]
[null,"ID1743","2012-06-08T00:21:23",75000,75000,"USD",{"$f":"Data!$E1377*VLOOKUP(Data!$F1377,tblXrate[],2,FALSE)","v":63047.130882691366},"Senior Financial Analyst","Analyst","USA",{"$f":"VLOOKUP(Data!$J1377,tblCountries[[Actual]:[Mapping]],2,FALSE)","v":"UK"},"All the 8 hours baby, all the 8!",5,"USA"]
[null,"ID1767","2012-06-09T00:49:07",40000,40000,"USD",{"$f":"Data!$E1399*VLOOKUP(Data!$F1399,tblXrate[],2,FALSE)","v":47285.348162018527},"Market Research Analyst","Analyst","USA",{"$f":"VLOOKUP(Data!$J1399,tblCountries[[Actual]:[Mapping]],2,FALSE)","v":"UK"},"4 to 6 hours a day",5,"USA"]
[null,"ID1771","2012-06-09T12:01:19",444,5320,"USD",{"$f":"Data!$E1403*VLOOKUP(Data!$F1403,tblXrate[],2,FALSE)","v":110000},"Officer","Manager","India",{"$f":"VLOOKUP(Data!$J1403,tblCountries[[Actual]:[Mapping]],2,FALSE)","v":"USA"},"2 to 3 hours per day",5,"India"]
[null,"ID1773","2012-06-10T00:50:26","1.40 lac",140000,"INR",{"$f":"Data!$E1404*VLOOKUP(Data!$F1404,tblXrate[],2,FALSE)","v":81000},"magic","Misc.","India",{"$f":"VLOOKUP(Data!$J1404,tblCountries[[Actual]:[Mapping]],2,FALSE)","v":"UK"},"4 to 6 hours a day",5,"India"]
[null,"ID1812","2012-06-12T16:16:25",14000,14000,"USD",{"$f":"Data!$E1436*VLOOKUP(Data!$F1436,tblXrate[],2,FALSE)","v":44000},"Manager","Manager","India",{"$f":"VLOOKUP(Data!$J1436,tblCountries[[Actual]:[Mapping]],2,FALSE)","v":"USA"},"4 to 6 hours a day",5,"India"]
[null,"ID1824","2012-06-13T01:56:23",70000,70000,"USD",{"$f":"Data!$E1447*VLOOKUP(Data!$F1447,tblXrate[],2,FALSE)","v":40000},"business analyst","Analyst","USA",{"$f":"VLOOKUP(Data!$J1447,tblCountries[[Actual]:[Mapping]],2,FALSE)","v":"USA"},"2 to 3 hours per day",5,"USA"]
[null,"ID1826","2012-06-13T03:48:39",78000,78000,"USD",{"$f":"Data!$E1449*VLOOKUP(Data!$F1449,tblXrate[],2,FALSE)","v":5983.4600069807029},"Data Integration Engenieer","Engineer","USA",{"$f":"VLOOKUP(Data!$J1449,tblCountries[[Actual]:[Mapping]],2,FALSE)","v":"India"},"All the 8 hours baby, all the 8!",5,"USA"]
[null,"ID1845","2012-06-14T18:27:04",560,6720,"USD",{"$f":"Data!$E1465*VLOOKUP(Data!$F1465,tblXrate[],2,FALSE)","v":50831.74927416991},"accoutant","Accountant","India",{"$f":"VLOOKUP(Data!$J1465,tblCountries[[Actual]:[Mapping]],2,FALSE)","v":"UK"},"4 to 6 hours a day",5,"India"]
[null,"ID1860","2012-06-15T15:43:42",270000,270000,"INR",{"$f":"Data!$E1475*VLOOKUP(Data!$F1475,tblXrate[],2,FALSE)","v":8903.9583437212841},"Team Lead","Manager","India",{"$f":"VLOOKUP(Data!$J1475,tblCountries[[Actual]:[Mapping]],2,FALSE)","v":"India"},"2 to 3 hours per day",5,"India"]
[null,"ID1878","2012-06-16T17:14:03",40000,40000,"USD",{"$f":"Data!$E1490*VLOOKUP(Data!$F1490,tblXrate[],2,FALSE)","v":40000},"Assistant Manager","Manager","India",{"$f":"VLOOKUP(Data!$J1490,tblCountries[[Actual]:[Mapping]],2,FALSE)","v":"USA"},"4 to 6 hours a day",5,"India"]
[null,"ID1896","2012-06-19T00:23:24",45000,45000,"USD",{"$f":"Data!$E1504*VLOOKUP(Data!$F1504,tblXrate[],2,FALSE)","v":4897.177089046706},"Senior Accountant","Accountant","USA",{"$f":"VLOOKUP(Data!$J1504,tblCountries[[Actual]:[Mapping]],2,FALSE)","v":"India"},"2 to 3 hours per day",5,"USA"]
[null,"ID1898","2012-06-19T03:25:34",43000,43000,"USD",{"$f":"Data!$E1506*VLOOKUP(Data!$F1506,tblXrate[],2,FALSE)","v":51000},"Performance Improvement Analyst","Analyst","USA",{"$f":"VLOOKUP(Data!$J1506,tblCountries[[Actual]:[Mapping]],2,FALSE)","v":"USA"},"4 to 6 hours a day",5,"USA"]
[null,"ID1907","2012-06-19T20:16:30",750000,750000,"INR",{"$f":"Data!$E1513*VLOOKUP(Data!$F1513,tblXrate[],2,FALSE)","v":43000},"Analyst","Analyst","India",{"$f":"VLOOKUP(Data!$J1513,tblCountries[[Actual]:[Mapping]],2,FALSE)","v":"USA"},"4 to 6 hours a day",5,"India"]
[null,"ID1918","2012-06-20T01:54:10",20000,20000,"USD",{"$f":"Data!$E1523*VLOOKUP(Data!$F1523,tblXrate[],2,FALSE)","v":8547.8000099724322},"Monitoring and Evaluation Officer","Manager","India",{"$f":"VLOOKUP(Data!$J1523,tblCountries[[Actual]:[Mapping]],2,FALSE)","v":"India"},"2 to 3 hours per day",5,"India"]
[null,"ID1929","2012-06-21T03:46:23",21000,21000,"USD",{"$f":"Data!$E1529*VLOOKUP(Data!$F1529,tblXrate[],2,FALSE)","v":65000},"eorl","Misc.","India",{"$f":"VLOOKUP(Data!$J1529,tblCountries[[Actual]:[Mapping]],2,FALSE)","v":"USA"},"All the 8 hours baby, all the 8!",5,"India"]
[null,"ID1931","2012-06-21T04:44:20",46359,46359,"USD",{"$f":"Data!$E1531*VLOOKUP(Data!$F1531,tblXrate[],2,FALSE)","v":95000},"Data Analyst","Analyst","USA",{"$f":"VLOOKUP(Data!$J1531,tblCountries[[Actual]:[Mapping]],2,FALSE)","v":"USA"},"All the 8 hours baby, all the 8!",5,"USA"]
[null,"ID0628","2012-05-26T11:07:01",10000,10000,"USD",{"$f":"Data!$E1631*VLOOKUP(Data!$F1631,tblXrate[],2,FALSE)","v":130000},"executive","Manager","Indonesia","Other Countries","2 to 3 hours per day",5,"Indonesia"]
[null,"ID0740","2012-05-26T15:53:10",10000,120000,"EGYPT",{"$f":"Data!$E1645*VLOOKUP(Data!$F1645,tblXrate[],2,FALSE)","v":89000},"Estimator","Analyst","Egypt","Other Countries","All the 8 hours baby, all the 8!",5,"Egypt"]
[null,"ID0759","2012-05-26T17:03:02",1488000,1488000,"NAIRA",{"$f":"Data!$E1650*VLOOKUP(Data!$F1650,tblXrate[],2,FALSE)","v":41932},"Company Systems Integration Manager","Manager","Nigeria","Other Countries","2 to 3 hours per day",5,"Nigeria"]
[null,"ID0812","2012-05-26T22:07:39","24000 $",24000,"USD",{"$f":"Data!$E1660*VLOOKUP(Data!$F1660,tblXrate[],2,FALSE)","v":11040.908346214392},"Logistic KA Manager","Manager","Croatia","Other Countries","2 to 3 hours per day",5,"Croatia"]
[null,"ID0825","2012-05-26T22:53:35","12000 $",12000,"USD",{"$f":"Data!$E1662*VLOOKUP(Data!$F1662,tblXrate[],2,FALSE)","v":47000},"Investment manager","Manager","Ukraine","Other Countries","4 to 6 hours a day",5,"Ukraine"]
[null,"ID0834","2012-05-26T23:17:09","15600 â‚¬",15600,"EUR",{"$f":"Data!$E1665*VLOOKUP(Data!$F1665,tblXrate[],2,FALSE)","v":50000},"Managment controller","Controller","Portugal","Other Countries","4 to 6 hours a day",5,"Portugal"]
[null,"ID0935","2012-05-27T22:58:39",60000,60000,"USD",{"$f":"Data!$E1693*VLOOKUP(Data!$F1693,tblXrate[],2,FALSE)","v":24000},"Consultant","Consultant","Singapore","Other Countries","4 to 6 hours a day",5,"Singapore"]
[null,"ID0958","2012-05-28T03:44:00","2,000,000 Naira",2000000,"NAIRA",{"$f":"Data!$E1701*VLOOKUP(Data!$F1701,tblXrate[],2,FALSE)","v":120000},"Head Business Advisory","Manager","Nigeria","Other Countries","4 to 6 hours a day",5,"Nigeria"]
[null,"ID0960","2012-05-28T04:40:41","48000 $",48000,"USD",{"$f":"Data!$E1702*VLOOKUP(Data!$F1702,tblXrate[],2,FALSE)","v":71231.666749770273},"Merchandise planner","Manager","France","Other Countries","4 to 6 hours a day",5,"France"]
[null,"ID0961","2012-05-28T05:07:44",40000,40000,"USD",{"$f":"Data!$E1703*VLOOKUP(Data!$F1703,tblXrate[],2,FALSE)","v":5342.3750062327708},"analyst","Analyst","NZ","Other Countries","4 to 6 hours a day",5,"New Zealand"]
[null,"ID1037","2012-05-28T13:06:37",3500,42000,"USD",{"$f":"Data!$E1717*VLOOKUP(Data!$F1717,tblXrate[],2,FALSE)","v":80000},"Category Operations Supv.","Manager","Kuwait","Other Countries","All the 8 hours baby, all the 8!",5,"Kuwait"]
[null,"ID1043","2012-05-28T13:40:58","USD 60000",60000,"USD",{"$f":"Data!$E1719*VLOOKUP(Data!$F1719,tblXrate[],2,FALSE)","v":51134.799197576998},"Excel Developer","Consultant","Finland","Other Countries","All the 8 hours baby, all the 8!",5,"Finland"]
[null,"ID1151","2012-05-28T20:19:57",6000,6000,"USD",{"$f":"Data!$E1741*VLOOKUP(Data!$F1741,tblXrate[],2,FALSE)","v":45234.630059395036},"Assistant Accountant","Accountant","Zambia","Other Countries","All the 8 hours baby, all the 8!",5,"Zambia"]
[null,"ID1180","2012-05-28T22:50:51",28000,28000,"USD",{"$f":"Data!$E1747*VLOOKUP(Data!$F1747,tblXrate[],2,FALSE)","v":40000},"Business Intelligence Manager","Manager","Poland","Other Countries","4 to 6 hours a day",5,"Poland"]
[null,"ID1221","2012-05-29T01:06:44",4400,4400,"USD",{"$f":"Data!$E1758*VLOOKUP(Data!$F1758,tblXrate[],2,FALSE)","v":8903.9583437212841},"Manager Corporate Finance","Manager","Latin America","Other Countries","2 to 3 hours per day",5,"Latin America"]
[null,"ID1262","2012-05-29T08:25:51","120,000  US$",120000,"USD",{"$f":"Data!$E1770*VLOOKUP(Data!$F1770,tblXrate[],2,FALSE)","v":100000},"Consultant - Process Improvement","Consultant","Singapore","Other Countries","1 or 2 hours a day",5,"Singapore"]
[null,"ID1336","2012-05-29T17:05:31",24000,24000,"USD",{"$f":"Data!$E1786*VLOOKUP(Data!$F1786,tblXrate[],2,FALSE)","v":43000},"Dir. Revenue Mgt","Manager","Kingdom of Saudi Arabia","Other Countries","4 to 6 hours a day",5,"Saudi Arabia"]
[null,"ID1461","2012-05-30T13:56:27",50000,50000,"NZD",{"$f":"Data!$E1803*VLOOKUP(Data!$F1803,tblXrate[],2,FALSE)","v":65616.131023916547},"stress engineer","Engineer","nld","Other Countries","4 to 6 hours a day",5,"New Zealand"]
[null,"ID1499","2012-05-30T22:11:21","15000 USD",15000,"USD",{"$f":"Data!$E1812*VLOOKUP(Data!$F1812,tblXrate[],2,FALSE)","v":62249.572510588783},"Manager","Manager","Romania","Other Countries","2 to 3 hours per day",5,"Romania"]
[null,"ID1548","2012-05-31T17:35:33","45.000 USD",45000,"USD",{"$f":"Data!$E1820*VLOOKUP(Data!$F1820,tblXrate[],2,FALSE)","v":21000},"Junior Reporting Manager","Manager","Germany","Other Countries","2 to 3 hours per day",5,"Germany"]
[null,"ID1556","2012-05-31T21:47:37",110000,110000,"USD",{"$f":"Data!$E1822*VLOOKUP(Data!$F1822,tblXrate[],2,FALSE)","v":44463.980364706273},"Business Controller","Controller","Norway","Other Countries","All the 8 hours baby, all the 8!",5,"Norway"]
[null,"ID1563","2012-05-31T23:10:44","70000 â‚¬",70000,"EUR",{"$f":"Data!$E1824*VLOOKUP(Data!$F1824,tblXrate[],2,FALSE)","v":85000},"Specialist Learning Technology","Specialist","Germany","Other Countries","1 or 2 hours a day",5,"Germany"]
[null,"ID1635","2012-06-03T02:54:32",36000,36000,"USD",{"$f":"Data!$E1837*VLOOKUP(Data!$F1837,tblXrate[],2,FALSE)","v":7600},"Environmental Adviser","Consultant","Azerbaijan","Other Countries","4 to 6 hours a day",5,"Azerbaijan"]
[null,"ID1677","2012-06-05T03:50:02",3300,39600,"EUR",{"$f":"Data!$E1847*VLOOKUP(Data!$F1847,tblXrate[],2,FALSE)","v":10809.503829551191},"Maintenance Manager","Manager","Europe","Other Countries","1 or 2 hours a day",5,"Europe"]
[null,"ID1689","2012-06-05T19:16:03",21000,21000,"EUR",{"$f":"Data!$E1851*VLOOKUP(Data!$F1851,tblXrate[],2,FALSE)","v":68954.520184280962},"Sales Planning","Analyst","Portugal","Other Countries","4 to 6 hours a day",5,"Portugal"]
[null,"ID1693","2012-06-05T21:07:16","400 000 NOK",400000,"NOK",{"$f":"Data!$E1853*VLOOKUP(Data!$F1853,tblXrate[],2,FALSE)","v":220700},"Economic analyst","Analyst","Norway","Other Countries","All the 8 hours baby, all the 8!",5,"Norway"]
[null,"ID1704","2012-06-06T01:41:40","US$45,000",45000,"USD",{"$f":"Data!$E1856*VLOOKUP(Data!$F1856,tblXrate[],2,FALSE)","v":12000},"CFO","CXO or Top Mgmt.","Mexico","Other Countries","4 to 6 hours a day",5,"Mexico"]
[null,"ID1732","2012-06-07T14:06:38","6000 US",6000,"USD",{"$f":"Data!$E1859*VLOOKUP(Data!$F1859,tblXrate[],2,FALSE)","v":63586},"Reporting Coordinator","Reporting","Armenia","Other Countries","All the 8 hours baby, all the 8!",5,"Armenia"]
[null,"ID1844","2012-06-14T14:08:58",5000,60000,"USD",{"$f":"Data!$E1872*VLOOKUP(Data!$F1872,tblXrate[],2,FALSE)","v":12000},"Analyst","Analyst","UAE","Other Countries","4 to 6 hours a day",5,"UAE"]
[null,"ID0758","2012-05-26T17:02:46","Rs. 225000",225000,"INR",{"$f":"Data!$E631*VLOOKUP(Data!$F631,tblXrate[],2,FALSE)","v":54000},"MIS Executive","Reporting","India",{"$f":"VLOOKUP(Data!$J631,tblCountries[[Actual]:[Mapping]],2,FALSE)","v":"USA"},"All the 8 hours baby, all the 8!",5.5,"India"]
[null,"ID1354","2012-05-29T18:35:31","A$150000",150000,"AUD",{"$f":"Data!$E1068*VLOOKUP(Data!$F1068,tblXrate[],2,FALSE)","v":65000},"Bus Analyst","Analyst","Australia",{"$f":"VLOOKUP(Data!$J1068,tblCountries[[Actual]:[Mapping]],2,FALSE)","v":"USA"},"1 or 2 hours a day",5.5,"Australia"]
[null,"ID1436","2012-05-30T02:35:40","Rs 3.25 Lacs",3250000,"INR",{"$f":"Data!$E1142*VLOOKUP(Data!$F1142,tblXrate[],2,FALSE)","v":60000},"ISO TS Documentation","Analyst","India",{"$f":"VLOOKUP(Data!$J1142,tblCountries[[Actual]:[Mapping]],2,FALSE)","v":"UAE"},"4 to 6 hours a day",5.5,"India"]
[null,"ID1366","2012-05-29T19:31:32","2.21Lac",2210000,"INR",{"$f":"Data!$E1079*VLOOKUP(Data!$F1079,tblXrate[],2,FALSE)","v":76223.966339496474},"Marketing","Analyst","India",{"$f":"VLOOKUP(Data!$J1079,tblCountries[[Actual]:[Mapping]],2,FALSE)","v":"italy"},"1 or 2 hours a day",5.6,"India"]
[null,"ID0566","2012-05-26T06:24:03",55000,55000,"EUR",{"$f":"Data!$E468*VLOOKUP(Data!$F468,tblXrate[],2,FALSE)","v":3561.5833374885137},"Business analyst","Analyst","Netherlands",{"$f":"VLOOKUP(Data!$J468,tblCountries[[Actual]:[Mapping]],2,FALSE)","v":"India"},"All the 8 hours baby, all the 8!",6,"Netherlands"]
[null,"ID0573","2012-05-26T06:54:40",90000,90000,"USD",{"$f":"Data!$E473*VLOOKUP(Data!$F473,tblXrate[],2,FALSE)","v":71243.257897441246},"Sales Operations Supervisor","Manager","USA",{"$f":"VLOOKUP(Data!$J473,tblCountries[[Actual]:[Mapping]],2,FALSE)","v":"UK"},"4 to 6 hours a day",6,"USA"]
[null,"ID0576","2012-05-26T07:06:50","USD 4285.00",4285,"USD",{"$f":"Data!$E476*VLOOKUP(Data!$F476,tblXrate[],2,FALSE)","v":10000},"Assistant","Analyst","India",{"$f":"VLOOKUP(Data!$J476,tblCountries[[Actual]:[Mapping]],2,FALSE)","v":"India"},"All the 8 hours baby, all the 8!",6,"India"]
[null,"ID0616","2012-05-26T10:41:11","INR 850,000",850000,"INR",{"$f":"Data!$E509*VLOOKUP(Data!$F509,tblXrate[],2,FALSE)","v":11575.14584683767},"Sales Analyst","Analyst","India",{"$f":"VLOOKUP(Data!$J509,tblCountries[[Actual]:[Mapping]],2,FALSE)","v":"India"},"4 to 6 hours a day",6,"India"]
[null,"ID0625","2012-05-26T11:03:48",4000,4000,"USD",{"$f":"Data!$E518*VLOOKUP(Data!$F518,tblXrate[],2,FALSE)","v":70928.022243027779},"MIS Executive","Reporting","India",{"$f":"VLOOKUP(Data!$J518,tblCountries[[Actual]:[Mapping]],2,FALSE)","v":"UK"},"All the 8 hours baby, all the 8!",6,"India"]
[null,"ID0641","2012-05-26T11:45:37","4500000 inr/pa",4500000,"INR",{"$f":"Data!$E533*VLOOKUP(Data!$F533,tblXrate[],2,FALSE)","v":43000},"cmo","CXO or Top Mgmt.","India",{"$f":"VLOOKUP(Data!$J533,tblCountries[[Actual]:[Mapping]],2,FALSE)","v":"USA"},"1 or 2 hours a day",6,"India"]
[null,"ID0694","2012-05-26T13:24:36",380000,380000,"INR",{"$f":"Data!$E578*VLOOKUP(Data!$F578,tblXrate[],2,FALSE)","v":6677.9687577909626},"Team Lead Mis","Reporting","India",{"$f":"VLOOKUP(Data!$J578,tblCountries[[Actual]:[Mapping]],2,FALSE)","v":"India"},"2 to 3 hours per day",6,"India"]
[null,"ID0720","2012-05-26T14:46:55",375000,375000,"INR",{"$f":"Data!$E601*VLOOKUP(Data!$F601,tblXrate[],2,FALSE)","v":6000},"Team Lead","Manager","India",{"$f":"VLOOKUP(Data!$J601,tblCountries[[Actual]:[Mapping]],2,FALSE)","v":"India"},"2 to 3 hours per day",6,"India"]
[null,"ID0722","2012-05-26T14:57:39",31250,31250,"USD",{"$f":"Data!$E602*VLOOKUP(Data!$F602,tblXrate[],2,FALSE)","v":52118.160720607324},"Program management","Manager","India",{"$f":"VLOOKUP(Data!$J602,tblCountries[[Actual]:[Mapping]],2,FALSE)","v":"Canada"},"2 to 3 hours per day",6,"India"]
[null,"ID0726","2012-05-26T15:01:41","Rs. 250000",250000,"INR",{"$f":"Data!$E606*VLOOKUP(Data!$F606,tblXrate[],2,FALSE)","v":12465.541681209797},"Asst. Manager","Manager","India",{"$f":"VLOOKUP(Data!$J606,tblCountries[[Actual]:[Mapping]],2,FALSE)","v":"India"},"4 to 6 hours a day",6,"India"]
[null,"ID0750","2012-05-26T16:25:53",6000,6000,"USD",{"$f":"Data!$E625*VLOOKUP(Data!$F625,tblXrate[],2,FALSE)","v":4500},"Merchandiser","Manager","India",{"$f":"VLOOKUP(Data!$J625,tblCountries[[Actual]:[Mapping]],2,FALSE)","v":"Pakistan"},"2 to 3 hours per day",6,"India"]
[null,"ID0751","2012-05-26T16:26:35","INR 30000",360000,"INR",{"$f":"Data!$E626*VLOOKUP(Data!$F626,tblXrate[],2,FALSE)","v":30273.458368652366},"Project Lead","Manager","India",{"$f":"VLOOKUP(Data!$J626,tblCountries[[Actual]:[Mapping]],2,FALSE)","v":"India"},"All the 8 hours baby, all the 8!",6,"India"]
[null,"ID0757","2012-05-26T16:50:46",8000,8000,"USD",{"$f":"Data!$E630*VLOOKUP(Data!$F630,tblXrate[],2,FALSE)","v":73000},"Business Analyst","Analyst","India",{"$f":"VLOOKUP(Data!$J630,tblCountries[[Actual]:[Mapping]],2,FALSE)","v":"USA"},"2 to 3 hours per day",6,"India"]
[null,"ID0796","2012-05-26T20:57:13","Rs. 8000",1152000,"INR",{"$f":"Data!$E662*VLOOKUP(Data!$F662,tblXrate[],2,FALSE)","v":17807.916687442568},"Cashier","Accountant","India",{"$f":"VLOOKUP(Data!$J662,tblCountries[[Actual]:[Mapping]],2,FALSE)","v":"India"},"4 to 6 hours a day",6,"India"]
[null,"ID0807","2012-05-26T21:40:49","Rs. 450000",450000,"INR",{"$f":"Data!$E671*VLOOKUP(Data!$F671,tblXrate[],2,FALSE)","v":3205.4250037396623},"Sr. Executive","Manager","India",{"$f":"VLOOKUP(Data!$J671,tblCountries[[Actual]:[Mapping]],2,FALSE)","v":"India"},"4 to 6 hours a day",6,"India"]
[null,"ID0838","2012-05-26T23:47:34","13000 USD",13000,"USD",{"$f":"Data!$E694*VLOOKUP(Data!$F694,tblXrate[],2,FALSE)","v":75000},"Business Analyst","Analyst","India",{"$f":"VLOOKUP(Data!$J694,tblCountries[[Actual]:[Mapping]],2,FALSE)","v":"USA"},"All the 8 hours baby, all the 8!",6,"India"]
[null,"ID0889","2012-05-27T13:41:04","400000 Rs",400000,"INR",{"$f":"Data!$E729*VLOOKUP(Data!$F729,tblXrate[],2,FALSE)","v":30000},"engineer","Engineer","India",{"$f":"VLOOKUP(Data!$J729,tblCountries[[Actual]:[Mapping]],2,FALSE)","v":"USA"},"2 to 3 hours per day",6,"India"]
[null,"ID0905","2012-05-27T15:32:10",10000,10000,"USD",{"$f":"Data!$E739*VLOOKUP(Data!$F739,tblXrate[],2,FALSE)","v":9616.275011218986},"Planner","Manager","India",{"$f":"VLOOKUP(Data!$J739,tblCountries[[Actual]:[Mapping]],2,FALSE)","v":"India"},"4 to 6 hours a day",6,"India"]
[null,"ID0906","2012-05-27T15:44:07",75010,75010,"USD",{"$f":"Data!$E740*VLOOKUP(Data!$F740,tblXrate[],2,FALSE)","v":65000},"Senior Business Analyst","Analyst","USA",{"$f":"VLOOKUP(Data!$J740,tblCountries[[Actual]:[Mapping]],2,FALSE)","v":"USA"},"2 to 3 hours per day",6,"USA"]
[null,"ID0915","2012-05-27T17:16:55","486000 INR",486000,"INR",{"$f":"Data!$E747*VLOOKUP(Data!$F747,tblXrate[],2,FALSE)","v":112190.06220428993},"Assistant manager","Manager","India",{"$f":"VLOOKUP(Data!$J747,tblCountries[[Actual]:[Mapping]],2,FALSE)","v":"Australia"},"All the 8 hours baby, all the 8!",6,"India"]
[null,"ID0939","2012-05-27T23:43:21",290,3480,"USD",{"$f":"Data!$E762*VLOOKUP(Data!$F762,tblXrate[],2,FALSE)","v":21228.177433598263},"Reconciliation Manager in Textile Mill","Manager","Pakistan",{"$f":"VLOOKUP(Data!$J762,tblCountries[[Actual]:[Mapping]],2,FALSE)","v":"Pakistan"},"All the 8 hours baby, all the 8!",6,"Pakistan"]
[null,"ID0969","2012-05-28T06:35:50",100000,100000,"AUD",{"$f":"Data!$E778*VLOOKUP(Data!$F778,tblXrate[],2,FALSE)","v":76223.981237173866},"Senior Consultant","Consultant","Australia",{"$f":"VLOOKUP(Data!$J778,tblCountries[[Actual]:[Mapping]],2,FALSE)","v":"UK"},"All the 8 hours baby, all the 8!",6,"Australia"]
[null,"ID0993","2012-05-28T09:12:27",92000,92000,"AUD",{"$f":"Data!$E798*VLOOKUP(Data!$F798,tblXrate[],2,FALSE)","v":46000},"Finance analyst","Analyst","Australia",{"$f":"VLOOKUP(Data!$J798,tblCountries[[Actual]:[Mapping]],2,FALSE)","v":"USA"},"All the 8 hours baby, all the 8!",6,"Australia"]
[null,"ID0999","2012-05-28T09:43:33","1200000 INR",1200000,"INR",{"$f":"Data!$E803*VLOOKUP(Data!$F803,tblXrate[],2,FALSE)","v":50694.322109187968},"Senior Consultant","Consultant","India",{"$f":"VLOOKUP(Data!$J803,tblCountries[[Actual]:[Mapping]],2,FALSE)","v":"Japan"},"All the 8 hours baby, all the 8!",6,"India"]
[null,"ID1003","2012-05-28T10:25:51","Rs.5,45,000",545000,"INR",{"$f":"Data!$E805*VLOOKUP(Data!$F805,tblXrate[],2,FALSE)","v":7200},"Assistant Manager","Manager","India",{"$f":"VLOOKUP(Data!$J805,tblCountries[[Actual]:[Mapping]],2,FALSE)","v":"Colombia"},"2 to 3 hours per day",6,"India"]
[null,"ID1015","2012-05-28T11:39:01","Rs.6.4 lakhs",640000,"INR",{"$f":"Data!$E816*VLOOKUP(Data!$F816,tblXrate[],2,FALSE)","v":16027.125018698311},"Sr.Analyst - Process Excellence","Analyst","India",{"$f":"VLOOKUP(Data!$J816,tblCountries[[Actual]:[Mapping]],2,FALSE)","v":"India"},"All the 8 hours baby, all the 8!",6,"India"]
[null,"ID1020","2012-05-28T12:10:09",7265,7265,"USD",{"$f":"Data!$E819*VLOOKUP(Data!$F819,tblXrate[],2,FALSE)","v":28492.66669990811},"Softwar Engineer","Engineer","India",{"$f":"VLOOKUP(Data!$J819,tblCountries[[Actual]:[Mapping]],2,FALSE)","v":"India"},"4 to 6 hours a day",6,"India"]
[null,"ID1077","2012-05-28T15:27:59",560,6720,"USD",{"$f":"Data!$E862*VLOOKUP(Data!$F862,tblXrate[],2,FALSE)","v":100000},"MIS Executive","Reporting","India",{"$f":"VLOOKUP(Data!$J862,tblCountries[[Actual]:[Mapping]],2,FALSE)","v":"USA"},"4 to 6 hours a day",6,"India"]
[null,"ID1111","2012-05-28T16:45:32","Â£35000",35000,"GBP",{"$f":"Data!$E892*VLOOKUP(Data!$F892,tblXrate[],2,FALSE)","v":39404.456801682099},"Systems Analyst","Analyst","UK",{"$f":"VLOOKUP(Data!$J892,tblCountries[[Actual]:[Mapping]],2,FALSE)","v":"UK"},"2 to 3 hours per day",6,"UK"]
[null,"ID1146","2012-05-28T19:25:04","INR 853000",853000,"INR",{"$f":"Data!$E918*VLOOKUP(Data!$F918,tblXrate[],2,FALSE)","v":41000},"Lead Research Analyst","Analyst","India",{"$f":"VLOOKUP(Data!$J918,tblCountries[[Actual]:[Mapping]],2,FALSE)","v":"USA"},"2 to 3 hours per day",6,"India"]
[null,"ID1160","2012-05-28T21:55:25",500,6000,"USD",{"$f":"Data!$E927*VLOOKUP(Data!$F927,tblXrate[],2,FALSE)","v":125000},"AM Ops","Manager","India",{"$f":"VLOOKUP(Data!$J927,tblCountries[[Actual]:[Mapping]],2,FALSE)","v":"USA"},"4 to 6 hours a day",6,"India"]
[null,"ID1177","2012-05-28T22:46:37","CAD $53,000/-",53000,"CAD",{"$f":"Data!$E940*VLOOKUP(Data!$F940,tblXrate[],2,FALSE)","v":110000},"Data Analyst","Analyst","Canada",{"$f":"VLOOKUP(Data!$J940,tblCountries[[Actual]:[Mapping]],2,FALSE)","v":"USA"},"4 to 6 hours a day",6,"Canada"]
[null,"ID1178","2012-05-28T22:48:32","INR 20 Lakhs p.a.",200000,"INR",{"$f":"Data!$E941*VLOOKUP(Data!$F941,tblXrate[],2,FALSE)","v":70000},"Associate","Analyst","India",{"$f":"VLOOKUP(Data!$J941,tblCountries[[Actual]:[Mapping]],2,FALSE)","v":"USA"},"1 or 2 hours a day",6,"India"]
[null,"ID1199","2012-05-28T23:38:52",80000,80000,"USD",{"$f":"Data!$E955*VLOOKUP(Data!$F955,tblXrate[],2,FALSE)","v":14630.613583549337},"Financial/Data Analyst","Analyst","USA",{"$f":"VLOOKUP(Data!$J955,tblCountries[[Actual]:[Mapping]],2,FALSE)","v":"South Africa"},"4 to 6 hours a day",6,"USA"]
[null,"ID1211","2012-05-29T00:25:39",60000,60000,"USD",{"$f":"Data!$E964*VLOOKUP(Data!$F964,tblXrate[],2,FALSE)","v":82000},"Quality Assurance Engineer","Engineer","USA",{"$f":"VLOOKUP(Data!$J964,tblCountries[[Actual]:[Mapping]],2,FALSE)","v":"South Africa"},"1 or 2 hours a day",6,"USA"]
[null,"ID1225","2012-05-29T01:31:39","700000 INR",700000,"INR",{"$f":"Data!$E976*VLOOKUP(Data!$F976,tblXrate[],2,FALSE)","v":96891.417358250401},"Lead Executive MIS","Reporting","India",{"$f":"VLOOKUP(Data!$J976,tblCountries[[Actual]:[Mapping]],2,FALSE)","v":"Australia"},"4 to 6 hours a day",6,"India"]
[null,"ID1230","2012-05-29T01:50:01",300000,300000,"INR",{"$f":"Data!$E979*VLOOKUP(Data!$F979,tblXrate[],2,FALSE)","v":100000},"Finance Analyst","Analyst","India",{"$f":"VLOOKUP(Data!$J979,tblCountries[[Actual]:[Mapping]],2,FALSE)","v":"USA"},"4 to 6 hours a day",6,"India"]
[null,"ID1258","2012-05-29T07:46:56",70000,70000,"USD",{"$f":"Data!$E1000*VLOOKUP(Data!$F1000,tblXrate[],2,FALSE)","v":75000},"Develope","Analyst","USA",{"$f":"VLOOKUP(Data!$J1000,tblCountries[[Actual]:[Mapping]],2,FALSE)","v":"USA"},"1 or 2 hours a day",6,"USA"]
[null,"ID1281","2012-05-29T10:51:02","Rs.3.6 Lakhs pa",360000,"INR",{"$f":"Data!$E1016*VLOOKUP(Data!$F1016,tblXrate[],2,FALSE)","v":140000},"Team Leader WFM","Manager","India",{"$f":"VLOOKUP(Data!$J1016,tblCountries[[Actual]:[Mapping]],2,FALSE)","v":"USA"},"All the 8 hours baby, all the 8!",6,"India"]
[null,"ID1287","2012-05-29T12:14:02",54000,54000,"USD",{"$f":"Data!$E1021*VLOOKUP(Data!$F1021,tblXrate[],2,FALSE)","v":100000},"Resource Planning Analyst","Analyst","USA",{"$f":"VLOOKUP(Data!$J1021,tblCountries[[Actual]:[Mapping]],2,FALSE)","v":"USA"},"All the 8 hours baby, all the 8!",6,"USA"]
[null,"ID1303","2012-05-29T13:53:59",80000,80000,"USD",{"$f":"Data!$E1032*VLOOKUP(Data!$F1032,tblXrate[],2,FALSE)","v":44463.980364706273},"Manager","Manager","USA",{"$f":"VLOOKUP(Data!$J1032,tblCountries[[Actual]:[Mapping]],2,FALSE)","v":"Ireland"},"1 or 2 hours a day",6,"USA"]
[null,"ID1314","2012-05-29T15:04:11","INR360000",360000,"INR",{"$f":"Data!$E1041*VLOOKUP(Data!$F1041,tblXrate[],2,FALSE)","v":95000},"Sr. Executive -HR","Analyst","India",{"$f":"VLOOKUP(Data!$J1041,tblCountries[[Actual]:[Mapping]],2,FALSE)","v":"USA"},"All the 8 hours baby, all the 8!",6,"India"]
[null,"ID1349","2012-05-29T18:14:48","Â£30000",30000,"GBP",{"$f":"Data!$E1064*VLOOKUP(Data!$F1064,tblXrate[],2,FALSE)","v":47285.348162018527},"Market Analyst","Analyst","UK",{"$f":"VLOOKUP(Data!$J1064,tblCountries[[Actual]:[Mapping]],2,FALSE)","v":"UK"},"All the 8 hours baby, all the 8!",6,"UK"]
[null,"ID1395","2012-05-29T22:13:08",73500,73500,"USD",{"$f":"Data!$E1103*VLOOKUP(Data!$F1103,tblXrate[],2,FALSE)","v":126094.26176538273},"Senior Underwriting Analyst","Analyst","USA",{"$f":"VLOOKUP(Data!$J1103,tblCountries[[Actual]:[Mapping]],2,FALSE)","v":"UK"},"All the 8 hours baby, all the 8!",6,"USA"]
[null,"ID1399","2012-05-29T22:32:16",20000,20000,"USD",{"$f":"Data!$E1107*VLOOKUP(Data!$F1107,tblXrate[],2,FALSE)","v":40000},"Business Operation Specialist","Specialist","India",{"$f":"VLOOKUP(Data!$J1107,tblCountries[[Actual]:[Mapping]],2,FALSE)","v":"Pakistan"},"4 to 6 hours a day",6,"India"]
[null,"ID1419","2012-05-30T00:42:50",40000,40000,"USD",{"$f":"Data!$E1125*VLOOKUP(Data!$F1125,tblXrate[],2,FALSE)","v":59000},"Metrics Analyst","Analyst","USA",{"$f":"VLOOKUP(Data!$J1125,tblCountries[[Actual]:[Mapping]],2,FALSE)","v":"USA"},"2 to 3 hours per day",6,"USA"]
[null,"ID1457","2012-05-30T13:36:42",1000000,1000000,"INR",{"$f":"Data!$E1160*VLOOKUP(Data!$F1160,tblXrate[],2,FALSE)","v":21342.710575059013},"project management","Manager","India",{"$f":"VLOOKUP(Data!$J1160,tblCountries[[Actual]:[Mapping]],2,FALSE)","v":"Portugal"},"All the 8 hours baby, all the 8!",6,"India"]
[null,"ID1463","2012-05-30T14:09:10","4 Lakhs INR p.a",400000,"INR",{"$f":"Data!$E1163*VLOOKUP(Data!$F1163,tblXrate[],2,FALSE)","v":48000},"Reporting Manager","Manager","India",{"$f":"VLOOKUP(Data!$J1163,tblCountries[[Actual]:[Mapping]],2,FALSE)","v":"USA"},"4 to 6 hours a day",6,"India"]
[null,"ID1465","2012-05-30T14:21:57",360000,360000,"INR",{"$f":"Data!$E1165*VLOOKUP(Data!$F1165,tblXrate[],2,FALSE)","v":44132.991617883956},"analyst","Analyst","India",{"$f":"VLOOKUP(Data!$J1165,tblCountries[[Actual]:[Mapping]],2,FALSE)","v":"UK"},"2 to 3 hours per day",6,"India"]
[null,"ID1479","2012-05-30T18:15:28",4000,4000,"USD",{"$f":"Data!$E1176*VLOOKUP(Data!$F1176,tblXrate[],2,FALSE)","v":21369.500024931083},"M I S Executive","Analyst","India",{"$f":"VLOOKUP(Data!$J1176,tblCountries[[Actual]:[Mapping]],2,FALSE)","v":"India"},"All the 8 hours baby, all the 8!",6,"India"]
[null,"ID1506","2012-05-30T23:29:58",18000,18000,"USD",{"$f":"Data!$E1196*VLOOKUP(Data!$F1196,tblXrate[],2,FALSE)","v":82888.5550559455},"Process Associate","Analyst","India",{"$f":"VLOOKUP(Data!$J1196,tblCountries[[Actual]:[Mapping]],2,FALSE)","v":"Denmark"},"All the 8 hours baby, all the 8!",6,"India"]
[null,"ID1528","2012-05-31T07:17:36",145000,145000,"USD",{"$f":"Data!$E1213*VLOOKUP(Data!$F1213,tblXrate[],2,FALSE)","v":105000},"Associate","Analyst","USA",{"$f":"VLOOKUP(Data!$J1213,tblCountries[[Actual]:[Mapping]],2,FALSE)","v":"USA"},"4 to 6 hours a day",6,"USA"]
[null,"ID1540","2012-05-31T16:10:28","Rs. 380000",380000,"INR",{"$f":"Data!$E1222*VLOOKUP(Data!$F1222,tblXrate[],2,FALSE)","v":19000},"reporting analyst","Analyst","India",{"$f":"VLOOKUP(Data!$J1222,tblCountries[[Actual]:[Mapping]],2,FALSE)","v":"UK"},"2 to 3 hours per day",6,"India"]
[null,"ID1585","2012-06-01T08:06:34","5.65 lac per annum",5650000,"INR",{"$f":"Data!$E1255*VLOOKUP(Data!$F1255,tblXrate[],2,FALSE)","v":114335.9495092447},"MIS","Reporting","India",{"$f":"VLOOKUP(Data!$J1255,tblCountries[[Actual]:[Mapping]],2,FALSE)","v":"CEE"},"2 to 3 hours per day",6,"India"]
[null,"ID1591","2012-06-01T14:50:41",4500,4500,"USD",{"$f":"Data!$E1261*VLOOKUP(Data!$F1261,tblXrate[],2,FALSE)","v":57600},"Assistant Manger Service Quality Assurance","Analyst","Pakistan",{"$f":"VLOOKUP(Data!$J1261,tblCountries[[Actual]:[Mapping]],2,FALSE)","v":"Saudi Arabia"},"4 to 6 hours a day",6,"Pakistan"]
[null,"ID1592","2012-06-01T15:09:27",1700000,1700000,"INR",{"$f":"Data!$E1262*VLOOKUP(Data!$F1262,tblXrate[],2,FALSE)","v":114335.9495092447},"AVP","CXO or Top Mgmt.","India",{"$f":"VLOOKUP(Data!$J1262,tblCountries[[Actual]:[Mapping]],2,FALSE)","v":"Europe"},"4 to 6 hours a day",6,"India"]
[null,"ID1602","2012-06-01T20:27:23",10000,10000,"USD",{"$f":"Data!$E1268*VLOOKUP(Data!$F1268,tblXrate[],2,FALSE)","v":11575.14584683767},"MIS","Reporting","India",{"$f":"VLOOKUP(Data!$J1268,tblCountries[[Actual]:[Mapping]],2,FALSE)","v":"India"},"All the 8 hours baby, all the 8!",6,"India"]
[null,"ID1659","2012-06-04T13:30:51",84000,84000,"AUD",{"$f":"Data!$E1314*VLOOKUP(Data!$F1314,tblXrate[],2,FALSE)","v":62000},"consultant","Consultant","Australia",{"$f":"VLOOKUP(Data!$J1314,tblCountries[[Actual]:[Mapping]],2,FALSE)","v":"USA"},"4 to 6 hours a day",6,"Australia"]
[null,"ID1681","2012-06-05T05:03:20",48500,48500,"USD",{"$f":"Data!$E1329*VLOOKUP(Data!$F1329,tblXrate[],2,FALSE)","v":105000},"Business Systems Analyst I","Analyst","USA",{"$f":"VLOOKUP(Data!$J1329,tblCountries[[Actual]:[Mapping]],2,FALSE)","v":"USA"},"4 to 6 hours a day",6,"USA"]
[null,"ID1707","2012-06-06T03:14:56",73000,73000,"USD",{"$f":"Data!$E1347*VLOOKUP(Data!$F1347,tblXrate[],2,FALSE)","v":49000},"process coordinator","Manager","USA",{"$f":"VLOOKUP(Data!$J1347,tblCountries[[Actual]:[Mapping]],2,FALSE)","v":"USA"},"2 to 3 hours per day",6,"USA"]
[null,"ID1708","2012-06-06T04:00:52",54000,54000,"USD",{"$f":"Data!$E1348*VLOOKUP(Data!$F1348,tblXrate[],2,FALSE)","v":85000},"Energy Analyst","Analyst","USA",{"$f":"VLOOKUP(Data!$J1348,tblCountries[[Actual]:[Mapping]],2,FALSE)","v":"USA"},"All the 8 hours baby, all the 8!",6,"USA"]
[null,"ID1710","2012-06-06T05:52:59",81000,81000,"USD",{"$f":"Data!$E1349*VLOOKUP(Data!$F1349,tblXrate[],2,FALSE)","v":75000},"Contact Operations Analyst","Analyst","USA",{"$f":"VLOOKUP(Data!$J1349,tblCountries[[Actual]:[Mapping]],2,FALSE)","v":"USA"},"4 to 6 hours a day",6,"USA"]
[null,"ID1722","2012-06-06T20:41:35",22000,22000,"USD",{"$f":"Data!$E1359*VLOOKUP(Data!$F1359,tblXrate[],2,FALSE)","v":10684.750012465542},"Manager (MIS)","Manager","India",{"$f":"VLOOKUP(Data!$J1359,tblCountries[[Actual]:[Mapping]],2,FALSE)","v":"India"},"All the 8 hours baby, all the 8!",6,"India"]
[null,"ID1758","2012-06-08T18:48:12",28995,28995,"USD",{"$f":"Data!$E1391*VLOOKUP(Data!$F1391,tblXrate[],2,FALSE)","v":57000},"Senior Executive","Manager","India",{"$f":"VLOOKUP(Data!$J1391,tblCountries[[Actual]:[Mapping]],2,FALSE)","v":"USA"},"4 to 6 hours a day",6,"India"]
[null,"ID1766","2012-06-08T23:46:11",67000,67000,"USD",{"$f":"Data!$E1398*VLOOKUP(Data!$F1398,tblXrate[],2,FALSE)","v":50000},"Manager","Manager","USA",{"$f":"VLOOKUP(Data!$J1398,tblCountries[[Actual]:[Mapping]],2,FALSE)","v":"USA"},"Excel ?!? What Excel?",6,"USA"]
[null,"ID1834","2012-06-13T19:20:25",900000,900000,"INR",{"$f":"Data!$E1455*VLOOKUP(Data!$F1455,tblXrate[],2,FALSE)","v":88000},"Lead ","Manager","India",{"$f":"VLOOKUP(Data!$J1455,tblCountries[[Actual]:[Mapping]],2,FALSE)","v":"USA"},"2 to 3 hours per day",6,"India"]
[null,"ID1837","2012-06-13T20:39:18",425000,425000,"INR",{"$f":"Data!$E1458*VLOOKUP(Data!$F1458,tblXrate[],2,FALSE)","v":35000},"accountant","Accountant","India",{"$f":"VLOOKUP(Data!$J1458,tblCountries[[Actual]:[Mapping]],2,FALSE)","v":"USA"},"2 to 3 hours per day",6,"India"]
[null,"ID1843","2012-06-14T12:27:30",118000,118000,"USD",{"$f":"Data!$E1464*VLOOKUP(Data!$F1464,tblXrate[],2,FALSE)","v":100000},"AVP","CXO or Top Mgmt.","USA",{"$f":"VLOOKUP(Data!$J1464,tblCountries[[Actual]:[Mapping]],2,FALSE)","v":"USA"},"4 to 6 hours a day",6,"USA"]
[null,"ID1871","2012-06-15T23:50:11",67000,67000,"USD",{"$f":"Data!$E1484*VLOOKUP(Data!$F1484,tblXrate[],2,FALSE)","v":29159.298033244755},"Sales Compensation Analyst","Analyst","USA",{"$f":"VLOOKUP(Data!$J1484,tblCountries[[Actual]:[Mapping]],2,FALSE)","v":"UK"},"4 to 6 hours a day",6,"USA"]
[null,"ID1874","2012-06-16T06:17:53",63000,63000,"USD",{"$f":"Data!$E1486*VLOOKUP(Data!$F1486,tblXrate[],2,FALSE)","v":111680},"Marketing Database Analyst","Analyst","USA",{"$f":"VLOOKUP(Data!$J1486,tblCountries[[Actual]:[Mapping]],2,FALSE)","v":"USA"},"4 to 6 hours a day",6,"USA"]
[null,"ID1879","2012-06-16T17:49:27","3.5 lac",350000,"INR",{"$f":"Data!$E1491*VLOOKUP(Data!$F1491,tblXrate[],2,FALSE)","v":60000},"Analyst","Analyst","India",{"$f":"VLOOKUP(Data!$J1491,tblCountries[[Actual]:[Mapping]],2,FALSE)","v":"USA"},"4 to 6 hours a day",6,"India"]
[null,"ID1914","2012-06-20T00:27:54","Rs23000/month",276000,"INR",{"$f":"Data!$E1519*VLOOKUP(Data!$F1519,tblXrate[],2,FALSE)","v":45000},"MIS specialist","Reporting","India",{"$f":"VLOOKUP(Data!$J1519,tblCountries[[Actual]:[Mapping]],2,FALSE)","v":"USA"},"All the 8 hours baby, all the 8!",6,"India"]
[null,"ID1917","2012-06-20T01:43:12",700,8400,"USD",{"$f":"Data!$E1522*VLOOKUP(Data!$F1522,tblXrate[],2,FALSE)","v":72500},"Sr. Executive MIS","Reporting","India",{"$f":"VLOOKUP(Data!$J1522,tblCountries[[Actual]:[Mapping]],2,FALSE)","v":"USA"},"All the 8 hours baby, all the 8!",6,"India"]
[null,"ID0674","2012-05-26T12:55:09",4700,56400,"USD",{"$f":"Data!$E1636*VLOOKUP(Data!$F1636,tblXrate[],2,FALSE)","v":72500},"Finance Manager","Manager","UAE","Other Countries","2 to 3 hours per day",6,"UAE"]
[null,"ID0833","2012-05-26T23:15:18","65000 ron",65000,"RON",{"$f":"Data!$E1664*VLOOKUP(Data!$F1664,tblXrate[],2,FALSE)","v":55000},"HR Planning Specialist","Specialist","Romania","Other Countries","4 to 6 hours a day",6,"Romania"]
[null,"ID0871","2012-05-27T08:07:40","125 $",125000,"USD",{"$f":"Data!$E1673*VLOOKUP(Data!$F1673,tblXrate[],2,FALSE)","v":30000},"Project controls manager","Manager","Norway","Other Countries","4 to 6 hours a day",6,"Norway"]
[null,"ID0877","2012-05-27T11:32:17",26400,26400,"USD",{"$f":"Data!$E1675*VLOOKUP(Data!$F1675,tblXrate[],2,FALSE)","v":34000},"Supply Chain Administrator","Analyst","UAE","Other Countries","All the 8 hours baby, all the 8!",6,"UAE"]
[null,"ID0992","2012-05-28T09:03:56",19000,19000,"USD",{"$f":"Data!$E1708*VLOOKUP(Data!$F1708,tblXrate[],2,FALSE)","v":51000},"Finance analyst","Analyst","China","Other Countries","4 to 6 hours a day",6,"china"]
[null,"ID1019","2012-05-28T12:09:37","usd 20.000",20000,"USD",{"$f":"Data!$E1714*VLOOKUP(Data!$F1714,tblXrate[],2,FALSE)","v":16027.125018698311},"Head of Financial Reporting","Reporting","Paraguay","Other Countries","All the 8 hours baby, all the 8!",6,"Paraguay"]
[null,"ID1051","2012-05-28T14:11:34","55000 usd",55000,"USD",{"$f":"Data!$E1720*VLOOKUP(Data!$F1720,tblXrate[],2,FALSE)","v":125000},"Economist","Reporting","Israel","Other Countries","4 to 6 hours a day",6,"Israel"]
[null,"ID1226","2012-05-29T01:41:00",80000,80000,"USD",{"$f":"Data!$E1759*VLOOKUP(Data!$F1759,tblXrate[],2,FALSE)","v":65000},"Snr Business Analyst","Analyst","Singapore","Other Countries","1 or 2 hours a day",6,"Singapore"]
[null,"ID1389","2012-05-29T21:50:30",39000,39000,"USD",{"$f":"Data!$E1795*VLOOKUP(Data!$F1795,tblXrate[],2,FALSE)","v":78533.043543002947},"I.T Manager","Manager","South Africa","Other Countries","All the 8 hours baby, all the 8!",6,"South Africa"]
[null,"ID1596","2012-06-01T18:58:42",177600,177600,"USD",{"$f":"Data!$E1831*VLOOKUP(Data!$F1831,tblXrate[],2,FALSE)","v":27000},"Accountant","Accountant","Lesotho","Other Countries","4 to 6 hours a day",6,"Lesotho"]
[null,"ID1667","2012-06-04T22:16:00",13000,13000,"USD",{"$f":"Data!$E1844*VLOOKUP(Data!$F1844,tblXrate[],2,FALSE)","v":10956.982885192734},"logistics analyst","Analyst","Slovakia","Other Countries","All the 8 hours baby, all the 8!",6,"Slovakia"]
[null,"ID1684","2012-06-05T10:43:34",110000,110000,"NZD",{"$f":"Data!$E1849*VLOOKUP(Data!$F1849,tblXrate[],2,FALSE)","v":150000},"Enterprise Portfolio Manager","Manager","New Zealand","Other Countries","4 to 6 hours a day",6,"New Zealand"]
[null,"ID1685","2012-06-05T12:42:38","NZD$71000",71000,"NZD",{"$f":"Data!$E1850*VLOOKUP(Data!$F1850,tblXrate[],2,FALSE)","v":11400},"Business Analyst","Analyst","NZ","Other Countries","All the 8 hours baby, all the 8!",6,"New Zealand"]
[null,"ID1691","2012-06-05T19:59:35",33000,33000,"EUR",{"$f":"Data!$E1852*VLOOKUP(Data!$F1852,tblXrate[],2,FALSE)","v":35000},"assistant","Analyst","france","Other Countries","4 to 6 hours a day",6,"France"]
[null,"ID1723","2012-06-06T21:18:51",100000,100000,"USD",{"$f":"Data!$E1858*VLOOKUP(Data!$F1858,tblXrate[],2,FALSE)","v":17598.017290051986},"financial analyst (real estate)","Analyst","Russia","Other Countries","All the 8 hours baby, all the 8!",6,"Russia"]
[null,"ID1764","2012-06-08T22:48:39","CHF140000",140000,"CHF",{"$f":"Data!$E1861*VLOOKUP(Data!$F1861,tblXrate[],2,FALSE)","v":28109.627547434993},"Projektleiter","Manager","Switzerland","Other Countries","2 to 3 hours per day",6,"Switzerland"]
[null,"ID1889","2012-06-17T16:01:50",60000,60000,"EUR",{"$f":"Data!$E1882*VLOOKUP(Data!$F1882,tblXrate[],2,FALSE)","v":72000},"pm","Manager","Germany","Other Countries","4 to 6 hours a day",6,"Germany"]
[null,"ID1347","2012-05-29T18:00:19",6600,6600,"USD",{"$f":"Data!$E1062*VLOOKUP(Data!$F1062,tblXrate[],2,FALSE)","v":45709.169889951241},"MIS HR,HRIS","Reporting","India",{"$f":"VLOOKUP(Data!$J1062,tblCountries[[Actual]:[Mapping]],2,FALSE)","v":"UK"},"2 to 3 hours per day",6.4,"India"]
[null,"ID0850","2012-05-27T01:41:11","Rs. 10,00,000",1000000,"INR",{"$f":"Data!$E703*VLOOKUP(Data!$F703,tblXrate[],2,FALSE)","v":47285.348162018527},"HR Analyst","Analyst","India",{"$f":"VLOOKUP(Data!$J703,tblCountries[[Actual]:[Mapping]],2,FALSE)","v":"UK"},"4 to 6 hours a day",6.5,"India"]
[null,"ID0562","2012-05-26T06:08:23",35000,35000,"USD",{"$f":"Data!$E464*VLOOKUP(Data!$F464,tblXrate[],2,FALSE)","v":6000},"Technical Support Technician","Analyst","USA",{"$f":"VLOOKUP(Data!$J464,tblCountries[[Actual]:[Mapping]],2,FALSE)","v":"India"},"1 or 2 hours a day",7,"USA"]
[null,"ID0592","2012-05-26T08:08:43",120000,120000,"USD",{"$f":"Data!$E491*VLOOKUP(Data!$F491,tblXrate[],2,FALSE)","v":120000},"Sr. Analyst","Analyst","USA",{"$f":"VLOOKUP(Data!$J491,tblCountries[[Actual]:[Mapping]],2,FALSE)","v":"USA"},"All the 8 hours baby, all the 8!",7,"USA"]
[null,"ID0596","2012-05-26T08:43:07",108000,108000,"USD",{"$f":"Data!$E492*VLOOKUP(Data!$F492,tblXrate[],2,FALSE)","v":49000},"Technology consultant ","Consultant","USA",{"$f":"VLOOKUP(Data!$J492,tblCountries[[Actual]:[Mapping]],2,FALSE)","v":"USA"},"2 to 3 hours per day",7,"USA"]
[null,"ID0601","2012-05-26T08:55:17",45000,45000,"USD",{"$f":"Data!$E497*VLOOKUP(Data!$F497,tblXrate[],2,FALSE)","v":26795.030625143831},"Head Accounts","Accountant","USA",{"$f":"VLOOKUP(Data!$J497,tblCountries[[Actual]:[Mapping]],2,FALSE)","v":"UK"},"4 to 6 hours a day",7,"USA"]
[null,"ID0687","2012-05-26T13:17:36","Rs. 144000",144000,"INR",{"$f":"Data!$E572*VLOOKUP(Data!$F572,tblXrate[],2,FALSE)","v":90000},"Team Leader","Manager","India",{"$f":"VLOOKUP(Data!$J572,tblCountries[[Actual]:[Mapping]],2,FALSE)","v":"USA"},"2 to 3 hours per day",7,"India"]
[null,"ID0688","2012-05-26T13:18:03","inr 11.5",1150000,"INR",{"$f":"Data!$E573*VLOOKUP(Data!$F573,tblXrate[],2,FALSE)","v":4285},"manager portfolio monitoring","Manager","India",{"$f":"VLOOKUP(Data!$J573,tblCountries[[Actual]:[Mapping]],2,FALSE)","v":"India"},"2 to 3 hours per day",7,"India"]
[null,"ID0700","2012-05-26T13:42:58",800000,800000,"INR",{"$f":"Data!$E583*VLOOKUP(Data!$F583,tblXrate[],2,FALSE)","v":8000},"Manager","Manager","India",{"$f":"VLOOKUP(Data!$J583,tblCountries[[Actual]:[Mapping]],2,FALSE)","v":"India"},"4 to 6 hours a day",7,"India"]
[null,"ID0701","2012-05-26T13:44:53","25000 rupess",300000,"INR",{"$f":"Data!$E584*VLOOKUP(Data!$F584,tblXrate[],2,FALSE)","v":20514.720023933838},"Analyst","Analyst","India",{"$f":"VLOOKUP(Data!$J584,tblCountries[[Actual]:[Mapping]],2,FALSE)","v":"India"},"All the 8 hours baby, all the 8!",7,"India"]
[null,"ID0719","2012-05-26T14:41:00","Rs 15000",180000,"INR",{"$f":"Data!$E600*VLOOKUP(Data!$F600,tblXrate[],2,FALSE)","v":15190.15293438851},"Import & Export Documentation Executive","Manager","India",{"$f":"VLOOKUP(Data!$J600,tblCountries[[Actual]:[Mapping]],2,FALSE)","v":"India"},"All the 8 hours baby, all the 8!",7,"India"]
[null,"ID0729","2012-05-26T15:05:42",600000,600000,"INR",{"$f":"Data!$E608*VLOOKUP(Data!$F608,tblXrate[],2,FALSE)","v":70000},"Sr Financial Execative","Accountant","India",{"$f":"VLOOKUP(Data!$J608,tblCountries[[Actual]:[Mapping]],2,FALSE)","v":"USA"},"All the 8 hours baby, all the 8!",7,"India"]
[null,"ID0753","2012-05-26T16:33:58",20000,20000,"USD",{"$f":"Data!$E627*VLOOKUP(Data!$F627,tblXrate[],2,FALSE)","v":10000},"engineer","Engineer","India",{"$f":"VLOOKUP(Data!$J627,tblCountries[[Actual]:[Mapping]],2,FALSE)","v":"India"},"1 or 2 hours a day",7,"India"]
[null,"ID0782","2012-05-26T19:07:55",636000,636000,"INR",{"$f":"Data!$E648*VLOOKUP(Data!$F648,tblXrate[],2,FALSE)","v":19000},"Program Manager","Manager","India",{"$f":"VLOOKUP(Data!$J648,tblCountries[[Actual]:[Mapping]],2,FALSE)","v":"china"},"4 to 6 hours a day",7,"India"]
[null,"ID0783","2012-05-26T19:13:39","180000 PKR",180000,"PKR",{"$f":"Data!$E649*VLOOKUP(Data!$F649,tblXrate[],2,FALSE)","v":20000},"S&D Reporting & Analysis Team Leader","Reporting","Pakistan",{"$f":"VLOOKUP(Data!$J649,tblCountries[[Actual]:[Mapping]],2,FALSE)","v":"Paraguay"},"All the 8 hours baby, all the 8!",7,"Pakistan"]
[null,"ID0788","2012-05-26T19:43:36","INR 400000",400000,"INR",{"$f":"Data!$E654*VLOOKUP(Data!$F654,tblXrate[],2,FALSE)","v":13000},"Asst.Manager","Manager","India",{"$f":"VLOOKUP(Data!$J654,tblCountries[[Actual]:[Mapping]],2,FALSE)","v":"Slovakia"},"4 to 6 hours a day",7,"India"]
[null,"ID0799","2012-05-26T21:05:35","Rs. 377000",377000,"INR",{"$f":"Data!$E664*VLOOKUP(Data!$F664,tblXrate[],2,FALSE)","v":120000},"Team Developer","Analyst","India",{"$f":"VLOOKUP(Data!$J664,tblCountries[[Actual]:[Mapping]],2,FALSE)","v":"USA"},"1 or 2 hours a day",7,"India"]
[null,"ID0922","2012-05-27T20:18:50","95000 AUD",95000,"AUD",{"$f":"Data!$E751*VLOOKUP(Data!$F751,tblXrate[],2,FALSE)","v":18000},"Senior Marketing Analyst","Analyst","Australia",{"$f":"VLOOKUP(Data!$J751,tblCountries[[Actual]:[Mapping]],2,FALSE)","v":"India"},"1 or 2 hours a day",7,"Australia"]
[null,"ID0984","2012-05-28T08:03:10","AUD$70,000",70000,"AUD",{"$f":"Data!$E791*VLOOKUP(Data!$F791,tblXrate[],2,FALSE)","v":115061.01386091174},"Business Development","Manager","Australia",{"$f":"VLOOKUP(Data!$J791,tblCountries[[Actual]:[Mapping]],2,FALSE)","v":"UK"},"4 to 6 hours a day",7,"Australia"]
[null,"ID1000","2012-05-28T09:51:24","Rs. 500000",500000,"INR",{"$f":"Data!$E804*VLOOKUP(Data!$F804,tblXrate[],2,FALSE)","v":30000},"Business Analyst","Analyst","India",{"$f":"VLOOKUP(Data!$J804,tblCountries[[Actual]:[Mapping]],2,FALSE)","v":"UAE"},"4 to 6 hours a day",7,"India"]
[null,"ID1007","2012-05-28T10:38:53",700000,700000,"INR",{"$f":"Data!$E809*VLOOKUP(Data!$F809,tblXrate[],2,FALSE)","v":15840},"Asst Manager - Quality","Manager","India",{"$f":"VLOOKUP(Data!$J809,tblCountries[[Actual]:[Mapping]],2,FALSE)","v":"Peru"},"2 to 3 hours per day",7,"India"]
[null,"ID1045","2012-05-28T13:42:12",725,8700,"USD",{"$f":"Data!$E838*VLOOKUP(Data!$F838,tblXrate[],2,FALSE)","v":17067.637625607145},"Project Controlling (MIS Reports)","Controller","India",{"$f":"VLOOKUP(Data!$J838,tblCountries[[Actual]:[Mapping]],2,FALSE)","v":"Philippines"},"2 to 3 hours per day",7,"India"]
[null,"ID1063","2012-05-28T14:40:54","INR 530000 ",530000,"INR",{"$f":"Data!$E850*VLOOKUP(Data!$F850,tblXrate[],2,FALSE)","v":95000},"Project Administrator","Analyst","India",{"$f":"VLOOKUP(Data!$J850,tblCountries[[Actual]:[Mapping]],2,FALSE)","v":"USA"},"2 to 3 hours per day",7,"India"]
[null,"ID1068","2012-05-28T14:50:03",100000,1200000,"INR",{"$f":"Data!$E854*VLOOKUP(Data!$F854,tblXrate[],2,FALSE)","v":35000},"executive","Analyst","India",{"$f":"VLOOKUP(Data!$J854,tblCountries[[Actual]:[Mapping]],2,FALSE)","v":"USA"},"4 to 6 hours a day",7,"India"]
[null,"ID1094","2012-05-28T16:03:18",7960,7960,"USD",{"$f":"Data!$E879*VLOOKUP(Data!$F879,tblXrate[],2,FALSE)","v":10684.750012465542},"Team Leader","Manager","India",{"$f":"VLOOKUP(Data!$J879,tblCountries[[Actual]:[Mapping]],2,FALSE)","v":"India"},"4 to 6 hours a day",7,"India"]
[null,"ID1124","2012-05-28T17:34:16",242304,242304,"INR",{"$f":"Data!$E903*VLOOKUP(Data!$F903,tblXrate[],2,FALSE)","v":49000},"accountant","Accountant","India",{"$f":"VLOOKUP(Data!$J903,tblCountries[[Actual]:[Mapping]],2,FALSE)","v":"USA"},"4 to 6 hours a day",7,"India"]
[null,"ID1193","2012-05-28T23:17:12","US$ 7,200",7200,"USD",{"$f":"Data!$E950*VLOOKUP(Data!$F950,tblXrate[],2,FALSE)","v":3982.448779308334},"Supervisor MIS","Reporting","India",{"$f":"VLOOKUP(Data!$J950,tblCountries[[Actual]:[Mapping]],2,FALSE)","v":"Philippines"},"4 to 6 hours a day",7,"India"]
[null,"ID1250","2012-05-29T05:21:39",55000,55000,"USD",{"$f":"Data!$E993*VLOOKUP(Data!$F993,tblXrate[],2,FALSE)","v":10000},"Systems Analyst","Analyst","USA",{"$f":"VLOOKUP(Data!$J993,tblCountries[[Actual]:[Mapping]],2,FALSE)","v":"India"},"1 or 2 hours a day",7,"USA"]
[null,"ID1264","2012-05-29T08:41:14",110000,110000,"AUD",{"$f":"Data!$E1003*VLOOKUP(Data!$F1003,tblXrate[],2,FALSE)","v":18000},"Analyst","Analyst","Australia",{"$f":"VLOOKUP(Data!$J1003,tblCountries[[Actual]:[Mapping]],2,FALSE)","v":"India"},"2 to 3 hours per day",7,"Australia"]
[null,"ID1276","2012-05-29T10:09:37",45000,45000,"USD",{"$f":"Data!$E1013*VLOOKUP(Data!$F1013,tblXrate[],2,FALSE)","v":10000},"Staff Assistant","Analyst","USA",{"$f":"VLOOKUP(Data!$J1013,tblCountries[[Actual]:[Mapping]],2,FALSE)","v":"India"},"4 to 6 hours a day",7,"USA"]
[null,"ID1304","2012-05-29T13:54:38","Rs 1500000",1500000,"INR",{"$f":"Data!$E1033*VLOOKUP(Data!$F1033,tblXrate[],2,FALSE)","v":35000},"Analyst","Analyst","India",{"$f":"VLOOKUP(Data!$J1033,tblCountries[[Actual]:[Mapping]],2,FALSE)","v":"malaysia"},"4 to 6 hours a day",7,"India"]
[null,"ID1329","2012-05-29T16:18:59","6.6 Lacs",660000,"INR",{"$f":"Data!$E1050*VLOOKUP(Data!$F1050,tblXrate[],2,FALSE)","v":9794.354178093412},"AM business Intelligence","Manager","India",{"$f":"VLOOKUP(Data!$J1050,tblCountries[[Actual]:[Mapping]],2,FALSE)","v":"India"},"All the 8 hours baby, all the 8!",7,"India"]
[null,"ID1341","2012-05-29T17:17:46","Rs.6,00,000",600000,"INR",{"$f":"Data!$E1058*VLOOKUP(Data!$F1058,tblXrate[],2,FALSE)","v":21369.500024931083},"Assistant Manager","Manager","India",{"$f":"VLOOKUP(Data!$J1058,tblCountries[[Actual]:[Mapping]],2,FALSE)","v":"India"},"1 or 2 hours a day",7,"India"]
[null,"ID1359","2012-05-29T19:01:48",75000,75000,"USD",{"$f":"Data!$E1072*VLOOKUP(Data!$F1072,tblXrate[],2,FALSE)","v":155000},"Financial Analyst","Analyst","USA",{"$f":"VLOOKUP(Data!$J1072,tblCountries[[Actual]:[Mapping]],2,FALSE)","v":"USA"},"4 to 6 hours a day",7,"USA"]
[null,"ID1363","2012-05-29T19:11:31","Rs. 4.5 lakhs ",450000,"INR",{"$f":"Data!$E1076*VLOOKUP(Data!$F1076,tblXrate[],2,FALSE)","v":63519.971949580387},"Mechanical Design engineer","Engineer","India",{"$f":"VLOOKUP(Data!$J1076,tblCountries[[Actual]:[Mapping]],2,FALSE)","v":"Portugal"},"1 or 2 hours a day",7,"India"]
[null,"ID1376","2012-05-29T20:53:43",95000,95000,"USD",{"$f":"Data!$E1087*VLOOKUP(Data!$F1087,tblXrate[],2,FALSE)","v":5022},"Cost Analyst","Analyst","USA",{"$f":"VLOOKUP(Data!$J1087,tblCountries[[Actual]:[Mapping]],2,FALSE)","v":"Pakistan"},"2 to 3 hours per day",7,"USA"]
[null,"ID1388","2012-05-29T21:48:13","60000 $",60000,"GBP",{"$f":"Data!$E1098*VLOOKUP(Data!$F1098,tblXrate[],2,FALSE)","v":127488.70705032947},"Analyst","Analyst","UK",{"$f":"VLOOKUP(Data!$J1098,tblCountries[[Actual]:[Mapping]],2,FALSE)","v":"Australia"},"4 to 6 hours a day",7,"UK"]
[null,"ID1396","2012-05-29T22:14:19",77500,77500,"USD",{"$f":"Data!$E1104*VLOOKUP(Data!$F1104,tblXrate[],2,FALSE)","v":67775.665698893223},"Sr Financial Analyst","Analyst","USA",{"$f":"VLOOKUP(Data!$J1104,tblCountries[[Actual]:[Mapping]],2,FALSE)","v":"UK"},"4 to 6 hours a day",7,"USA"]
[null,"ID1425","2012-05-30T01:25:17",50000,50000,"USD",{"$f":"Data!$E1131*VLOOKUP(Data!$F1131,tblXrate[],2,FALSE)","v":63047.130882691366},"Digital Analyst","Analyst","USA",{"$f":"VLOOKUP(Data!$J1131,tblCountries[[Actual]:[Mapping]],2,FALSE)","v":"UK"},"4 to 6 hours a day",7,"USA"]
[null,"ID1450","2012-05-30T12:25:23",480000,480000,"INR",{"$f":"Data!$E1154*VLOOKUP(Data!$F1154,tblXrate[],2,FALSE)","v":228671.89901848941},"Performance Analyst","Analyst","India",{"$f":"VLOOKUP(Data!$J1154,tblCountries[[Actual]:[Mapping]],2,FALSE)","v":"Europe"},"4 to 6 hours a day",7,"India"]
[null,"ID1468","2012-05-30T15:59:01","Rs 10,00,000",1000000,"INR",{"$f":"Data!$E1168*VLOOKUP(Data!$F1168,tblXrate[],2,FALSE)","v":95279.957924370581},"Marketing Specialist","Specialist","India",{"$f":"VLOOKUP(Data!$J1168,tblCountries[[Actual]:[Mapping]],2,FALSE)","v":"Netherlands"},"2 to 3 hours per day",7,"India"]
[null,"ID1475","2012-05-30T17:04:53","$AUD 125,000 +",125000,"AUD",{"$f":"Data!$E1173*VLOOKUP(Data!$F1173,tblXrate[],2,FALSE)","v":20326.391023865726},"Financial Application Developer","Accountant","Australia",{"$f":"VLOOKUP(Data!$J1173,tblCountries[[Actual]:[Mapping]],2,FALSE)","v":"Greece"},"4 to 6 hours a day",7,"Australia"]
[null,"ID1550","2012-05-31T19:51:29","Â£30000",30000,"GBP",{"$f":"Data!$E1229*VLOOKUP(Data!$F1229,tblXrate[],2,FALSE)","v":80000},"Cost Analyst","Analyst","UK",{"$f":"VLOOKUP(Data!$J1229,tblCountries[[Actual]:[Mapping]],2,FALSE)","v":"USA"},"4 to 6 hours a day",7,"UK"]
[null,"ID1555","2012-05-31T21:45:03","60000 EUR",60000,"EUR",{"$f":"Data!$E1234*VLOOKUP(Data!$F1234,tblXrate[],2,FALSE)","v":101990.96564026357},"Business Engineer","Engineer","Netherlands",{"$f":"VLOOKUP(Data!$J1234,tblCountries[[Actual]:[Mapping]],2,FALSE)","v":"Australia"},"4 to 6 hours a day",7,"Netherlands"]
[null,"ID1582","2012-06-01T06:31:49",80000,80000,"CAD",{"$f":"Data!$E1252*VLOOKUP(Data!$F1252,tblXrate[],2,FALSE)","v":75770.868892469181},"Business Operations Analyst","Analyst","Canada",{"$f":"VLOOKUP(Data!$J1252,tblCountries[[Actual]:[Mapping]],2,FALSE)","v":"New Zealand"},"4 to 6 hours a day",7,"Canada"]
[null,"ID1748","2012-06-08T04:51:45",80000,80000,"USD",{"$f":"Data!$E1382*VLOOKUP(Data!$F1382,tblXrate[],2,FALSE)","v":38000},"Sales / Finance Manager","Manager","USA",{"$f":"VLOOKUP(Data!$J1382,tblCountries[[Actual]:[Mapping]],2,FALSE)","v":"USA"},"4 to 6 hours a day",7,"USA"]
[null,"ID1780","2012-06-10T15:20:01",1000,12000,"USD",{"$f":"Data!$E1409*VLOOKUP(Data!$F1409,tblXrate[],2,FALSE)","v":2564.3400029917298},"project engineer ","Engineer","India",{"$f":"VLOOKUP(Data!$J1409,tblCountries[[Actual]:[Mapping]],2,FALSE)","v":"India"},"2 to 3 hours per day",7,"India"]
[null,"ID1784","2012-06-10T21:52:30","Â£31185",31185,"GBP",{"$f":"Data!$E1411*VLOOKUP(Data!$F1411,tblXrate[],2,FALSE)","v":95000},"Data Team Leader","Manager","UK",{"$f":"VLOOKUP(Data!$J1411,tblCountries[[Actual]:[Mapping]],2,FALSE)","v":"USA"},"4 to 6 hours a day",7,"UK"]
[null,"ID1835","2012-06-13T19:33:58","36000 British pounds",36000,"GBP",{"$f":"Data!$E1456*VLOOKUP(Data!$F1456,tblXrate[],2,FALSE)","v":80000},"Senior officer data reporting","Manager","UK",{"$f":"VLOOKUP(Data!$J1456,tblCountries[[Actual]:[Mapping]],2,FALSE)","v":"USA"},"All the 8 hours baby, all the 8!",7,"UK"]
[null,"ID1836","2012-06-13T19:40:16",1200000,1200000,"INR",{"$f":"Data!$E1457*VLOOKUP(Data!$F1457,tblXrate[],2,FALSE)","v":69000},"AM","Manager","India",{"$f":"VLOOKUP(Data!$J1457,tblCountries[[Actual]:[Mapping]],2,FALSE)","v":"USA"},"4 to 6 hours a day",7,"India"]
[null,"ID1854","2012-06-15T03:51:50","Â£33500",33500,"GBP",{"$f":"Data!$E1471*VLOOKUP(Data!$F1471,tblXrate[],2,FALSE)","v":23150.291693675339},"Senior Manufacturing Engineer","Engineer","UK",{"$f":"VLOOKUP(Data!$J1471,tblCountries[[Actual]:[Mapping]],2,FALSE)","v":"India"},"2 to 3 hours per day",7,"UK"]
[null,"ID0743","2012-05-26T15:59:44","66000 â‚¬",66000,"EUR",{"$f":"Data!$E1647*VLOOKUP(Data!$F1647,tblXrate[],2,FALSE)","v":130000},"Logistics Analyst","Analyst","germany","Other Countries","4 to 6 hours a day",7,"Germany"]
[null,"ID0752","2012-05-26T16:29:36",36000,36000,"USD",{"$f":"Data!$E1648*VLOOKUP(Data!$F1648,tblXrate[],2,FALSE)","v":18000},"ENGINEER","Engineer","uae","Other Countries","1 or 2 hours a day",7,"UAE"]
[null,"ID0780","2012-05-26T18:44:00","Dhs 2800 + Accomodation",33600,"AED",{"$f":"Data!$E1656*VLOOKUP(Data!$F1656,tblXrate[],2,FALSE)","v":95000},"Accountant","Accountant","Dubai","Other Countries","1 or 2 hours a day",7,"Dubai"]
[null,"ID0827","2012-05-26T23:03:21","US$30,000",30000,"USD",{"$f":"Data!$E1663*VLOOKUP(Data!$F1663,tblXrate[],2,FALSE)","v":44000},"Financial Control Section Headm","Controller","Inonesia","Other Countries","4 to 6 hours a day",7,"Indonesia"]
[null,"ID1064","2012-05-28T14:43:40","1500 $",18000,"USD",{"$f":"Data!$E1726*VLOOKUP(Data!$F1726,tblXrate[],2,FALSE)","v":85552.452503638444},"Analyst","Analyst","Poland","Other Countries","4 to 6 hours a day",7,"Poland"]
[null,"ID1119","2012-05-28T17:12:47",18987,18987,"USD",{"$f":"Data!$E1731*VLOOKUP(Data!$F1731,tblXrate[],2,FALSE)","v":44921.080753917595},"Business Analyst","Analyst","Nigeria","Other Countries","All the 8 hours baby, all the 8!",7,"Nigeria"]
[null,"ID1171","2012-05-28T22:41:01","R$ 54000",54000,"BRL",{"$f":"Data!$E1746*VLOOKUP(Data!$F1746,tblXrate[],2,FALSE)","v":44391.484854502989},"Logistics Coordinator","Manager","Brazil","Other Countries","1 or 2 hours a day",7,"Brazil"]
[null,"ID1295","2012-05-29T13:13:56",12500,12500,"USD",{"$f":"Data!$E1775*VLOOKUP(Data!$F1775,tblXrate[],2,FALSE)","v":57530.506930455871},"Specialist","Specialist","Philippines","Other Countries","2 to 3 hours per day",7,"Philippines"]
[null,"ID1322","2012-05-29T15:38:40","43000 EUR",43000,"EUR",{"$f":"Data!$E1781*VLOOKUP(Data!$F1781,tblXrate[],2,FALSE)","v":115061.01386091174},"Project manager of IT infrastructure","Manager","France","Other Countries","All the 8 hours baby, all the 8!",7,"France"]
[null,"ID1473","2012-05-30T16:55:51",118000,118000,"EUR",{"$f":"Data!$E1805*VLOOKUP(Data!$F1805,tblXrate[],2,FALSE)","v":107000},"Support","Analyst","EU","Other Countries","4 to 6 hours a day",7,"Europe"]
[null,"ID1495","2012-05-30T21:07:54",42000,42000,"EUR",{"$f":"Data!$E1811*VLOOKUP(Data!$F1811,tblXrate[],2,FALSE)","v":30489.586535798586},"Business Intelligence Consultant","Consultant","Germany","Other Countries","All the 8 hours baby, all the 8!",7,"Germany"]
[null,"ID1633","2012-06-03T01:36:43","24 K mauritian Rupees",288000,"MUR",{"$f":"Data!$E1836*VLOOKUP(Data!$F1836,tblXrate[],2,FALSE)","v":27600},"IT Support Engineer","Engineer","Mauritius","Other Countries","4 to 6 hours a day",7,"Mauritius"]
[null,"ID1637","2012-06-03T04:42:54",106000,106000,"USD",{"$f":"Data!$E1838*VLOOKUP(Data!$F1838,tblXrate[],2,FALSE)","v":9956.1219482708348},"IT Developer","Analyst","Denmark","Other Countries","1 or 2 hours a day",7,"Denmark"]
[null,"ID0672","2012-05-26T12:54:15",8738,8738,"USD",{"$f":"Data!$E560*VLOOKUP(Data!$F560,tblXrate[],2,FALSE)","v":36000},"Sales Coordinator","Manager","India",{"$f":"VLOOKUP(Data!$J560,tblCountries[[Actual]:[Mapping]],2,FALSE)","v":"Azerbaijan"},"All the 8 hours baby, all the 8!",7.3,"India"]
[null,"ID1195","2012-05-28T23:19:36","Rs 5,40,000",540000,"INR",{"$f":"Data!$E952*VLOOKUP(Data!$F952,tblXrate[],2,FALSE)","v":59819.107020370408},"Business Analyst - Solutions","Analyst","India",{"$f":"VLOOKUP(Data!$J952,tblCountries[[Actual]:[Mapping]],2,FALSE)","v":"New Zealand"},"4 to 6 hours a day",7.9,"India"]
[null,"ID0578","2012-05-26T07:15:48","$22,000 AUD",22000,"AUD",{"$f":"Data!$E477*VLOOKUP(Data!$F477,tblXrate[],2,FALSE)","v":3561.5833374885137},"Sales Analyst","Analyst","Australia",{"$f":"VLOOKUP(Data!$J477,tblCountries[[Actual]:[Mapping]],2,FALSE)","v":"India"},"4 to 6 hours a day",8,"Australia"]
[null,"ID0590","2012-05-26T08:05:23",40414,40414,"USD",{"$f":"Data!$E489*VLOOKUP(Data!$F489,tblXrate[],2,FALSE)","v":8903.9583437212841},"Performance Improvement Analyst","Analyst","USA",{"$f":"VLOOKUP(Data!$J489,tblCountries[[Actual]:[Mapping]],2,FALSE)","v":"India"},"4 to 6 hours a day",8,"USA"]
[null,"ID0612","2012-05-26T10:20:35",30000,30000,"USD",{"$f":"Data!$E506*VLOOKUP(Data!$F506,tblXrate[],2,FALSE)","v":15136.729184326183},"Sales Assistant","Analyst","USA",{"$f":"VLOOKUP(Data!$J506,tblCountries[[Actual]:[Mapping]],2,FALSE)","v":"India"},"2 to 3 hours per day",8,"USA"]
[null,"ID0637","2012-05-26T11:37:26",80000,80000,"USD",{"$f":"Data!$E529*VLOOKUP(Data!$F529,tblXrate[],2,FALSE)","v":6720},"program coordinator - automotive","Manager","USA",{"$f":"VLOOKUP(Data!$J529,tblCountries[[Actual]:[Mapping]],2,FALSE)","v":"India"},"4 to 6 hours a day",8,"USA"]
[null,"ID0653","2012-05-26T12:19:53",4000,4000,"USD",{"$f":"Data!$E544*VLOOKUP(Data!$F544,tblXrate[],2,FALSE)","v":60000},"Coordinator","Manager","India",{"$f":"VLOOKUP(Data!$J544,tblCountries[[Actual]:[Mapping]],2,FALSE)","v":"Singapore"},"All the 8 hours baby, all the 8!",8,"India"]
[null,"ID0666","2012-05-26T12:36:53","Rs 480000",480000,"INR",{"$f":"Data!$E556*VLOOKUP(Data!$F556,tblXrate[],2,FALSE)","v":15000},"PMO","Manager","India",{"$f":"VLOOKUP(Data!$J556,tblCountries[[Actual]:[Mapping]],2,FALSE)","v":"Romania"},"2 to 3 hours per day",8,"India"]
[null,"ID0667","2012-05-26T12:46:26",5800,5800,"USD",{"$f":"Data!$E557*VLOOKUP(Data!$F557,tblXrate[],2,FALSE)","v":45000},"Asst. Manager(Commercial)","Manager","India",{"$f":"VLOOKUP(Data!$J557,tblCountries[[Actual]:[Mapping]],2,FALSE)","v":"Germany"},"All the 8 hours baby, all the 8!",8,"India"]
[null,"ID0710","2012-05-26T14:11:52","Re. 4.5 Lacs Per Annum",450000,"INR",{"$f":"Data!$E593*VLOOKUP(Data!$F593,tblXrate[],2,FALSE)","v":93831.688389042494},"Data Analyst","Analyst","India",{"$f":"VLOOKUP(Data!$J593,tblCountries[[Actual]:[Mapping]],2,FALSE)","v":"Australia"},"All the 8 hours baby, all the 8!",8,"India"]
[null,"ID0736","2012-05-26T15:30:23","6 Lac Rs",600000,"INR",{"$f":"Data!$E614*VLOOKUP(Data!$F614,tblXrate[],2,FALSE)","v":73500},"ERP Co-Ordinator","Manager","India",{"$f":"VLOOKUP(Data!$J614,tblCountries[[Actual]:[Mapping]],2,FALSE)","v":"USA"},"2 to 3 hours per day",8,"India"]
[null,"ID0754","2012-05-26T16:34:18","INR240000",240000,"INR",{"$f":"Data!$E628*VLOOKUP(Data!$F628,tblXrate[],2,FALSE)","v":85672.4111378214},"SR. ACCOUNTS EXECUTIVE","Accountant","India",{"$f":"VLOOKUP(Data!$J628,tblCountries[[Actual]:[Mapping]],2,FALSE)","v":"Australia"},"4 to 6 hours a day",8,"India"]
[null,"ID0755","2012-05-26T16:34:57","Â£ 24000",24000,"GBP",{"$f":"Data!$E629*VLOOKUP(Data!$F629,tblXrate[],2,FALSE)","v":48500},"Business Support Specialist","Specialist","UK",{"$f":"VLOOKUP(Data!$J629,tblCountries[[Actual]:[Mapping]],2,FALSE)","v":"USA"},"All the 8 hours baby, all the 8!",8,"UK"]
[null,"ID0795","2012-05-26T20:50:07",96000,96000,"USD",{"$f":"Data!$E661*VLOOKUP(Data!$F661,tblXrate[],2,FALSE)","v":6600},"MIS Executive","Reporting","India",{"$f":"VLOOKUP(Data!$J661,tblCountries[[Actual]:[Mapping]],2,FALSE)","v":"India"},"All the 8 hours baby, all the 8!",8,"India"]
[null,"ID0861","2012-05-27T04:00:14","Rs. 45000",540000,"INR",{"$f":"Data!$E713*VLOOKUP(Data!$F713,tblXrate[],2,FALSE)","v":36000},"Senior analyst","Analyst","India",{"$f":"VLOOKUP(Data!$J713,tblCountries[[Actual]:[Mapping]],2,FALSE)","v":"UAE"},"All the 8 hours baby, all the 8!",8,"India"]
[null,"ID0866","2012-05-27T04:40:33",65000,65000,"USD",{"$f":"Data!$E714*VLOOKUP(Data!$F714,tblXrate[],2,FALSE)","v":9146.5655463031271},"Security Access Governance Analyst","Analyst","USA",{"$f":"VLOOKUP(Data!$J714,tblCountries[[Actual]:[Mapping]],2,FALSE)","v":"Dubai"},"1 or 2 hours a day",8,"USA"]
[null,"ID0875","2012-05-27T09:49:30",5000,60000,"USD",{"$f":"Data!$E720*VLOOKUP(Data!$F720,tblXrate[],2,FALSE)","v":54627.175876639136},"Store keeper","Analyst","USA",{"$f":"VLOOKUP(Data!$J720,tblCountries[[Actual]:[Mapping]],2,FALSE)","v":"France"},"2 to 3 hours per day",8,"USA"]
[null,"ID0894","2012-05-27T14:04:31","Rs. 400000",400000,"INR",{"$f":"Data!$E731*VLOOKUP(Data!$F731,tblXrate[],2,FALSE)","v":4000},"Accountancy","Accountant","India",{"$f":"VLOOKUP(Data!$J731,tblCountries[[Actual]:[Mapping]],2,FALSE)","v":"India"},"2 to 3 hours per day",8,"India"]
[null,"ID0895","2012-05-27T14:22:11","INR 23 L",2300000,"INR",{"$f":"Data!$E732*VLOOKUP(Data!$F732,tblXrate[],2,FALSE)","v":8547.8000099724322},"Manager - Business Planning & Reporting","Manager","India",{"$f":"VLOOKUP(Data!$J732,tblCountries[[Actual]:[Mapping]],2,FALSE)","v":"India"},"2 to 3 hours per day",8,"India"]
[null,"ID0924","2012-05-27T20:51:55",180000,180000,"INR",{"$f":"Data!$E753*VLOOKUP(Data!$F753,tblXrate[],2,FALSE)","v":3561.5833374885137},"MIS TEAM MEMBER","Reporting","India",{"$f":"VLOOKUP(Data!$J753,tblCountries[[Actual]:[Mapping]],2,FALSE)","v":"India"},"All the 8 hours baby, all the 8!",8,"India"]
[null,"ID0925","2012-05-27T21:04:07",600000,600000,"INR",{"$f":"Data!$E754*VLOOKUP(Data!$F754,tblXrate[],2,FALSE)","v":40980.635073749385},"Sales Analyst","Analyst","India",{"$f":"VLOOKUP(Data!$J754,tblCountries[[Actual]:[Mapping]],2,FALSE)","v":"UK"},"All the 8 hours baby, all the 8!",8,"India"]
[null,"ID0936","2012-05-27T23:03:21",1000000,1000000,"INR",{"$f":"Data!$E760*VLOOKUP(Data!$F760,tblXrate[],2,FALSE)","v":70928.022243027779},"business","Manager","India",{"$f":"VLOOKUP(Data!$J760,tblCountries[[Actual]:[Mapping]],2,FALSE)","v":"UK"},"All the 8 hours baby, all the 8!",8,"India"]
[null,"ID0983","2012-05-28T07:59:49",110000,110000,"AUD",{"$f":"Data!$E790*VLOOKUP(Data!$F790,tblXrate[],2,FALSE)","v":25000},"Sustainability Strategy Advisor","Manager","Australia",{"$f":"VLOOKUP(Data!$J790,tblCountries[[Actual]:[Mapping]],2,FALSE)","v":"India"},"2 to 3 hours per day",8,"Australia"]
[null,"ID0985","2012-05-28T08:22:44","USD 85000.00",85000,"USD",{"$f":"Data!$E792*VLOOKUP(Data!$F792,tblXrate[],2,FALSE)","v":13603.016099449767},"Reporting and DB Analyist","Reporting","Australia",{"$f":"VLOOKUP(Data!$J792,tblCountries[[Actual]:[Mapping]],2,FALSE)","v":"Pakistan"},"4 to 6 hours a day",8,"Australia"]
[null,"ID1004","2012-05-28T10:27:45","Rs.10,00,000",1000000,"INR",{"$f":"Data!$E806*VLOOKUP(Data!$F806,tblXrate[],2,FALSE)","v":42558.381206218859},"Credit Manager - Loans","Manager","India",{"$f":"VLOOKUP(Data!$J806,tblCountries[[Actual]:[Mapping]],2,FALSE)","v":"Germany"},"All the 8 hours baby, all the 8!",8,"India"]
[null,"ID1009","2012-05-28T10:42:08",170000,170000,"AUD",{"$f":"Data!$E811*VLOOKUP(Data!$F811,tblXrate[],2,FALSE)","v":11000},"Business Consultant","Consultant","Australia",{"$f":"VLOOKUP(Data!$J811,tblCountries[[Actual]:[Mapping]],2,FALSE)","v":"Tunisia"},"2 to 3 hours per day",8,"Australia"]
[null,"ID1011","2012-05-28T11:31:20",18000,18000,"USD",{"$f":"Data!$E813*VLOOKUP(Data!$F813,tblXrate[],2,FALSE)","v":35571.184291765021},"Data Specialist","Specialist","India",{"$f":"VLOOKUP(Data!$J813,tblCountries[[Actual]:[Mapping]],2,FALSE)","v":"Spain"},"All the 8 hours baby, all the 8!",8,"India"]
[null,"ID1044","2012-05-28T13:41:33",476000,476000,"INR",{"$f":"Data!$E837*VLOOKUP(Data!$F837,tblXrate[],2,FALSE)","v":12465.541681209797},"Report Specialist","Reporting","India",{"$f":"VLOOKUP(Data!$J837,tblCountries[[Actual]:[Mapping]],2,FALSE)","v":"India"},"4 to 6 hours a day",8,"India"]
[null,"ID1046","2012-05-28T13:42:35","2,00,000 INR",200000,"INR",{"$f":"Data!$E839*VLOOKUP(Data!$F839,tblXrate[],2,FALSE)","v":36000},"Monitoring & evaluation officer","Manager","India",{"$f":"VLOOKUP(Data!$J839,tblCountries[[Actual]:[Mapping]],2,FALSE)","v":"Czech Republic"},"All the 8 hours baby, all the 8!",8,"India"]
[null,"ID1055","2012-05-28T14:18:40",26000,26000,"GBP",{"$f":"Data!$E845*VLOOKUP(Data!$F845,tblXrate[],2,FALSE)","v":50000},"Consultant","Consultant","UK",{"$f":"VLOOKUP(Data!$J845,tblCountries[[Actual]:[Mapping]],2,FALSE)","v":"USA"},"All the 8 hours baby, all the 8!",8,"UK"]
[null,"ID1058","2012-05-28T14:23:57",1000,12000,"USD",{"$f":"Data!$E847*VLOOKUP(Data!$F847,tblXrate[],2,FALSE)","v":50000},"consultant","Consultant","India",{"$f":"VLOOKUP(Data!$J847,tblCountries[[Actual]:[Mapping]],2,FALSE)","v":"India"},"2 to 3 hours per day",8,"India"]
[null,"ID1067","2012-05-28T14:46:42",5100,5100,"USD",{"$f":"Data!$E853*VLOOKUP(Data!$F853,tblXrate[],2,FALSE)","v":37000},"MIS Executive","Reporting","India",{"$f":"VLOOKUP(Data!$J853,tblCountries[[Actual]:[Mapping]],2,FALSE)","v":"India"},"All the 8 hours baby, all the 8!",8,"India"]
[null,"ID1084","2012-05-28T15:37:23",1200000,1200000,"INR",{"$f":"Data!$E869*VLOOKUP(Data!$F869,tblXrate[],2,FALSE)","v":78808.913603364199},"finance controller","Controller","India",{"$f":"VLOOKUP(Data!$J869,tblCountries[[Actual]:[Mapping]],2,FALSE)","v":"UK"},"4 to 6 hours a day",8,"India"]
[null,"ID1102","2012-05-28T16:20:52",58000,58000,"GBP",{"$f":"Data!$E886*VLOOKUP(Data!$F886,tblXrate[],2,FALSE)","v":1783.166904422254},"Data analyst","Analyst","UK",{"$f":"VLOOKUP(Data!$J886,tblCountries[[Actual]:[Mapping]],2,FALSE)","v":"Pakistan"},"All the 8 hours baby, all the 8!",8,"UK"]
[null,"ID1113","2012-05-28T16:58:03","Rs. 600000",600000,"INR",{"$f":"Data!$E894*VLOOKUP(Data!$F894,tblXrate[],2,FALSE)","v":82000},"Company Secretary","Accountant","India",{"$f":"VLOOKUP(Data!$J894,tblCountries[[Actual]:[Mapping]],2,FALSE)","v":"USA"},"2 to 3 hours per day",8,"India"]
[null,"ID1117","2012-05-28T17:05:07","Â£45000",45000,"GBP",{"$f":"Data!$E897*VLOOKUP(Data!$F897,tblXrate[],2,FALSE)","v":69353.856635379227},"Assistant Director - Performance Information","CXO or Top Mgmt.","UK",{"$f":"VLOOKUP(Data!$J897,tblCountries[[Actual]:[Mapping]],2,FALSE)","v":"Australia"},"4 to 6 hours a day",8,"UK"]
[null,"ID1128","2012-05-28T17:42:51",19000,19000,"USD",{"$f":"Data!$E905*VLOOKUP(Data!$F905,tblXrate[],2,FALSE)","v":77000},"MI Specialist","Reporting","UK",{"$f":"VLOOKUP(Data!$J905,tblCountries[[Actual]:[Mapping]],2,FALSE)","v":"USA"},"All the 8 hours baby, all the 8!",8,"UK"]
[null,"ID1190","2012-05-28T23:06:22","Rupees : 2,000,000",2000000,"PKR",{"$f":"Data!$E948*VLOOKUP(Data!$F948,tblXrate[],2,FALSE)","v":35000},"Excel Corporate Trainer","Consultant","Pakistan",{"$f":"VLOOKUP(Data!$J948,tblCountries[[Actual]:[Mapping]],2,FALSE)","v":"Uruguay"},"All the 8 hours baby, all the 8!",8,"Pakistan"]
[null,"ID1233","2012-05-29T02:19:27","Â£29000",29000,"GBP",{"$f":"Data!$E982*VLOOKUP(Data!$F982,tblXrate[],2,FALSE)","v":38000},"Financial Accountant","Accountant","UK",{"$f":"VLOOKUP(Data!$J982,tblCountries[[Actual]:[Mapping]],2,FALSE)","v":"USA"},"2 to 3 hours per day",8,"UK"]
[null,"ID1239","2012-05-29T03:51:09",30,30000,"EUR",{"$f":"Data!$E986*VLOOKUP(Data!$F986,tblXrate[],2,FALSE)","v":28310.79811950968},"education advisor","Consultant","the Netherlands",{"$f":"VLOOKUP(Data!$J986,tblCountries[[Actual]:[Mapping]],2,FALSE)","v":"UAE"},"1 or 2 hours a day",8,"Netherlands"]
[null,"ID1275","2012-05-29T10:08:21",70000,70000,"USD",{"$f":"Data!$E1012*VLOOKUP(Data!$F1012,tblXrate[],2,FALSE)","v":126094.26176538273},"Project Manager","Manager","USA",{"$f":"VLOOKUP(Data!$J1012,tblCountries[[Actual]:[Mapping]],2,FALSE)","v":"UK"},"4 to 6 hours a day",8,"USA"]
[null,"ID1285","2012-05-29T11:46:47","INR 900000",900000,"INR",{"$f":"Data!$E1019*VLOOKUP(Data!$F1019,tblXrate[],2,FALSE)","v":85000},"RENTAL INVENTORY CONTROLLER","Controller","India",{"$f":"VLOOKUP(Data!$J1019,tblCountries[[Actual]:[Mapping]],2,FALSE)","v":"USA"},"All the 8 hours baby, all the 8!",8,"India"]
[null,"ID1302","2012-05-29T13:52:13",45000,45000,"USD",{"$f":"Data!$E1031*VLOOKUP(Data!$F1031,tblXrate[],2,FALSE)","v":100000},"Financial Analysis","Analyst","Pakistan",{"$f":"VLOOKUP(Data!$J1031,tblCountries[[Actual]:[Mapping]],2,FALSE)","v":"Norway"},"All the 8 hours baby, all the 8!",8,"Pakistan"]
[null,"ID1312","2012-05-29T14:59:11","â‚¬ 48500",48500,"EUR",{"$f":"Data!$E1039*VLOOKUP(Data!$F1039,tblXrate[],2,FALSE)","v":3000},"Information analyst","Analyst","Netherlands",{"$f":"VLOOKUP(Data!$J1039,tblCountries[[Actual]:[Mapping]],2,FALSE)","v":"Bangladesh"},"4 to 6 hours a day",8,"Netherlands"]
[null,"ID1360","2012-05-29T19:06:14","2.5 per lacks",250000,"INR",{"$f":"Data!$E1073*VLOOKUP(Data!$F1073,tblXrate[],2,FALSE)","v":65000},"Credit Executive","Analyst","India",{"$f":"VLOOKUP(Data!$J1073,tblCountries[[Actual]:[Mapping]],2,FALSE)","v":"USA"},"All the 8 hours baby, all the 8!",8,"India"]
[null,"ID1380","2012-05-29T21:27:23",36000,36000,"USD",{"$f":"Data!$E1091*VLOOKUP(Data!$F1091,tblXrate[],2,FALSE)","v":85000},"Data Specialist","Specialist","USA",{"$f":"VLOOKUP(Data!$J1091,tblCountries[[Actual]:[Mapping]],2,FALSE)","v":"USA"},"All the 8 hours baby, all the 8!",8,"USA"]
[null,"ID1403","2012-05-29T22:50:20",80000,80000,"USD",{"$f":"Data!$E1111*VLOOKUP(Data!$F1111,tblXrate[],2,FALSE)","v":110332.47904470989},"Sr Process Consultant","Consultant","USA",{"$f":"VLOOKUP(Data!$J1111,tblCountries[[Actual]:[Mapping]],2,FALSE)","v":"UK"},"2 to 3 hours per day",8,"USA"]
[null,"ID1405","2012-05-29T23:06:00",40000,40000,"USD",{"$f":"Data!$E1113*VLOOKUP(Data!$F1113,tblXrate[],2,FALSE)","v":105000},"Transportation Planner","Manager","USA",{"$f":"VLOOKUP(Data!$J1113,tblCountries[[Actual]:[Mapping]],2,FALSE)","v":"USA"},"1 or 2 hours a day",8,"USA"]
[null,"ID1437","2012-05-30T02:39:50",25000,25000,"USD",{"$f":"Data!$E1143*VLOOKUP(Data!$F1143,tblXrate[],2,FALSE)","v":12000},"Accountant","Accountant","India",{"$f":"VLOOKUP(Data!$J1143,tblCountries[[Actual]:[Mapping]],2,FALSE)","v":"Spain"},"2 to 3 hours per day",8,"India"]
[null,"ID1491","2012-05-30T20:42:27",10000,10000,"GBP",{"$f":"Data!$E1186*VLOOKUP(Data!$F1186,tblXrate[],2,FALSE)","v":10684.750012465542},"Analyst","Analyst","UK",{"$f":"VLOOKUP(Data!$J1186,tblCountries[[Actual]:[Mapping]],2,FALSE)","v":"India"},"2 to 3 hours per day",8,"UK"]
[null,"ID1503","2012-05-30T22:59:44","278000 PA",278000,"INR",{"$f":"Data!$E1193*VLOOKUP(Data!$F1193,tblXrate[],2,FALSE)","v":54000},"MIS Executive","Reporting","India",{"$f":"VLOOKUP(Data!$J1193,tblCountries[[Actual]:[Mapping]],2,FALSE)","v":"USA"},"All the 8 hours baby, all the 8!",8,"India"]
[null,"ID1527","2012-05-31T06:23:55",45000,45000,"USD",{"$f":"Data!$E1212*VLOOKUP(Data!$F1212,tblXrate[],2,FALSE)","v":157617.8272067284},"Business Analyst","Analyst","USA",{"$f":"VLOOKUP(Data!$J1212,tblCountries[[Actual]:[Mapping]],2,FALSE)","v":"UK"},"4 to 6 hours a day",8,"USA"]
[null,"ID1532","2012-05-31T10:29:42",500000,500000,"INR",{"$f":"Data!$E1217*VLOOKUP(Data!$F1217,tblXrate[],2,FALSE)","v":63047.130882691366},"Developer","Analyst","India",{"$f":"VLOOKUP(Data!$J1217,tblCountries[[Actual]:[Mapping]],2,FALSE)","v":"UK"},"4 to 6 hours a day",8,"India"]
[null,"ID1544","2012-05-31T16:30:09",48360,48360,"GBP",{"$f":"Data!$E1225*VLOOKUP(Data!$F1225,tblXrate[],2,FALSE)","v":13500},"pricing manager","Manager","UK",{"$f":"VLOOKUP(Data!$J1225,tblCountries[[Actual]:[Mapping]],2,FALSE)","v":"India"},"All the 8 hours baby, all the 8!",8,"UK"]
[null,"ID1558","2012-05-31T22:05:03",125000,125000,"USD",{"$f":"Data!$E1235*VLOOKUP(Data!$F1235,tblXrate[],2,FALSE)","v":35500},"Consultant","Consultant","USA",{"$f":"VLOOKUP(Data!$J1235,tblCountries[[Actual]:[Mapping]],2,FALSE)","v":"USA"},"All the 8 hours baby, all the 8!",8,"USA"]
[null,"ID1566","2012-06-01T00:18:35","$40,000 USD",40000,"USD",{"$f":"Data!$E1242*VLOOKUP(Data!$F1242,tblXrate[],2,FALSE)","v":33250},"QA Data Analyst","Analyst","USA",{"$f":"VLOOKUP(Data!$J1242,tblCountries[[Actual]:[Mapping]],2,FALSE)","v":"USA"},"4 to 6 hours a day",8,"USA"]
[null,"ID1570","2012-06-01T01:47:43",15000,15000,"USD",{"$f":"Data!$E1245*VLOOKUP(Data!$F1245,tblXrate[],2,FALSE)","v":15600},"Application Developer","Analyst","USA",{"$f":"VLOOKUP(Data!$J1245,tblCountries[[Actual]:[Mapping]],2,FALSE)","v":"Brazil"},"All the 8 hours baby, all the 8!",8,"USA"]
[null,"ID1588","2012-06-01T10:57:59","30000 Rs",360000,"INR",{"$f":"Data!$E1258*VLOOKUP(Data!$F1258,tblXrate[],2,FALSE)","v":60000},"team leader ","Manager","India",{"$f":"VLOOKUP(Data!$J1258,tblCountries[[Actual]:[Mapping]],2,FALSE)","v":"CEE"},"2 to 3 hours per day",8,"India"]
[null,"ID1620","2012-06-02T07:42:02",85000,85000,"USD",{"$f":"Data!$E1285*VLOOKUP(Data!$F1285,tblXrate[],2,FALSE)","v":135000},"Senior Accountant","Accountant","USA",{"$f":"VLOOKUP(Data!$J1285,tblCountries[[Actual]:[Mapping]],2,FALSE)","v":"USA"},"2 to 3 hours per day",8,"USA"]
[null,"ID1624","2012-06-02T17:34:20","50000USD",50000,"USD",{"$f":"Data!$E1287*VLOOKUP(Data!$F1287,tblXrate[],2,FALSE)","v":81592.772512210868},"Associate Vice President","CXO or Top Mgmt.","India",{"$f":"VLOOKUP(Data!$J1287,tblCountries[[Actual]:[Mapping]],2,FALSE)","v":"Australia"},"1 or 2 hours a day",8,"India"]
[null,"ID1658","2012-06-04T12:58:06",300000,300000,"INR",{"$f":"Data!$E1313*VLOOKUP(Data!$F1313,tblXrate[],2,FALSE)","v":192000},"Store Inventory","Analyst","India",{"$f":"VLOOKUP(Data!$J1313,tblCountries[[Actual]:[Mapping]],2,FALSE)","v":"USA"},"4 to 6 hours a day",8,"India"]
[null,"ID1692","2012-06-05T20:43:21",90000,90000,"USD",{"$f":"Data!$E1336*VLOOKUP(Data!$F1336,tblXrate[],2,FALSE)","v":55166.239522354947},"Senior QA Tester","Analyst","USA",{"$f":"VLOOKUP(Data!$J1336,tblCountries[[Actual]:[Mapping]],2,FALSE)","v":"UK"},"2 to 3 hours per day",8,"USA"]
[null,"ID1696","2012-06-05T21:59:40",65000,65000,"USD",{"$f":"Data!$E1339*VLOOKUP(Data!$F1339,tblXrate[],2,FALSE)","v":10684.750012465542},"Business Analyst","Analyst","USA",{"$f":"VLOOKUP(Data!$J1339,tblCountries[[Actual]:[Mapping]],2,FALSE)","v":"India"},"4 to 6 hours a day",8,"USA"]
[null,"ID1700","2012-06-05T23:09:44","Â£35500",35500,"GBP",{"$f":"Data!$E1342*VLOOKUP(Data!$F1342,tblXrate[],2,FALSE)","v":58000},"Assistant Accountant","Accountant","UK",{"$f":"VLOOKUP(Data!$J1342,tblCountries[[Actual]:[Mapping]],2,FALSE)","v":"USA"},"4 to 6 hours a day",8,"UK"]
[null,"ID1720","2012-06-06T19:54:49",1200,14400,"USD",{"$f":"Data!$E1357*VLOOKUP(Data!$F1357,tblXrate[],2,FALSE)","v":60000},"Engineer","Engineer","India",{"$f":"VLOOKUP(Data!$J1357,tblCountries[[Actual]:[Mapping]],2,FALSE)","v":"USA"},"1 or 2 hours a day",8,"India"]
[null,"ID1726","2012-06-06T22:42:16",25000,25000,"USD",{"$f":"Data!$E1362*VLOOKUP(Data!$F1362,tblXrate[],2,FALSE)","v":8903.9583437212841},"exe","Analyst","India",{"$f":"VLOOKUP(Data!$J1362,tblCountries[[Actual]:[Mapping]],2,FALSE)","v":"India"},"All the 8 hours baby, all the 8!",8,"India"]
[null,"ID1739","2012-06-07T20:48:04","Â£73000",73000,"GBP",{"$f":"Data!$E1373*VLOOKUP(Data!$F1373,tblXrate[],2,FALSE)","v":50437.70470615309},"Financial Controller","Controller","UK",{"$f":"VLOOKUP(Data!$J1373,tblCountries[[Actual]:[Mapping]],2,FALSE)","v":"UK"},"4 to 6 hours a day",8,"UK"]
[null,"ID1815","2012-06-12T20:11:24",8900,1281600,"PKR",{"$f":"Data!$E1439*VLOOKUP(Data!$F1439,tblXrate[],2,FALSE)","v":44383.603963142654},"Manager MIS & Analytics","Manager","pakistan",{"$f":"VLOOKUP(Data!$J1439,tblCountries[[Actual]:[Mapping]],2,FALSE)","v":"UK"},"All the 8 hours baby, all the 8!",8,"Pakistan"]
[null,"ID1818","2012-06-12T21:47:54",280000,280000,"INR",{"$f":"Data!$E1441*VLOOKUP(Data!$F1441,tblXrate[],2,FALSE)","v":54000},"Sales Cordinator","Analyst","India",{"$f":"VLOOKUP(Data!$J1441,tblCountries[[Actual]:[Mapping]],2,FALSE)","v":"USA"},"All the 8 hours baby, all the 8!",8,"India"]
[null,"ID1865","2012-06-15T18:13:12",112000,112000,"USD",{"$f":"Data!$E1480*VLOOKUP(Data!$F1480,tblXrate[],2,FALSE)","v":19588.708356186824},"manager","Manager","USA",{"$f":"VLOOKUP(Data!$J1480,tblCountries[[Actual]:[Mapping]],2,FALSE)","v":"India"},"2 to 3 hours per day",8,"USA"]
[null,"ID1866","2012-06-15T20:00:26",11000,11000,"USD",{"$f":"Data!$E1481*VLOOKUP(Data!$F1481,tblXrate[],2,FALSE)","v":92000},"AM","Manager","India",{"$f":"VLOOKUP(Data!$J1481,tblCountries[[Actual]:[Mapping]],2,FALSE)","v":"USA"},"All the 8 hours baby, all the 8!",8,"India"]
[null,"ID1901","2012-06-19T07:59:00",120000,120000,"AUD",{"$f":"Data!$E1508*VLOOKUP(Data!$F1508,tblXrate[],2,FALSE)","v":32054.250037396621},"Manager","Manager","Australia",{"$f":"VLOOKUP(Data!$J1508,tblCountries[[Actual]:[Mapping]],2,FALSE)","v":"India"},"1 or 2 hours a day",8,"Australia"]
[null,"ID1906","2012-06-19T19:33:25",74000,74000,"AUD",{"$f":"Data!$E1512*VLOOKUP(Data!$F1512,tblXrate[],2,FALSE)","v":400000},"Systems Analyst","Analyst","Australia",{"$f":"VLOOKUP(Data!$J1512,tblCountries[[Actual]:[Mapping]],2,FALSE)","v":"USA"},"4 to 6 hours a day",8,"Australia"]
[null,"ID1921","2012-06-20T03:55:55",46000,46000,"USD",{"$f":"Data!$E1526*VLOOKUP(Data!$F1526,tblXrate[],2,FALSE)","v":44251.268536364711},"Poultry Analyst","Analyst","USA",{"$f":"VLOOKUP(Data!$J1526,tblCountries[[Actual]:[Mapping]],2,FALSE)","v":"Canada"},"4 to 6 hours a day",8,"USA"]
[null,"ID0849","2012-05-27T01:30:55","30000 eur",30000,"EUR",{"$f":"Data!$E1667*VLOOKUP(Data!$F1667,tblXrate[],2,FALSE)","v":45880},"financialcotroller","Accountant","portugal","Other Countries","All the 8 hours baby, all the 8!",8,"Portugal"]
[null,"ID0921","2012-05-27T19:41:55",20500,20500,"EUR",{"$f":"Data!$E1689*VLOOKUP(Data!$F1689,tblXrate[],2,FALSE)","v":90000},"C&B Manager","Manager","Poland","Other Countries","4 to 6 hours a day",8,"Poland"]
[null,"ID0934","2012-05-27T22:40:38","R$ 19.200,00",19200,"BRL",{"$f":"Data!$E1692*VLOOKUP(Data!$F1692,tblXrate[],2,FALSE)","v":30000},"Programmer","Analyst","Brazil","Other Countries","All the 8 hours baby, all the 8!",8,"Brazil"]
[null,"ID0938","2012-05-27T23:32:30",20571,20571,"USD",{"$f":"Data!$E1694*VLOOKUP(Data!$F1694,tblXrate[],2,FALSE)","v":60000},"CFO","CXO or Top Mgmt.","Albania","Other Countries","4 to 6 hours a day",8,"Albania"]
[null,"ID1368","2012-05-29T19:39:35","4000000 JPY",4000000,"JPY",{"$f":"Data!$E1793*VLOOKUP(Data!$F1793,tblXrate[],2,FALSE)","v":120000},"System Analyst (Configuration Mgmt)","Analyst","Japan","Other Countries","4 to 6 hours a day",8,"Japan"]
[null,"ID1453","2012-05-30T13:06:12",30000,30000,"USD",{"$f":"Data!$E1800*VLOOKUP(Data!$F1800,tblXrate[],2,FALSE)","v":184207.91865378313},"Accounting Specialist","Accountant","UAE","Other Countries","4 to 6 hours a day",8,"UAE"]
[null,"ID1494","2012-05-30T20:53:12","7200 USD per year aprox",7200,"USD",{"$f":"Data!$E1810*VLOOKUP(Data!$F1810,tblXrate[],2,FALSE)","v":100000},"control process auxiliary","Controller","Colombia","Other Countries","4 to 6 hours a day",8,"Colombia"]
[null,"ID1500","2012-05-30T22:31:33","33500 â‚¬",33500,"EUR",{"$f":"Data!$E1813*VLOOKUP(Data!$F1813,tblXrate[],2,FALSE)","v":61000},"Controller / VBA Developet","Controller","Germany","Other Countries","All the 8 hours baby, all the 8!",8,"Germany"]
[null,"ID1533","2012-05-31T10:33:07","10000 US$",10000,"USD",{"$f":"Data!$E1817*VLOOKUP(Data!$F1817,tblXrate[],2,FALSE)","v":18000},"Project management","Manager","Vietnam","Other Countries","2 to 3 hours per day",8,"Vietnam"]
[null,"ID1549","2012-05-31T18:35:30",24864,24864,"USD",{"$f":"Data!$E1821*VLOOKUP(Data!$F1821,tblXrate[],2,FALSE)","v":19200},"Brand manager","Manager","Libya","Other Countries","All the 8 hours baby, all the 8!",8,"Libya"]
[null,"ID1573","2012-06-01T03:01:04",1320,15840,"USD",{"$f":"Data!$E1825*VLOOKUP(Data!$F1825,tblXrate[],2,FALSE)","v":24000},"Asistente","Analyst","Peru","Other Countries","All the 8 hours baby, all the 8!",8,"Peru"]
[null,"ID1580","2012-06-01T05:56:20","120000 MAD",120000,"MAD",{"$f":"Data!$E1829*VLOOKUP(Data!$F1829,tblXrate[],2,FALSE)","v":145000},"Supply chain Controller","Controller","Morocco","Other Countries","All the 8 hours baby, all the 8!",8,"Morocco"]
[null,"ID1670","2012-06-04T23:38:42","11000 USD",11000,"USD",{"$f":"Data!$E1845*VLOOKUP(Data!$F1845,tblXrate[],2,FALSE)","v":40000},"Dataminer","Analyst","Tunisia","Other Countries","4 to 6 hours a day",8,"Tunisia"]
[null,"ID1678","2012-06-05T03:55:36","US$ 30500",30500,"USD",{"$f":"Data!$E1848*VLOOKUP(Data!$F1848,tblXrate[],2,FALSE)","v":22000},"Financial Analyst","Analyst","Brazil","Other Countries","All the 8 hours baby, all the 8!",8,"Brazil"]
[null,"ID1899","2012-06-19T04:55:06",28000,28000,"EUR",{"$f":"Data!$E1884*VLOOKUP(Data!$F1884,tblXrate[],2,FALSE)","v":95000},"controller","Controller","Spain","Other Countries","4 to 6 hours a day",8,"Spain"]
[null,"ID1224","2012-05-29T01:22:59","INR 1000000",1000000,"INR",{"$f":"Data!$E975*VLOOKUP(Data!$F975,tblXrate[],2,FALSE)","v":2938.3062534280239},"Asst Manager","Manager","India",{"$f":"VLOOKUP(Data!$J975,tblCountries[[Actual]:[Mapping]],2,FALSE)","v":"India"},"4 to 6 hours a day",8.5,"India"]
[null,"ID0657","2012-05-26T12:25:09",21500,21500,"USD",{"$f":"Data!$E547*VLOOKUP(Data!$F547,tblXrate[],2,FALSE)","v":40000},"Asst Mgr","Analyst","India",{"$f":"VLOOKUP(Data!$J547,tblCountries[[Actual]:[Mapping]],2,FALSE)","v":"New Zealand"},"4 to 6 hours a day",9,"India"]
[null,"ID0839","2012-05-26T23:58:53","900000 Rs",900000,"INR",{"$f":"Data!$E695*VLOOKUP(Data!$F695,tblXrate[],2,FALSE)","v":8013.5625093491553},"Deputy Manager","Manager","India",{"$f":"VLOOKUP(Data!$J695,tblCountries[[Actual]:[Mapping]],2,FALSE)","v":"India"},"1 or 2 hours a day",9,"India"]
[null,"ID0907","2012-05-27T15:44:52","Rs 600000/-",600000,"INR",{"$f":"Data!$E741*VLOOKUP(Data!$F741,tblXrate[],2,FALSE)","v":60000},"Manager","Manager","India",{"$f":"VLOOKUP(Data!$J741,tblCountries[[Actual]:[Mapping]],2,FALSE)","v":"USA"},"All the 8 hours baby, all the 8!",9,"India"]
[null,"ID1025","2012-05-28T12:26:42",65000,65000,"USD",{"$f":"Data!$E822*VLOOKUP(Data!$F822,tblXrate[],2,FALSE)","v":50437.70470615309},"Controller","Controller","USA",{"$f":"VLOOKUP(Data!$J822,tblCountries[[Actual]:[Mapping]],2,FALSE)","v":"Canada"},"4 to 6 hours a day",9,"USA"]
[null,"ID1071","2012-05-28T14:53:44","1600000Rs",1600000,"INR",{"$f":"Data!$E857*VLOOKUP(Data!$F857,tblXrate[],2,FALSE)","v":3650.6229209257262},"Manager Fin","Manager","India",{"$f":"VLOOKUP(Data!$J857,tblCountries[[Actual]:[Mapping]],2,FALSE)","v":"India"},"All the 8 hours baby, all the 8!",9,"India"]
[null,"ID1081","2012-05-28T15:33:37","INR 2500000",2500000,"INR",{"$f":"Data!$E866*VLOOKUP(Data!$F866,tblXrate[],2,FALSE)","v":115000},"Vice President","CXO or Top Mgmt.","India",{"$f":"VLOOKUP(Data!$J866,tblCountries[[Actual]:[Mapping]],2,FALSE)","v":"USA"},"4 to 6 hours a day",9,"India"]
[null,"ID1131","2012-05-28T18:02:44","4,00,000",400000,"INR",{"$f":"Data!$E907*VLOOKUP(Data!$F907,tblXrate[],2,FALSE)","v":111000},"Sr. Team Lead - MIS","Reporting","India",{"$f":"VLOOKUP(Data!$J907,tblCountries[[Actual]:[Mapping]],2,FALSE)","v":"USA"},"4 to 6 hours a day",9,"India"]
[null,"ID1182","2012-05-28T22:52:19","GBPÂ£32000",32000,"GBP",{"$f":"Data!$E944*VLOOKUP(Data!$F944,tblXrate[],2,FALSE)","v":33500},"Performance Analyst","Analyst","Canada",{"$f":"VLOOKUP(Data!$J944,tblCountries[[Actual]:[Mapping]],2,FALSE)","v":"Dubai"},"4 to 6 hours a day",9,"Canada"]
[null,"ID1318","2012-05-29T15:24:45",1200000,1200000,"INR",{"$f":"Data!$E1044*VLOOKUP(Data!$F1044,tblXrate[],2,FALSE)","v":19588.708356186824},"Manager - Corporate strategy and Planning","Manager","India",{"$f":"VLOOKUP(Data!$J1044,tblCountries[[Actual]:[Mapping]],2,FALSE)","v":"India"},"4 to 6 hours a day",9,"India"]
[null,"ID1428","2012-05-30T01:48:18",75000,75000,"USD",{"$f":"Data!$E1134*VLOOKUP(Data!$F1134,tblXrate[],2,FALSE)","v":147886.90017838217},"HR Cordinator","Manager","USA",{"$f":"VLOOKUP(Data!$J1134,tblCountries[[Actual]:[Mapping]],2,FALSE)","v":"Australia"},"1 or 2 hours a day",9,"USA"]
[null,"ID1431","2012-05-30T02:18:02","92000 USD",92000,"USD",{"$f":"Data!$E1137*VLOOKUP(Data!$F1137,tblXrate[],2,FALSE)","v":85000},"Controller","Controller","USA",{"$f":"VLOOKUP(Data!$J1137,tblCountries[[Actual]:[Mapping]],2,FALSE)","v":"USA"},"2 to 3 hours per day",9,"USA"]
[null,"ID1483","2012-05-30T19:01:20",85000,85000,"USD",{"$f":"Data!$E1179*VLOOKUP(Data!$F1179,tblXrate[],2,FALSE)","v":70970},"sr analyst","Analyst","USA",{"$f":"VLOOKUP(Data!$J1179,tblCountries[[Actual]:[Mapping]],2,FALSE)","v":"USA"},"4 to 6 hours a day",9,"USA"]
[null,"ID1572","2012-06-01T02:46:21","Rs. 500000",500000,"INR",{"$f":"Data!$E1247*VLOOKUP(Data!$F1247,tblXrate[],2,FALSE)","v":13800},"Sr. Associate","Analyst","India",{"$f":"VLOOKUP(Data!$J1247,tblCountries[[Actual]:[Mapping]],2,FALSE)","v":"Sri Lanka"},"4 to 6 hours a day",9,"India"]
[null,"ID1628","2012-06-02T20:52:59","37000GBP",37000,"GBP",{"$f":"Data!$E1291*VLOOKUP(Data!$F1291,tblXrate[],2,FALSE)","v":104172.75399731184},"Technical Web Analyst","Analyst","UK",{"$f":"VLOOKUP(Data!$J1291,tblCountries[[Actual]:[Mapping]],2,FALSE)","v":"Netherlands"},"4 to 6 hours a day",9,"UK"]
[null,"ID1640","2012-06-03T10:10:43",6545,6545,"USD",{"$f":"Data!$E1297*VLOOKUP(Data!$F1297,tblXrate[],2,FALSE)","v":130000},"Operations","Manager","India",{"$f":"VLOOKUP(Data!$J1297,tblCountries[[Actual]:[Mapping]],2,FALSE)","v":"USA"},"All the 8 hours baby, all the 8!",9,"India"]
[null,"ID1654","2012-06-04T04:31:53",70000,70000,"USD",{"$f":"Data!$E1309*VLOOKUP(Data!$F1309,tblXrate[],2,FALSE)","v":50000},"Sr financial analyst","Analyst","USA",{"$f":"VLOOKUP(Data!$J1309,tblCountries[[Actual]:[Mapping]],2,FALSE)","v":"India"},"4 to 6 hours a day",9,"USA"]
[null,"ID1698","2012-06-05T22:44:27",92000,92000,"USD",{"$f":"Data!$E1341*VLOOKUP(Data!$F1341,tblXrate[],2,FALSE)","v":5846},"Anallyst","Analyst","USA",{"$f":"VLOOKUP(Data!$J1341,tblCountries[[Actual]:[Mapping]],2,FALSE)","v":"India"},"4 to 6 hours a day",9,"USA"]
[null,"ID1752","2012-06-08T13:38:45","9,50,000",950000,"INR",{"$f":"Data!$E1385*VLOOKUP(Data!$F1385,tblXrate[],2,FALSE)","v":55068.245289698301},"Associate Manager, Drug Safety Operations","Manager","India",{"$f":"VLOOKUP(Data!$J1385,tblCountries[[Actual]:[Mapping]],2,FALSE)","v":"Canada"},"2 to 3 hours per day",9,"India"]
[null,"ID1779","2012-06-10T14:58:39",1300000,1300000,"INR",{"$f":"Data!$E1408*VLOOKUP(Data!$F1408,tblXrate[],2,FALSE)","v":36000},"Manager","Manager","India",{"$f":"VLOOKUP(Data!$J1408,tblCountries[[Actual]:[Mapping]],2,FALSE)","v":"USA"},"All the 8 hours baby, all the 8!",9,"India"]
[null,"ID1788","2012-06-11T10:04:43",74461,74461,"USD",{"$f":"Data!$E1415*VLOOKUP(Data!$F1415,tblXrate[],2,FALSE)","v":57000},"Scientist III","Misc.","USA",{"$f":"VLOOKUP(Data!$J1415,tblCountries[[Actual]:[Mapping]],2,FALSE)","v":"USA"},"1 or 2 hours a day",9,"USA"]
[null,"ID1840","2012-06-14T02:44:43",57000,57000,"USD",{"$f":"Data!$E1461*VLOOKUP(Data!$F1461,tblXrate[],2,FALSE)","v":37440},"Staff Accountant","Accountant","USA",{"$f":"VLOOKUP(Data!$J1461,tblCountries[[Actual]:[Mapping]],2,FALSE)","v":"USA"},"4 to 6 hours a day",9,"USA"]
[null,"ID1842","2012-06-14T07:16:41",80000,80000,"USD",{"$f":"Data!$E1463*VLOOKUP(Data!$F1463,tblXrate[],2,FALSE)","v":66500},"Project Controller","Controller","USA",{"$f":"VLOOKUP(Data!$J1463,tblCountries[[Actual]:[Mapping]],2,FALSE)","v":"USA"},"4 to 6 hours a day",9,"USA"]
[null,"ID1881","2012-06-16T18:33:25","Rs. 700000",700000,"INR",{"$f":"Data!$E1493*VLOOKUP(Data!$F1493,tblXrate[],2,FALSE)","v":13636},"Revenue Focus Manager","Manager","India",{"$f":"VLOOKUP(Data!$J1493,tblCountries[[Actual]:[Mapping]],2,FALSE)","v":"India"},"2 to 3 hours per day",9,"India"]
[null,"ID0680","2012-05-26T13:03:32",720000,720000,"PHP",{"$f":"Data!$E1637*VLOOKUP(Data!$F1637,tblXrate[],2,FALSE)","v":73752.11422727452},"System Manager","Manager","Philippines","Other Countries","4 to 6 hours a day",9,"Philippines"]
[null,"ID0914","2012-05-27T17:10:36",36000,36000,"USD",{"$f":"Data!$E1686*VLOOKUP(Data!$F1686,tblXrate[],2,FALSE)","v":104027.76595644075},"QA Supervisor","Controller","Czech Republic","Other Countries","2 to 3 hours per day",9,"Czech Republic"]
[null,"ID1196","2012-05-28T23:21:02","KES 4.3 million",4300000,"KENYA",{"$f":"Data!$E1753*VLOOKUP(Data!$F1753,tblXrate[],2,FALSE)","v":91418.339779902482},"Finance Manager","Manager","Kenya","Other Countries","4 to 6 hours a day",9,"Kenya"]
[null,"ID1594","2012-06-01T18:08:07","75000 $",75000,"USD",{"$f":"Data!$E1830*VLOOKUP(Data!$F1830,tblXrate[],2,FALSE)","v":63519.971949580387},"Consultant","Consultant","Germany","Other Countries","2 to 3 hours per day",9,"Germany"]
[null,"ID1776","2012-06-10T02:29:57",80000,80000,"USD",{"$f":"Data!$E1864*VLOOKUP(Data!$F1864,tblXrate[],2,FALSE)","v":12000},"Engineer","Engineer","Brazil","Other Countries","1 or 2 hours a day",9,"Brazil"]
[null,"ID0565","2012-05-26T06:20:38",140000,140000,"USD",{"$f":"Data!$E467*VLOOKUP(Data!$F467,tblXrate[],2,FALSE)","v":7265.630008476568},"controller","Controller","USA",{"$f":"VLOOKUP(Data!$J467,tblCountries[[Actual]:[Mapping]],2,FALSE)","v":"India"},"2 to 3 hours per day",10,"USA"]
[null,"ID0575","2012-05-26T07:01:10","Â£21000",21000,"GBP",{"$f":"Data!$E475*VLOOKUP(Data!$F475,tblXrate[],2,FALSE)","v":90000},"Sales Analyst","Analyst","UK",{"$f":"VLOOKUP(Data!$J475,tblCountries[[Actual]:[Mapping]],2,FALSE)","v":"USA"},"All the 8 hours baby, all the 8!",10,"UK"]
[null,"ID0583","2012-05-26T07:37:53",50000,50000,"USD",{"$f":"Data!$E482*VLOOKUP(Data!$F482,tblXrate[],2,FALSE)","v":4800},"IT Specialist","Specialist","USA",{"$f":"VLOOKUP(Data!$J482,tblCountries[[Actual]:[Mapping]],2,FALSE)","v":"India"},"2 to 3 hours per day",10,"USA"]
[null,"ID0585","2012-05-26T07:48:29",102000,102000,"AUD",{"$f":"Data!$E484*VLOOKUP(Data!$F484,tblXrate[],2,FALSE)","v":81592.772512210868},"coordinator lismore regional airport","Manager","Australia",{"$f":"VLOOKUP(Data!$J484,tblCountries[[Actual]:[Mapping]],2,FALSE)","v":"Australia"},"1 or 2 hours a day",10,"Australia"]
[null,"ID0604","2012-05-26T09:28:32",50000,50000,"USD",{"$f":"Data!$E500*VLOOKUP(Data!$F500,tblXrate[],2,FALSE)","v":45000},"Product manager","Manager","India",{"$f":"VLOOKUP(Data!$J500,tblCountries[[Actual]:[Mapping]],2,FALSE)","v":"USA"},"1 or 2 hours a day",10,"India"]
[null,"ID0611","2012-05-26T10:01:28",380000,380000,"INR",{"$f":"Data!$E505*VLOOKUP(Data!$F505,tblXrate[],2,FALSE)","v":71500},"Incharge","Manager","India",{"$f":"VLOOKUP(Data!$J505,tblCountries[[Actual]:[Mapping]],2,FALSE)","v":"USA"},"4 to 6 hours a day",10,"India"]
[null,"ID0617","2012-05-26T10:43:53",1800000,1800000,"INR",{"$f":"Data!$E510*VLOOKUP(Data!$F510,tblXrate[],2,FALSE)","v":62000},"AGM Finance","Manager","India",{"$f":"VLOOKUP(Data!$J510,tblCountries[[Actual]:[Mapping]],2,FALSE)","v":"USA"},"2 to 3 hours per day",10,"India"]
[null,"ID0627","2012-05-26T11:05:58",95000,95000,"USD",{"$f":"Data!$E520*VLOOKUP(Data!$F520,tblXrate[],2,FALSE)","v":10684.750012465542},"Program Manager","Manager","USA",{"$f":"VLOOKUP(Data!$J520,tblCountries[[Actual]:[Mapping]],2,FALSE)","v":"India"},"1 or 2 hours a day",10,"USA"]
[null,"ID0633","2012-05-26T11:30:39","A$170000",170000,"AUD",{"$f":"Data!$E525*VLOOKUP(Data!$F525,tblXrate[],2,FALSE)","v":2493.1083362419595},"senior business analyst","Analyst","Australia",{"$f":"VLOOKUP(Data!$J525,tblCountries[[Actual]:[Mapping]],2,FALSE)","v":"India"},"All the 8 hours baby, all the 8!",10,"Australia"]
[null,"ID0655","2012-05-26T12:23:14",10500000,10500000,"INR",{"$f":"Data!$E546*VLOOKUP(Data!$F546,tblXrate[],2,FALSE)","v":48000},"MANAGER","Manager","India",{"$f":"VLOOKUP(Data!$J546,tblCountries[[Actual]:[Mapping]],2,FALSE)","v":"France"},"2 to 3 hours per day",10,"India"]
[null,"ID0663","2012-05-26T12:31:29",37000,37000,"USD",{"$f":"Data!$E553*VLOOKUP(Data!$F553,tblXrate[],2,FALSE)","v":120000},"Cad Engineer","Engineer","India",{"$f":"VLOOKUP(Data!$J553,tblCountries[[Actual]:[Mapping]],2,FALSE)","v":"Singapore"},"4 to 6 hours a day",10,"India"]
[null,"ID0704","2012-05-26T13:49:54",35000,35000,"USD",{"$f":"Data!$E587*VLOOKUP(Data!$F587,tblXrate[],2,FALSE)","v":7123.1666749770275},"IT Specialist","Specialist","USA",{"$f":"VLOOKUP(Data!$J587,tblCountries[[Actual]:[Mapping]],2,FALSE)","v":"India"},"4 to 6 hours a day",10,"USA"]
[null,"ID0718","2012-05-26T14:35:48","Inr 60000",720000,"INR",{"$f":"Data!$E599*VLOOKUP(Data!$F599,tblXrate[],2,FALSE)","v":55166.239522354947},"Asstt manager","Manager","India",{"$f":"VLOOKUP(Data!$J599,tblCountries[[Actual]:[Mapping]],2,FALSE)","v":"UK"},"All the 8 hours baby, all the 8!",10,"India"]
[null,"ID0731","2012-05-26T15:07:39",35000,35000,"USD",{"$f":"Data!$E610*VLOOKUP(Data!$F610,tblXrate[],2,FALSE)","v":54000},"Associate","Analyst","India",{"$f":"VLOOKUP(Data!$J610,tblCountries[[Actual]:[Mapping]],2,FALSE)","v":"USA"},"4 to 6 hours a day",10,"India"]
[null,"ID0771","2012-05-26T17:47:00",205000,205000,"INR",{"$f":"Data!$E641*VLOOKUP(Data!$F641,tblXrate[],2,FALSE)","v":6232.7708406048987},"BRANCH ACCOUNTANT","Accountant","India",{"$f":"VLOOKUP(Data!$J641,tblCountries[[Actual]:[Mapping]],2,FALSE)","v":"India"},"All the 8 hours baby, all the 8!",10,"India"]
[null,"ID0791","2012-05-26T20:19:36",65000,65000,"USD",{"$f":"Data!$E657*VLOOKUP(Data!$F657,tblXrate[],2,FALSE)","v":41923.181486723057},"security analyst","Analyst","USA",{"$f":"VLOOKUP(Data!$J657,tblCountries[[Actual]:[Mapping]],2,FALSE)","v":"France"},"2 to 3 hours per day",10,"USA"]
[null,"ID0798","2012-05-26T21:00:40","Aud 65000",65000,"AUD",{"$f":"Data!$E663*VLOOKUP(Data!$F663,tblXrate[],2,FALSE)","v":35000},"Market analyst","Analyst","Australia",{"$f":"VLOOKUP(Data!$J663,tblCountries[[Actual]:[Mapping]],2,FALSE)","v":"USA"},"All the 8 hours baby, all the 8!",10,"Australia"]
[null,"ID0801","2012-05-26T21:10:20",48500,48500,"USD",{"$f":"Data!$E666*VLOOKUP(Data!$F666,tblXrate[],2,FALSE)","v":45000},"Loss Prevention Finance Coordinator","Manager","USA",{"$f":"VLOOKUP(Data!$J666,tblCountries[[Actual]:[Mapping]],2,FALSE)","v":"USA"},"2 to 3 hours per day",10,"USA"]
[null,"ID0803","2012-05-26T21:13:51",33900,33900,"USD",{"$f":"Data!$E668*VLOOKUP(Data!$F668,tblXrate[],2,FALSE)","v":20479.104190558952},"Administrative Assistant","Analyst","USA",{"$f":"VLOOKUP(Data!$J668,tblCountries[[Actual]:[Mapping]],2,FALSE)","v":"India"},"2 to 3 hours per day",10,"USA"]
[null,"ID0829","2012-05-26T23:04:02",100000,100000,"USD",{"$f":"Data!$E687*VLOOKUP(Data!$F687,tblXrate[],2,FALSE)","v":7200},"director","CXO or Top Mgmt.","USA",{"$f":"VLOOKUP(Data!$J687,tblCountries[[Actual]:[Mapping]],2,FALSE)","v":"India"},"4 to 6 hours a day",10,"USA"]
[null,"ID0837","2012-05-26T23:38:24",1000000,1000000,"INR",{"$f":"Data!$E693*VLOOKUP(Data!$F693,tblXrate[],2,FALSE)","v":10684.750012465542},"business analyist","Analyst","India",{"$f":"VLOOKUP(Data!$J693,tblCountries[[Actual]:[Mapping]],2,FALSE)","v":"India"},"4 to 6 hours a day",10,"India"]
[null,"ID0852","2012-05-27T02:33:22",100000,100000,"CAD",{"$f":"Data!$E705*VLOOKUP(Data!$F705,tblXrate[],2,FALSE)","v":78668.921842426149},"Marketing Manager","Manager","Canada",{"$f":"VLOOKUP(Data!$J705,tblCountries[[Actual]:[Mapping]],2,FALSE)","v":"Canada"},"2 to 3 hours per day",10,"Canada"]
[null,"ID0857","2012-05-27T03:25:05",55000,55000,"USD",{"$f":"Data!$E709*VLOOKUP(Data!$F709,tblXrate[],2,FALSE)","v":56742.417794422225},"Analyst","Analyst","USA",{"$f":"VLOOKUP(Data!$J709,tblCountries[[Actual]:[Mapping]],2,FALSE)","v":"UK"},"4 to 6 hours a day",10,"USA"]
[null,"ID0873","2012-05-27T08:55:36",115000,115000,"USD",{"$f":"Data!$E718*VLOOKUP(Data!$F718,tblXrate[],2,FALSE)","v":26691.183012544854},"Principal Financial Analyst","Analyst","USA",{"$f":"VLOOKUP(Data!$J718,tblCountries[[Actual]:[Mapping]],2,FALSE)","v":"Brazil"},"4 to 6 hours a day",10,"USA"]
[null,"ID0881","2012-05-27T12:35:15","3 lacs P.A",300000,"INR",{"$f":"Data!$E723*VLOOKUP(Data!$F723,tblXrate[],2,FALSE)","v":9376.2513877177607},"Sales","Analyst","India",{"$f":"VLOOKUP(Data!$J723,tblCountries[[Actual]:[Mapping]],2,FALSE)","v":"Mauritius"},"1 or 2 hours a day",10,"India"]
[null,"ID0909","2012-05-27T16:10:04",80000,80000,"GBP",{"$f":"Data!$E743*VLOOKUP(Data!$F743,tblXrate[],2,FALSE)","v":40958.208381117904},"Financial Modeller","Accountant","UK",{"$f":"VLOOKUP(Data!$J743,tblCountries[[Actual]:[Mapping]],2,FALSE)","v":"India"},"4 to 6 hours a day",10,"UK"]
[null,"ID0932","2012-05-27T22:22:01","50000 GBP",50000,"GBP",{"$f":"Data!$E759*VLOOKUP(Data!$F759,tblXrate[],2,FALSE)","v":10684.750012465542},"Finance Analyst","Analyst","UK",{"$f":"VLOOKUP(Data!$J759,tblCountries[[Actual]:[Mapping]],2,FALSE)","v":"India"},"All the 8 hours baby, all the 8!",10,"UK"]
[null,"ID0943","2012-05-27T23:52:48","usd 2000 per month",24000,"USD",{"$f":"Data!$E763*VLOOKUP(Data!$F763,tblXrate[],2,FALSE)","v":45709.169889951241},"sr manager","Manager","India",{"$f":"VLOOKUP(Data!$J763,tblCountries[[Actual]:[Mapping]],2,FALSE)","v":"UK"},"4 to 6 hours a day",10,"India"]
[null,"ID0957","2012-05-28T03:34:14",45000,45000,"EUR",{"$f":"Data!$E771*VLOOKUP(Data!$F771,tblXrate[],2,FALSE)","v":80000},"data analist","Analyst","netherlands",{"$f":"VLOOKUP(Data!$J771,tblCountries[[Actual]:[Mapping]],2,FALSE)","v":"USA"},"2 to 3 hours per day",10,"Netherlands"]
[null,"ID0981","2012-05-28T07:46:28",260000,260000,"USD",{"$f":"Data!$E789*VLOOKUP(Data!$F789,tblXrate[],2,FALSE)","v":14400},"CFO","CXO or Top Mgmt.","USA",{"$f":"VLOOKUP(Data!$J789,tblCountries[[Actual]:[Mapping]],2,FALSE)","v":"India"},"2 to 3 hours per day",10,"USA"]
[null,"ID0991","2012-05-28T08:48:56",125000,125000,"USD",{"$f":"Data!$E797*VLOOKUP(Data!$F797,tblXrate[],2,FALSE)","v":75473.31457379504},"VP, Operational Analytics","CXO or Top Mgmt.","USA",{"$f":"VLOOKUP(Data!$J797,tblCountries[[Actual]:[Mapping]],2,FALSE)","v":"Australia"},"4 to 6 hours a day",10,"USA"]
[null,"ID1005","2012-05-28T10:27:48",180000,180000,"INR",{"$f":"Data!$E807*VLOOKUP(Data!$F807,tblXrate[],2,FALSE)","v":10000},"Audit executive","Analyst","INDIA",{"$f":"VLOOKUP(Data!$J807,tblCountries[[Actual]:[Mapping]],2,FALSE)","v":"Vietnam"},"4 to 6 hours a day",10,"India"]
[null,"ID1035","2012-05-28T13:02:56","Rs 4,20,000 ",420000,"INR",{"$f":"Data!$E831*VLOOKUP(Data!$F831,tblXrate[],2,FALSE)","v":92000},"Analyst","Analyst","India",{"$f":"VLOOKUP(Data!$J831,tblCountries[[Actual]:[Mapping]],2,FALSE)","v":"USA"},"2 to 3 hours per day",10,"India"]
[null,"ID1075","2012-05-28T15:16:20","Rs. 438000",438000,"INR",{"$f":"Data!$E860*VLOOKUP(Data!$F860,tblXrate[],2,FALSE)","v":48500},"Assistant Professor","Analyst","India",{"$f":"VLOOKUP(Data!$J860,tblCountries[[Actual]:[Mapping]],2,FALSE)","v":"USA"},"1 or 2 hours a day",10,"India"]
[null,"ID1080","2012-05-28T15:33:23",600,7200,"USD",{"$f":"Data!$E865*VLOOKUP(Data!$F865,tblXrate[],2,FALSE)","v":55000},"Data Entry Operator","Analyst","India",{"$f":"VLOOKUP(Data!$J865,tblCountries[[Actual]:[Mapping]],2,FALSE)","v":"USA"},"All the 8 hours baby, all the 8!",10,"India"]
[null,"ID1085","2012-05-28T15:42:04",80000,80000,"GBP",{"$f":"Data!$E870*VLOOKUP(Data!$F870,tblXrate[],2,FALSE)","v":24000},"Manufacturing consultant","Consultant","UK",{"$f":"VLOOKUP(Data!$J870,tblCountries[[Actual]:[Mapping]],2,FALSE)","v":"India"},"4 to 6 hours a day",10,"UK"]
[null,"ID1091","2012-05-28T15:51:32","50000 INR",600000,"INR",{"$f":"Data!$E876*VLOOKUP(Data!$F876,tblXrate[],2,FALSE)","v":7799.8675090998449},"Sr.Supervisor","Analyst","India",{"$f":"VLOOKUP(Data!$J876,tblCountries[[Actual]:[Mapping]],2,FALSE)","v":"India"},"4 to 6 hours a day",10,"India"]
[null,"ID1098","2012-05-28T16:07:51",48000,48000,"GBP",{"$f":"Data!$E883*VLOOKUP(Data!$F883,tblXrate[],2,FALSE)","v":42739.000049862167},"Business Operations Co-ordinator","Manager","UK",{"$f":"VLOOKUP(Data!$J883,tblCountries[[Actual]:[Mapping]],2,FALSE)","v":"India"},"2 to 3 hours per day",10,"UK"]
[null,"ID1101","2012-05-28T16:19:41","Â£30000",30000,"GBP",{"$f":"Data!$E885*VLOOKUP(Data!$F885,tblXrate[],2,FALSE)","v":55166.239522354947},"MDM Executive (Business Analyst)","Analyst","UK",{"$f":"VLOOKUP(Data!$J885,tblCountries[[Actual]:[Mapping]],2,FALSE)","v":"UK"},"All the 8 hours baby, all the 8!",10,"UK"]
[null,"ID1115","2012-05-28T17:02:43",75000,75000,"GBP",{"$f":"Data!$E896*VLOOKUP(Data!$F896,tblXrate[],2,FALSE)","v":17807.916687442568},"Management Consultant","Manager","UK",{"$f":"VLOOKUP(Data!$J896,tblCountries[[Actual]:[Mapping]],2,FALSE)","v":"India"},"2 to 3 hours per day",10,"UK"]
[null,"ID1135","2012-05-28T18:30:51","Rs 2400000",2400000,"INR",{"$f":"Data!$E910*VLOOKUP(Data!$F910,tblXrate[],2,FALSE)","v":231119.74856804207},"GM Finance","Manager","India",{"$f":"VLOOKUP(Data!$J910,tblCountries[[Actual]:[Mapping]],2,FALSE)","v":"UK"},"All the 8 hours baby, all the 8!",10,"India"]
[null,"ID1148","2012-05-28T19:32:15","Â£23000",23000,"GBP",{"$f":"Data!$E919*VLOOKUP(Data!$F919,tblXrate[],2,FALSE)","v":85000},"Data Management Officer","Manager","UK",{"$f":"VLOOKUP(Data!$J919,tblCountries[[Actual]:[Mapping]],2,FALSE)","v":"USA"},"4 to 6 hours a day",10,"UK"]
[null,"ID1153","2012-05-28T20:35:30","Â£35000",35000,"GBP",{"$f":"Data!$E922*VLOOKUP(Data!$F922,tblXrate[],2,FALSE)","v":54000},"MI Analyst","Analyst","UK",{"$f":"VLOOKUP(Data!$J922,tblCountries[[Actual]:[Mapping]],2,FALSE)","v":"USA"},"4 to 6 hours a day",10,"UK"]
[null,"ID1154","2012-05-28T20:43:31",168000,168000,"PKR",{"$f":"Data!$E923*VLOOKUP(Data!$F923,tblXrate[],2,FALSE)","v":85000},"Accounts Assistant","Accountant","Pakistan",{"$f":"VLOOKUP(Data!$J923,tblCountries[[Actual]:[Mapping]],2,FALSE)","v":"USA"},"4 to 6 hours a day",10,"Pakistan"]
[null,"ID1191","2012-05-28T23:13:24",60000,60000,"USD",{"$f":"Data!$E949*VLOOKUP(Data!$F949,tblXrate[],2,FALSE)","v":100000},"Quality Management","Manager","USA",{"$f":"VLOOKUP(Data!$J949,tblCountries[[Actual]:[Mapping]],2,FALSE)","v":"Mexico"},"2 to 3 hours per day",10,"USA"]
[null,"ID1205","2012-05-29T00:03:43",34000,34000,"GBP",{"$f":"Data!$E960*VLOOKUP(Data!$F960,tblXrate[],2,FALSE)","v":85000},"investment accountant","Accountant","UK",{"$f":"VLOOKUP(Data!$J960,tblCountries[[Actual]:[Mapping]],2,FALSE)","v":"Sri Lanka"},"All the 8 hours baby, all the 8!",10,"UK"]
[null,"ID1206","2012-05-29T00:03:48",34000,34000,"GBP",{"$f":"Data!$E961*VLOOKUP(Data!$F961,tblXrate[],2,FALSE)","v":15000},"investment accountant","Accountant","UK",{"$f":"VLOOKUP(Data!$J961,tblCountries[[Actual]:[Mapping]],2,FALSE)","v":"Myanmar"},"All the 8 hours baby, all the 8!",10,"UK"]
[null,"ID1218","2012-05-29T00:36:21",74000,74000,"USD",{"$f":"Data!$E970*VLOOKUP(Data!$F970,tblXrate[],2,FALSE)","v":16110},"marketing specialist","Specialist","USA",{"$f":"VLOOKUP(Data!$J970,tblCountries[[Actual]:[Mapping]],2,FALSE)","v":"Colombia"},"4 to 6 hours a day",10,"USA"]
[null,"ID1237","2012-05-29T03:16:02",150000,150000,"AUD",{"$f":"Data!$E985*VLOOKUP(Data!$F985,tblXrate[],2,FALSE)","v":62000},"Analyst","Analyst","Australia",{"$f":"VLOOKUP(Data!$J985,tblCountries[[Actual]:[Mapping]],2,FALSE)","v":"Qatar"},"2 to 3 hours per day",10,"Australia"]
[null,"ID1241","2012-05-29T04:03:07",25000,25000,"GBP",{"$f":"Data!$E988*VLOOKUP(Data!$F988,tblXrate[],2,FALSE)","v":31200},"Senior Accounts Clerk","Accountant","UK",{"$f":"VLOOKUP(Data!$J988,tblCountries[[Actual]:[Mapping]],2,FALSE)","v":"Israel"},"2 to 3 hours per day",10,"UK"]
[null,"ID1246","2012-05-29T04:33:37","GBP 34000",34000,"GBP",{"$f":"Data!$E991*VLOOKUP(Data!$F991,tblXrate[],2,FALSE)","v":16800},"Investment Accountant","Accountant","UK",{"$f":"VLOOKUP(Data!$J991,tblCountries[[Actual]:[Mapping]],2,FALSE)","v":"Pakistan"},"All the 8 hours baby, all the 8!",10,"UK"]
[null,"ID1267","2012-05-29T09:15:09",82000,82000,"USD",{"$f":"Data!$E1006*VLOOKUP(Data!$F1006,tblXrate[],2,FALSE)","v":60000},"Manager - Marketing Analytics","Manager","USA",{"$f":"VLOOKUP(Data!$J1006,tblCountries[[Actual]:[Mapping]],2,FALSE)","v":"USA"},"4 to 6 hours a day",10,"USA"]
[null,"ID1280","2012-05-29T10:48:33","USD 11800 (INR 650000)",11800,"USD",{"$f":"Data!$E1015*VLOOKUP(Data!$F1015,tblXrate[],2,FALSE)","v":68000},"Assistant Data Analyst","Analyst","India",{"$f":"VLOOKUP(Data!$J1015,tblCountries[[Actual]:[Mapping]],2,FALSE)","v":"USA"},"4 to 6 hours a day",10,"India"]
[null,"ID1284","2012-05-29T11:35:53","Indian Rs 10 Lakhs",1000000,"INR",{"$f":"Data!$E1018*VLOOKUP(Data!$F1018,tblXrate[],2,FALSE)","v":62000},"Manager","Manager","India",{"$f":"VLOOKUP(Data!$J1018,tblCountries[[Actual]:[Mapping]],2,FALSE)","v":"USA"},"2 to 3 hours per day",10,"India"]
[null,"ID1306","2012-05-29T13:59:14",68000,68000,"AUD",{"$f":"Data!$E1034*VLOOKUP(Data!$F1034,tblXrate[],2,FALSE)","v":52086.37699865592},"Project Support Officer","Manager","Australia",{"$f":"VLOOKUP(Data!$J1034,tblCountries[[Actual]:[Mapping]],2,FALSE)","v":"Spain"},"4 to 6 hours a day",10,"Australia"]
[null,"ID1361","2012-05-29T19:08:37",110000,110000,"USD",{"$f":"Data!$E1074*VLOOKUP(Data!$F1074,tblXrate[],2,FALSE)","v":57167.974754622352},"Business Analytics Associate","Analyst","USA",{"$f":"VLOOKUP(Data!$J1074,tblCountries[[Actual]:[Mapping]],2,FALSE)","v":"Netherlands"},"1 or 2 hours a day",10,"USA"]
[null,"ID1371","2012-05-29T19:52:35","$80,000 USD",80000,"USD",{"$f":"Data!$E1082*VLOOKUP(Data!$F1082,tblXrate[],2,FALSE)","v":115000},"Manager of Data Analytics","Manager","USA",{"$f":"VLOOKUP(Data!$J1082,tblCountries[[Actual]:[Mapping]],2,FALSE)","v":"USA"},"4 to 6 hours a day",10,"USA"]
[null,"ID1397","2012-05-29T22:18:48",60800,60800,"USD",{"$f":"Data!$E1105*VLOOKUP(Data!$F1105,tblXrate[],2,FALSE)","v":8547.8000099724322},"Data Integrity & Reporting Tool Analyst","Analyst","USA",{"$f":"VLOOKUP(Data!$J1105,tblCountries[[Actual]:[Mapping]],2,FALSE)","v":"India"},"All the 8 hours baby, all the 8!",10,"USA"]
[null,"ID1398","2012-05-29T22:24:28",136000,136000,"USD",{"$f":"Data!$E1106*VLOOKUP(Data!$F1106,tblXrate[],2,FALSE)","v":40000},"Manager FP and A","Manager","USA",{"$f":"VLOOKUP(Data!$J1106,tblCountries[[Actual]:[Mapping]],2,FALSE)","v":"USA"},"4 to 6 hours a day",10,"USA"]
[null,"ID1402","2012-05-29T22:50:16",65000,65000,"USD",{"$f":"Data!$E1110*VLOOKUP(Data!$F1110,tblXrate[],2,FALSE)","v":101990.96564026357},"eeo analyst","Analyst","USA",{"$f":"VLOOKUP(Data!$J1110,tblCountries[[Actual]:[Mapping]],2,FALSE)","v":"Australia"},"2 to 3 hours per day",10,"USA"]
[null,"ID1406","2012-05-29T23:08:45",49000,49000,"USD",{"$f":"Data!$E1114*VLOOKUP(Data!$F1114,tblXrate[],2,FALSE)","v":78764.765217479682},"Research Analyst","Analyst","USA",{"$f":"VLOOKUP(Data!$J1114,tblCountries[[Actual]:[Mapping]],2,FALSE)","v":"Netherlands"},"4 to 6 hours a day",10,"USA"]
[null,"ID1417","2012-05-30T00:25:43",120000,120000,"USD",{"$f":"Data!$E1123*VLOOKUP(Data!$F1123,tblXrate[],2,FALSE)","v":64300},"Finance Manager","Manager","USA",{"$f":"VLOOKUP(Data!$J1123,tblCountries[[Actual]:[Mapping]],2,FALSE)","v":"USA"},"2 to 3 hours per day",10,"USA"]
[null,"ID1430","2012-05-30T01:57:58",77000,77000,"USD",{"$f":"Data!$E1136*VLOOKUP(Data!$F1136,tblXrate[],2,FALSE)","v":50000},"Assistant Engineer","Engineer","USA",{"$f":"VLOOKUP(Data!$J1136,tblCountries[[Actual]:[Mapping]],2,FALSE)","v":"USA"},"4 to 6 hours a day",10,"USA"]
[null,"ID1432","2012-05-30T02:18:30",72000,72000,"USD",{"$f":"Data!$E1138*VLOOKUP(Data!$F1138,tblXrate[],2,FALSE)","v":115000},"sr. senior analyst","Analyst","USA",{"$f":"VLOOKUP(Data!$J1138,tblCountries[[Actual]:[Mapping]],2,FALSE)","v":"USA"},"All the 8 hours baby, all the 8!",10,"USA"]
[null,"ID1434","2012-05-30T02:22:59",111000,111000,"USD",{"$f":"Data!$E1140*VLOOKUP(Data!$F1140,tblXrate[],2,FALSE)","v":67794.987956419791},"Project Manager - Finance","Manager","USA",{"$f":"VLOOKUP(Data!$J1140,tblCountries[[Actual]:[Mapping]],2,FALSE)","v":"New Zealand"},"2 to 3 hours per day",10,"USA"]
[null,"ID1455","2012-05-30T13:25:12",20000,20000,"USD",{"$f":"Data!$E1158*VLOOKUP(Data!$F1158,tblXrate[],2,FALSE)","v":5689.2125418690484},"manager","Manager","India",{"$f":"VLOOKUP(Data!$J1158,tblCountries[[Actual]:[Mapping]],2,FALSE)","v":"Philippines"},"Excel ?!? What Excel?",10,"India"]
[null,"ID1456","2012-05-30T13:31:35",86000,86000,"AUD",{"$f":"Data!$E1159*VLOOKUP(Data!$F1159,tblXrate[],2,FALSE)","v":35063.024516168378},"data analyst","Analyst","Australia",{"$f":"VLOOKUP(Data!$J1159,tblCountries[[Actual]:[Mapping]],2,FALSE)","v":"Hungary"},"4 to 6 hours a day",10,"Australia"]
[null,"ID1489","2012-05-30T20:26:10",146633,146633,"GBP",{"$f":"Data!$E1184*VLOOKUP(Data!$F1184,tblXrate[],2,FALSE)","v":70000},"Senior Planning Engineer","Engineer","UK",{"$f":"VLOOKUP(Data!$J1184,tblCountries[[Actual]:[Mapping]],2,FALSE)","v":"USA"},"2 to 3 hours per day",10,"UK"]
[null,"ID1490","2012-05-30T20:40:45",76000,76000,"USD",{"$f":"Data!$E1185*VLOOKUP(Data!$F1185,tblXrate[],2,FALSE)","v":52000},"Sr. Analyst","Analyst","USA",{"$f":"VLOOKUP(Data!$J1185,tblCountries[[Actual]:[Mapping]],2,FALSE)","v":"USA"},"All the 8 hours baby, all the 8!",10,"USA"]
[null,"ID1496","2012-05-30T21:19:31",45000,45000,"USD",{"$f":"Data!$E1188*VLOOKUP(Data!$F1188,tblXrate[],2,FALSE)","v":8725},"Data Specialist","Specialist","USA",{"$f":"VLOOKUP(Data!$J1188,tblCountries[[Actual]:[Mapping]],2,FALSE)","v":"Pakistan"},"2 to 3 hours per day",10,"USA"]
[null,"ID1505","2012-05-30T23:26:00",32000,32000,"USD",{"$f":"Data!$E1195*VLOOKUP(Data!$F1195,tblXrate[],2,FALSE)","v":12000},"Reports Writer","Reporting","USA",{"$f":"VLOOKUP(Data!$J1195,tblCountries[[Actual]:[Mapping]],2,FALSE)","v":"UAE"},"4 to 6 hours a day",10,"USA"]
[null,"ID1512","2012-05-31T01:17:48",1500000,1500000,"INR",{"$f":"Data!$E1200*VLOOKUP(Data!$F1200,tblXrate[],2,FALSE)","v":90000},"Senior Consultant - PMO","Consultant","India",{"$f":"VLOOKUP(Data!$J1200,tblCountries[[Actual]:[Mapping]],2,FALSE)","v":"USA"},"4 to 6 hours a day",10,"India"]
[null,"ID1519","2012-05-31T03:07:09",89000,89000,"USD",{"$f":"Data!$E1205*VLOOKUP(Data!$F1205,tblXrate[],2,FALSE)","v":101990.96564026357},"Finance Manager","Manager","USA",{"$f":"VLOOKUP(Data!$J1205,tblCountries[[Actual]:[Mapping]],2,FALSE)","v":"Australia"},"2 to 3 hours per day",10,"USA"]
[null,"ID1551","2012-05-31T20:13:27",1000000,1000000,"INR",{"$f":"Data!$E1230*VLOOKUP(Data!$F1230,tblXrate[],2,FALSE)","v":67000},"Financial analyst","Analyst","India",{"$f":"VLOOKUP(Data!$J1230,tblCountries[[Actual]:[Mapping]],2,FALSE)","v":"USA"},"All the 8 hours baby, all the 8!",10,"India"]
[null,"ID1559","2012-05-31T22:06:59",74000,74000,"CAD",{"$f":"Data!$E1236*VLOOKUP(Data!$F1236,tblXrate[],2,FALSE)","v":8903.9583437212841},"Operations Analyst","Analyst","Canada",{"$f":"VLOOKUP(Data!$J1236,tblCountries[[Actual]:[Mapping]],2,FALSE)","v":"India"},"4 to 6 hours a day",10,"Canada"]
[null,"ID1575","2012-06-01T04:10:52",41000,41000,"USD",{"$f":"Data!$E1249*VLOOKUP(Data!$F1249,tblXrate[],2,FALSE)","v":125000},"Excel Developer","Consultant","USA",{"$f":"VLOOKUP(Data!$J1249,tblCountries[[Actual]:[Mapping]],2,FALSE)","v":"South Africa"},"4 to 6 hours a day",10,"USA"]
[null,"ID1583","2012-06-01T06:53:52",85000,85000,"USD",{"$f":"Data!$E1253*VLOOKUP(Data!$F1253,tblXrate[],2,FALSE)","v":29261.227167098674},"Sr Report Developer","Reporting","USA",{"$f":"VLOOKUP(Data!$J1253,tblCountries[[Actual]:[Mapping]],2,FALSE)","v":"South Africa"},"4 to 6 hours a day",10,"USA"]
[null,"ID1608","2012-06-02T01:29:04","â‚¬ 50k",50000,"EUR",{"$f":"Data!$E1274*VLOOKUP(Data!$F1274,tblXrate[],2,FALSE)","v":103000},"Controller","Controller","Netherlands",{"$f":"VLOOKUP(Data!$J1274,tblCountries[[Actual]:[Mapping]],2,FALSE)","v":"USA"},"4 to 6 hours a day",10,"Netherlands"]
[null,"ID1617","2012-06-02T06:21:45",32884.800000000003,32884,"USD",{"$f":"Data!$E1282*VLOOKUP(Data!$F1282,tblXrate[],2,FALSE)","v":24000},"Administrative Assistant","Analyst","USA",{"$f":"VLOOKUP(Data!$J1282,tblCountries[[Actual]:[Mapping]],2,FALSE)","v":"Russia"},"All the 8 hours baby, all the 8!",10,"USA"]
[null,"ID1642","2012-06-03T12:16:15",54000,54000,"USD",{"$f":"Data!$E1299*VLOOKUP(Data!$F1299,tblXrate[],2,FALSE)","v":90000},"assistant director of finance","CXO or Top Mgmt.","USA",{"$f":"VLOOKUP(Data!$J1299,tblCountries[[Actual]:[Mapping]],2,FALSE)","v":"USA"},"4 to 6 hours a day",10,"USA"]
[null,"ID1669","2012-06-04T23:18:41",85000,85000,"USD",{"$f":"Data!$E1322*VLOOKUP(Data!$F1322,tblXrate[],2,FALSE)","v":90000},"Sr Manager","Manager","USA",{"$f":"VLOOKUP(Data!$J1322,tblCountries[[Actual]:[Mapping]],2,FALSE)","v":"USA"},"All the 8 hours baby, all the 8!",10,"USA"]
[null,"ID1675","2012-06-05T02:21:01",75000,75000,"USD",{"$f":"Data!$E1326*VLOOKUP(Data!$F1326,tblXrate[],2,FALSE)","v":150000},"Accountant","Accountant","USA",{"$f":"VLOOKUP(Data!$J1326,tblCountries[[Actual]:[Mapping]],2,FALSE)","v":"USA"},"4 to 6 hours a day",10,"USA"]
[null,"ID1695","2012-06-05T21:49:10",50000,50000,"GBP",{"$f":"Data!$E1338*VLOOKUP(Data!$F1338,tblXrate[],2,FALSE)","v":39404.456801682099},"Commercial Director","CXO or Top Mgmt.","UK",{"$f":"VLOOKUP(Data!$J1338,tblCountries[[Actual]:[Mapping]],2,FALSE)","v":"UK"},"4 to 6 hours a day",10,"UK"]
[null,"ID1744","2012-06-08T02:27:13",88000,88000,"USD",{"$f":"Data!$E1378*VLOOKUP(Data!$F1378,tblXrate[],2,FALSE)","v":4320},"Senior Fiancial Analyst","Analyst","USA",{"$f":"VLOOKUP(Data!$J1378,tblCountries[[Actual]:[Mapping]],2,FALSE)","v":"India"},"All the 8 hours baby, all the 8!",10,"USA"]
[null,"ID1778","2012-06-10T12:31:48",125000,125000,"USD",{"$f":"Data!$E1407*VLOOKUP(Data!$F1407,tblXrate[],2,FALSE)","v":125000},"project manager","Manager","USA",{"$f":"VLOOKUP(Data!$J1407,tblCountries[[Actual]:[Mapping]],2,FALSE)","v":"USA"},"All the 8 hours baby, all the 8!",10,"USA"]
[null,"ID1803","2012-06-12T02:59:16",65000,65000,"USD",{"$f":"Data!$E1427*VLOOKUP(Data!$F1427,tblXrate[],2,FALSE)","v":67000},"Data Analyst","Analyst","USA",{"$f":"VLOOKUP(Data!$J1427,tblCountries[[Actual]:[Mapping]],2,FALSE)","v":"USA"},"2 to 3 hours per day",10,"USA"]
[null,"ID1806","2012-06-12T06:36:12",63000,63000,"USD",{"$f":"Data!$E1430*VLOOKUP(Data!$F1430,tblXrate[],2,FALSE)","v":59001.691381819612},"Sales Analyst","Analyst","USA",{"$f":"VLOOKUP(Data!$J1430,tblCountries[[Actual]:[Mapping]],2,FALSE)","v":"Canada"},"All the 8 hours baby, all the 8!",10,"USA"]
[null,"ID1833","2012-06-13T18:25:00","INR 10 lacs p.a.",1000000,"INR",{"$f":"Data!$E1454*VLOOKUP(Data!$F1454,tblXrate[],2,FALSE)","v":92000},"Mnanager- Customer Project finance & recovery","Manager","India",{"$f":"VLOOKUP(Data!$J1454,tblCountries[[Actual]:[Mapping]],2,FALSE)","v":"USA"},"2 to 3 hours per day",10,"India"]
[null,"ID1838","2012-06-13T23:32:36",50000,50000,"GBP",{"$f":"Data!$E1459*VLOOKUP(Data!$F1459,tblXrate[],2,FALSE)","v":96000},"Assistant Financial Accountant","Accountant","UK",{"$f":"VLOOKUP(Data!$J1459,tblCountries[[Actual]:[Mapping]],2,FALSE)","v":"USA"},"2 to 3 hours per day",10,"UK"]
[null,"ID1861","2012-06-15T16:36:47",1400000,1400000,"INR",{"$f":"Data!$E1476*VLOOKUP(Data!$F1476,tblXrate[],2,FALSE)","v":88502.537072729421},"Manager - Controlling","Manager","India",{"$f":"VLOOKUP(Data!$J1476,tblCountries[[Actual]:[Mapping]],2,FALSE)","v":"Canada"},"4 to 6 hours a day",10,"India"]
[null,"ID1863","2012-06-15T17:35:32",20000,20000,"GBP",{"$f":"Data!$E1478*VLOOKUP(Data!$F1478,tblXrate[],2,FALSE)","v":46584},"Accountant","Accountant","UK",{"$f":"VLOOKUP(Data!$J1478,tblCountries[[Actual]:[Mapping]],2,FALSE)","v":"USA"},"2 to 3 hours per day",10,"UK"]
[null,"ID1864","2012-06-15T17:36:10","INR 1000000",1000000,"INR",{"$f":"Data!$E1479*VLOOKUP(Data!$F1479,tblXrate[],2,FALSE)","v":67000},"Sr.Manager","Manager","India",{"$f":"VLOOKUP(Data!$J1479,tblCountries[[Actual]:[Mapping]],2,FALSE)","v":"USA"},"All the 8 hours baby, all the 8!",10,"India"]
[null,"ID1869","2012-06-15T22:36:45",72000,72000,"USD",{"$f":"Data!$E1482*VLOOKUP(Data!$F1482,tblXrate[],2,FALSE)","v":75000},"HR Supervisor","Manager","USA",{"$f":"VLOOKUP(Data!$J1482,tblCountries[[Actual]:[Mapping]],2,FALSE)","v":"USA"},"4 to 6 hours a day",10,"USA"]
[null,"ID1870","2012-06-15T23:21:00",60000,60000,"USD",{"$f":"Data!$E1483*VLOOKUP(Data!$F1483,tblXrate[],2,FALSE)","v":3205.4250037396623},"Marketing Initatities Analyst","Analyst","USA",{"$f":"VLOOKUP(Data!$J1483,tblCountries[[Actual]:[Mapping]],2,FALSE)","v":"India"},"All the 8 hours baby, all the 8!",10,"USA"]
[null,"ID1887","2012-06-17T12:48:52",5000,5000,"USD",{"$f":"Data!$E1497*VLOOKUP(Data!$F1497,tblXrate[],2,FALSE)","v":60000},"admin","Analyst","India",{"$f":"VLOOKUP(Data!$J1497,tblCountries[[Actual]:[Mapping]],2,FALSE)","v":"USA"},"2 to 3 hours per day",10,"India"]
[null,"ID1897","2012-06-19T01:49:49","60k usd",60000,"USD",{"$f":"Data!$E1505*VLOOKUP(Data!$F1505,tblXrate[],2,FALSE)","v":3419.1200039889732},"buyer","Manager","Canada",{"$f":"VLOOKUP(Data!$J1505,tblCountries[[Actual]:[Mapping]],2,FALSE)","v":"India"},"2 to 3 hours per day",10,"Canada"]
[null,"ID1908","2012-06-19T20:35:35",25000,25000,"USD",{"$f":"Data!$E1514*VLOOKUP(Data!$F1514,tblXrate[],2,FALSE)","v":41000},"Team Lead","Manager","India",{"$f":"VLOOKUP(Data!$J1514,tblCountries[[Actual]:[Mapping]],2,FALSE)","v":"USA"},"4 to 6 hours a day",10,"India"]
[null,"ID1919","2012-06-20T02:31:52",110000,110000,"USD",{"$f":"Data!$E1524*VLOOKUP(Data!$F1524,tblXrate[],2,FALSE)","v":80000},"Vice President - Finance","CXO or Top Mgmt.","USA",{"$f":"VLOOKUP(Data!$J1524,tblCountries[[Actual]:[Mapping]],2,FALSE)","v":"USA"},"4 to 6 hours a day",10,"USA"]
[null,"ID1932","2012-06-21T04:46:24",70000,70000,"USD",{"$f":"Data!$E1532*VLOOKUP(Data!$F1532,tblXrate[],2,FALSE)","v":52500},"Administrative Coordinator","Analyst","USA",{"$f":"VLOOKUP(Data!$J1532,tblCountries[[Actual]:[Mapping]],2,FALSE)","v":"USA"},"4 to 6 hours a day",10,"USA"]
[null,"ID0593","2012-05-26T08:10:43",8000,96000,"CNY",{"$f":"Data!$E1627*VLOOKUP(Data!$F1627,tblXrate[],2,FALSE)","v":100000},"finance","Accountant","china","Other Countries","4 to 6 hours a day",10,"china"]
[null,"ID0594","2012-05-26T08:17:53","$36 000",36000,"USD",{"$f":"Data!$E1628*VLOOKUP(Data!$F1628,tblXrate[],2,FALSE)","v":3800},"Consulting","Consultant","Russia","Other Countries","All the 8 hours baby, all the 8!",10,"Russia"]
[null,"ID0689","2012-05-26T13:18:32","33,500 US $",33500,"USD",{"$f":"Data!$E1638*VLOOKUP(Data!$F1638,tblXrate[],2,FALSE)","v":170000},"Sr. Executive Finance & Accounts","Accountant","Dubai","Other Countries","1 or 2 hours a day",10,"Dubai"]
[null,"ID0734","2012-05-26T15:24:32",5000,60000,"USD",{"$f":"Data!$E1644*VLOOKUP(Data!$F1644,tblXrate[],2,FALSE)","v":67775.665698893223},"Manager","Manager","Russia","Other Countries","4 to 6 hours a day",10,"Russia"]
[null,"ID0797","2012-05-26T20:57:17",15000,15000,"EUR",{"$f":"Data!$E1657*VLOOKUP(Data!$F1657,tblXrate[],2,FALSE)","v":9616.275011218986},"Technician","Analyst","Spain","Other Countries","2 to 3 hours per day",10,"Spain"]
[null,"ID0841","2012-05-27T00:07:52",6000,6000,"USD",{"$f":"Data!$E1666*VLOOKUP(Data!$F1666,tblXrate[],2,FALSE)","v":13355.937515581925},"Analysis Quality","Analyst","Colombia - South America","Other Countries","1 or 2 hours a day",10,"Colombia"]
[null,"ID0862","2012-05-27T04:05:28",35000,35000,"USD",{"$f":"Data!$E1668*VLOOKUP(Data!$F1668,tblXrate[],2,FALSE)","v":70000},"Purchasing Manager","Manager","Uruguay","Other Countries","All the 8 hours baby, all the 8!",10,"Uruguay"]
[null,"ID0893","2012-05-27T13:52:53","100,000 usd",100000,"USD",{"$f":"Data!$E1682*VLOOKUP(Data!$F1682,tblXrate[],2,FALSE)","v":52000},"Director","CXO or Top Mgmt.","MÃ©xico","Other Countries","All the 8 hours baby, all the 8!",10,"Mexico"]
[null,"ID0901","2012-05-27T15:01:02","PhP168000",168000,"PHP",{"$f":"Data!$E1683*VLOOKUP(Data!$F1683,tblXrate[],2,FALSE)","v":51613},"Clerk","Analyst","Philippines","Other Countries","4 to 6 hours a day",10,"Philippines"]
[null,"ID0910","2012-05-27T16:10:27",60000,60000,"USD",{"$f":"Data!$E1685*VLOOKUP(Data!$F1685,tblXrate[],2,FALSE)","v":115000},"Cost accountant","Accountant","Singapore","Other Countries","All the 8 hours baby, all the 8!",10,"Singapore"]
[null,"ID0962","2012-05-28T05:09:12","NZ$ 75000",75000,"NZD",{"$f":"Data!$E1704*VLOOKUP(Data!$F1704,tblXrate[],2,FALSE)","v":19588.708356186824},"Information Analyst","Analyst","New  Zealand","Other Countries","4 to 6 hours a day",10,"New Zealand"]
[null,"ID1040","2012-05-28T13:26:22",55,55000,"NZD",{"$f":"Data!$E1718*VLOOKUP(Data!$F1718,tblXrate[],2,FALSE)","v":59894.774338556796},"Financial Analyst","Analyst","New Zealand","Other Countries","All the 8 hours baby, all the 8!",10,"New Zealand"]
[null,"ID1053","2012-05-28T14:12:50",43500,43500,"EUR",{"$f":"Data!$E1722*VLOOKUP(Data!$F1722,tblXrate[],2,FALSE)","v":45000},"RRHH","Manager","SPAIN","Other Countries","2 to 3 hours per day",10,"Spain"]
[null,"ID1060","2012-05-28T14:32:11",120000,120000,"ZAR",{"$f":"Data!$E1725*VLOOKUP(Data!$F1725,tblXrate[],2,FALSE)","v":68835.306612122877},"VP","CXO or Top Mgmt.","South Africa","Other Countries","4 to 6 hours a day",10,"South Africa"]
[null,"ID1109","2012-05-28T16:41:27",40000,40000,"EUR",{"$f":"Data!$E1729*VLOOKUP(Data!$F1729,tblXrate[],2,FALSE)","v":50000},"Actuary","Accountant","Portugal","Other Countries","2 to 3 hours per day",10,"Portugal"]
[null,"ID1186","2012-05-28T22:58:25",48000,48000,"USD",{"$f":"Data!$E1749*VLOOKUP(Data!$F1749,tblXrate[],2,FALSE)","v":84000},"Cost Controlling Executive","Controller","Qatar","Other Countries","2 to 3 hours per day",10,"Qatar"]
[null,"ID1192","2012-05-28T23:13:31","5000  PLN   net",60000,"PLN",{"$f":"Data!$E1752*VLOOKUP(Data!$F1752,tblXrate[],2,FALSE)","v":67360.264327577388},"Sales Analyst","Analyst","Poland","Other Countries","All the 8 hours baby, all the 8!",10,"Poland"]
[null,"ID1249","2012-05-29T05:11:03","USD72000",72000,"USD",{"$f":"Data!$E1766*VLOOKUP(Data!$F1766,tblXrate[],2,FALSE)","v":70000},"Markets Adviser","Consultant","New Zealand","Other Countries","2 to 3 hours per day",10,"New Zealand"]
[null,"ID1283","2012-05-29T11:00:32",85000,85000,"USD",{"$f":"Data!$E1773*VLOOKUP(Data!$F1773,tblXrate[],2,FALSE)","v":200000},"manager operation","Manager","srilanka","Other Countries","All the 8 hours baby, all the 8!",10,"Sri Lanka"]
[null,"ID1291","2012-05-29T12:28:41",15000,15000,"USD",{"$f":"Data!$E1774*VLOOKUP(Data!$F1774,tblXrate[],2,FALSE)","v":62564.631571458704},"Monitoring & Evaluation officer","Manager","Myanmar","Other Countries","4 to 6 hours a day",10,"Myanmar"]
[null,"ID1310","2012-05-29T14:55:21","36K",36000,"USD",{"$f":"Data!$E1778*VLOOKUP(Data!$F1778,tblXrate[],2,FALSE)","v":220664.95808941979},"Administrative Assistant","Analyst","Kuwait","Other Countries","2 to 3 hours per day",10,"Kuwait"]
[null,"ID1323","2012-05-29T15:46:17","about 24.000 â‚¬",24000,"EUR",{"$f":"Data!$E1782*VLOOKUP(Data!$F1782,tblXrate[],2,FALSE)","v":46000},"Controller","Controller","Italy","Other Countries","4 to 6 hours a day",10,"italy"]
[null,"ID1325","2012-05-29T15:51:21","82000 USD",82000,"USD",{"$f":"Data!$E1783*VLOOKUP(Data!$F1783,tblXrate[],2,FALSE)","v":6368.453230079479},"Consultant","Consultant","South Africa","Other Countries","4 to 6 hours a day",10,"South Africa"]
[null,"ID1471","2012-05-30T16:48:32",1700,20400,"USD",{"$f":"Data!$E1804*VLOOKUP(Data!$F1804,tblXrate[],2,FALSE)","v":14000},"M & E Officer","Manager","Myanmar [Burma]","Other Countries","1 or 2 hours a day",10,"Myanmar"]
[null,"ID1482","2012-05-30T18:51:57",60000,60000,"USD",{"$f":"Data!$E1807*VLOOKUP(Data!$F1807,tblXrate[],2,FALSE)","v":41160.941823328096},"sales&marketing","Analyst","turkey","Other Countries","2 to 3 hours per day",10,"Turkey"]
[null,"ID1598","2012-06-01T19:46:33","21000EUR",21000,"EUR",{"$f":"Data!$E1832*VLOOKUP(Data!$F1832,tblXrate[],2,FALSE)","v":78000},"Coordenador PeÃ§as Grupo","Manager","Portugal","Other Countries","4 to 6 hours a day",10,"Portugal"]
[null,"ID1639","2012-06-03T09:42:40",75000,75000,"NZD",{"$f":"Data!$E1840*VLOOKUP(Data!$F1840,tblXrate[],2,FALSE)","v":36000},"business support analyst","Analyst","New zealand","Other Countries","2 to 3 hours per day",10,"New Zealand"]
[null,"ID1829","2012-06-13T05:20:32","1600â‚¬ net monthly",19200,"EUR",{"$f":"Data!$E1870*VLOOKUP(Data!$F1870,tblXrate[],2,FALSE)","v":7500},"bank clerk","Analyst","italy","Other Countries","4 to 6 hours a day",10,"italy"]
[null,"ID1868","2012-06-15T21:32:16","$US16.110,72",16110,"USD",{"$f":"Data!$E1878*VLOOKUP(Data!$F1878,tblXrate[],2,FALSE)","v":55500},"INFORMATION ANALIST","Analyst","COLOMBIA","Other Countries","All the 8 hours baby, all the 8!",10,"Colombia"]
[null,"ID1873","2012-06-16T05:23:03",38666,38666,"USD",{"$f":"Data!$E1879*VLOOKUP(Data!$F1879,tblXrate[],2,FALSE)","v":19055.991584874118},"Actuarial Specialist","Specialist","South Africa","Other Countries","All the 8 hours baby, all the 8!",10,"South Africa"]
[null,"ID0568","2012-05-26T06:46:03","95000 USD",95000,"USD",{"$f":"Data!$E470*VLOOKUP(Data!$F470,tblXrate[],2,FALSE)","v":36252.100257547536},"Business Analyst","Analyst","Australia",{"$f":"VLOOKUP(Data!$J470,tblCountries[[Actual]:[Mapping]],2,FALSE)","v":"UK"},"2 to 3 hours per day",11,"Australia"]
[null,"ID0572","2012-05-26T06:50:23",38000,38000,"USD",{"$f":"Data!$E472*VLOOKUP(Data!$F472,tblXrate[],2,FALSE)","v":5342.3750062327708},"Costing Analysis","Analyst","USA",{"$f":"VLOOKUP(Data!$J472,tblCountries[[Actual]:[Mapping]],2,FALSE)","v":"India"},"All the 8 hours baby, all the 8!",11,"USA"]
[null,"ID0646","2012-05-26T11:50:34","6,00,000",600000,"INR",{"$f":"Data!$E538*VLOOKUP(Data!$F538,tblXrate[],2,FALSE)","v":10000},"Organiser","Manager","India",{"$f":"VLOOKUP(Data!$J538,tblCountries[[Actual]:[Mapping]],2,FALSE)","v":"Indonesia"},"4 to 6 hours a day",11,"India"]
[null,"ID0661","2012-05-26T12:28:11","INR 165000",165000,"INR",{"$f":"Data!$E551*VLOOKUP(Data!$F551,tblXrate[],2,FALSE)","v":28000},"Co-operative bank","Manager","India",{"$f":"VLOOKUP(Data!$J551,tblCountries[[Actual]:[Mapping]],2,FALSE)","v":"Poland"},"All the 8 hours baby, all the 8!",11,"India"]
[null,"ID0769","2012-05-26T17:31:56","95000 AUD",95000,"AUD",{"$f":"Data!$E639*VLOOKUP(Data!$F639,tblXrate[],2,FALSE)","v":67000},"Data Analyst - Report Writer","Analyst","Australia",{"$f":"VLOOKUP(Data!$J639,tblCountries[[Actual]:[Mapping]],2,FALSE)","v":"USA"},"2 to 3 hours per day",11,"Australia"]
[null,"ID0779","2012-05-26T18:41:31","Rs 40000",480000,"INR",{"$f":"Data!$E646*VLOOKUP(Data!$F646,tblXrate[],2,FALSE)","v":125000},"Banker","Manager","India",{"$f":"VLOOKUP(Data!$J646,tblCountries[[Actual]:[Mapping]],2,FALSE)","v":"Norway"},"4 to 6 hours a day",11,"India"]
[null,"ID0948","2012-05-28T00:36:20","INR 600K",600000,"INR",{"$f":"Data!$E766*VLOOKUP(Data!$F766,tblXrate[],2,FALSE)","v":16027.125018698311},"Asst. Mgr. Finance","Analyst","India",{"$f":"VLOOKUP(Data!$J766,tblCountries[[Actual]:[Mapping]],2,FALSE)","v":"India"},"4 to 6 hours a day",11,"India"]
[null,"ID1227","2012-05-29T01:44:03",100000,100000,"USD",{"$f":"Data!$E977*VLOOKUP(Data!$F977,tblXrate[],2,FALSE)","v":8547.8000099724322},"Finance Manager","Manager","USA",{"$f":"VLOOKUP(Data!$J977,tblCountries[[Actual]:[Mapping]],2,FALSE)","v":"India"},"4 to 6 hours a day",11,"USA"]
[null,"ID1440","2012-05-30T08:05:16","AUD55,000",55000,"AUD",{"$f":"Data!$E1146*VLOOKUP(Data!$F1146,tblXrate[],2,FALSE)","v":72571.80269935554},"PA","Analyst","Australia",{"$f":"VLOOKUP(Data!$J1146,tblCountries[[Actual]:[Mapping]],2,FALSE)","v":"Singapore"},"2 to 3 hours per day",11,"Australia"]
[null,"ID1469","2012-05-30T16:12:34","Rs. 200000",200000,"INR",{"$f":"Data!$E1169*VLOOKUP(Data!$F1169,tblXrate[],2,FALSE)","v":80442},"Executive","Analyst","India",{"$f":"VLOOKUP(Data!$J1169,tblCountries[[Actual]:[Mapping]],2,FALSE)","v":"USA"},"4 to 6 hours a day",11,"India"]
[null,"ID1530","2012-05-31T09:28:05",38000,38000,"USD",{"$f":"Data!$E1215*VLOOKUP(Data!$F1215,tblXrate[],2,FALSE)","v":101990.96564026357},"Accountant","Accountant","USA",{"$f":"VLOOKUP(Data!$J1215,tblCountries[[Actual]:[Mapping]],2,FALSE)","v":"Australia"},"4 to 6 hours a day",11,"USA"]
[null,"ID1735","2012-06-07T16:53:54",10000,10000,"USD",{"$f":"Data!$E1369*VLOOKUP(Data!$F1369,tblXrate[],2,FALSE)","v":68835.306612122877},"AGM - Operations & Customer Support","Manager","India",{"$f":"VLOOKUP(Data!$J1369,tblCountries[[Actual]:[Mapping]],2,FALSE)","v":"Canada"},"4 to 6 hours a day",11,"India"]
[null,"ID1765","2012-06-08T23:20:36",71500,71500,"USD",{"$f":"Data!$E1397*VLOOKUP(Data!$F1397,tblXrate[],2,FALSE)","v":157617.8272067284},"Pricing Manager","Manager","USA",{"$f":"VLOOKUP(Data!$J1397,tblCountries[[Actual]:[Mapping]],2,FALSE)","v":"UK"},"All the 8 hours baby, all the 8!",11,"USA"]
[null,"ID0880","2012-05-27T12:32:45","62000 USD",62000,"USD",{"$f":"Data!$E1677*VLOOKUP(Data!$F1677,tblXrate[],2,FALSE)","v":5342.3750062327708},"Deputy Manager Finance","Manager","Qatar","Other Countries","All the 8 hours baby, all the 8!",11,"Qatar"]
[null,"ID0920","2012-05-27T19:39:26",104000,104000,"AED",{"$f":"Data!$E1688*VLOOKUP(Data!$F1688,tblXrate[],2,FALSE)","v":72000},"Financial Analyst","Analyst","UAE","Other Countries","4 to 6 hours a day",11,"UAE"]
[null,"ID1100","2012-05-28T16:19:21",37000,37000,"EUR",{"$f":"Data!$E1727*VLOOKUP(Data!$F1727,tblXrate[],2,FALSE)","v":2225.989585930321},"Project Control Analyst","Analyst","Spain","Other Countries","4 to 6 hours a day",11,"Spain"]
[null,"ID1665","2012-06-04T19:46:09","2600 $",31200,"USD",{"$f":"Data!$E1843*VLOOKUP(Data!$F1843,tblXrate[],2,FALSE)","v":82575.963534454509},"Economist","Reporting","ISRAEL","Other Countries","All the 8 hours baby, all the 8!",11,"Israel"]
[null,"ID0630","2012-05-26T11:10:23","Rs60000",720000,"INR",{"$f":"Data!$E522*VLOOKUP(Data!$F522,tblXrate[],2,FALSE)","v":75000},"Quantity Surveyor","Manager","India",{"$f":"VLOOKUP(Data!$J522,tblCountries[[Actual]:[Mapping]],2,FALSE)","v":"USA"},"4 to 6 hours a day",12,"India"]
[null,"ID0632","2012-05-26T11:26:46",60000,60000,"USD",{"$f":"Data!$E524*VLOOKUP(Data!$F524,tblXrate[],2,FALSE)","v":5320},"business analyst","Analyst","USA",{"$f":"VLOOKUP(Data!$J524,tblCountries[[Actual]:[Mapping]],2,FALSE)","v":"India"},"4 to 6 hours a day",12,"USA"]
[null,"ID0662","2012-05-26T12:30:22",1400,16800,"USD",{"$f":"Data!$E552*VLOOKUP(Data!$F552,tblXrate[],2,FALSE)","v":4400},"Assistant","Analyst","Pakistan",{"$f":"VLOOKUP(Data!$J552,tblCountries[[Actual]:[Mapping]],2,FALSE)","v":"Latin America"},"4 to 6 hours a day",12,"Pakistan"]
[null,"ID0732","2012-05-26T15:09:27","Ind Rs.10,00,000.00",1000000,"INR",{"$f":"Data!$E611*VLOOKUP(Data!$F611,tblXrate[],2,FALSE)","v":80000},"Sr Associate","Analyst","India",{"$f":"VLOOKUP(Data!$J611,tblCountries[[Actual]:[Mapping]],2,FALSE)","v":"USA"},"2 to 3 hours per day",12,"India"]
[null,"ID0745","2012-05-26T16:05:02",10000,10000,"USD",{"$f":"Data!$E620*VLOOKUP(Data!$F620,tblXrate[],2,FALSE)","v":4000},"Reporting Analyst","Analyst","India",{"$f":"VLOOKUP(Data!$J620,tblCountries[[Actual]:[Mapping]],2,FALSE)","v":"India"},"4 to 6 hours a day",12,"India"]
[null,"ID0784","2012-05-26T19:22:53","AUS$36000",36000,"USD",{"$f":"Data!$E650*VLOOKUP(Data!$F650,tblXrate[],2,FALSE)","v":55000},"Key Expert User","Manager","Australia",{"$f":"VLOOKUP(Data!$J650,tblCountries[[Actual]:[Mapping]],2,FALSE)","v":"Israel"},"2 to 3 hours per day",12,"Australia"]
[null,"ID0789","2012-05-26T20:08:21",10000,10000,"USD",{"$f":"Data!$E655*VLOOKUP(Data!$F655,tblXrate[],2,FALSE)","v":87734.690296543267},"BDM","Manager","India",{"$f":"VLOOKUP(Data!$J655,tblCountries[[Actual]:[Mapping]],2,FALSE)","v":"New Zealand"},"1 or 2 hours a day",12,"India"]
[null,"ID0820","2012-05-26T22:43:11","Â£55000",55000,"GBP",{"$f":"Data!$E681*VLOOKUP(Data!$F681,tblXrate[],2,FALSE)","v":12465.541681209797},"Financial controller","Controller","UK",{"$f":"VLOOKUP(Data!$J681,tblCountries[[Actual]:[Mapping]],2,FALSE)","v":"India"},"4 to 6 hours a day",12,"UK"]
[null,"ID0876","2012-05-27T10:13:27",87456,87456,"USD",{"$f":"Data!$E721*VLOOKUP(Data!$F721,tblXrate[],2,FALSE)","v":149907.13380100971},"qa team supervisor ","Manager","USA",{"$f":"VLOOKUP(Data!$J721,tblCountries[[Actual]:[Mapping]],2,FALSE)","v":"Europe"},"2 to 3 hours per day",12,"USA"]
[null,"ID1042","2012-05-28T13:37:10",600000,600000,"INR",{"$f":"Data!$E836*VLOOKUP(Data!$F836,tblXrate[],2,FALSE)","v":80000},"Business Analyst","Analyst","India",{"$f":"VLOOKUP(Data!$J836,tblCountries[[Actual]:[Mapping]],2,FALSE)","v":"USA"},"All the 8 hours baby, all the 8!",12,"India"]
[null,"ID1076","2012-05-28T15:21:51","Â£50",50000,"GBP",{"$f":"Data!$E861*VLOOKUP(Data!$F861,tblXrate[],2,FALSE)","v":33900},"Production manager","Manager","UK",{"$f":"VLOOKUP(Data!$J861,tblCountries[[Actual]:[Mapping]],2,FALSE)","v":"USA"},"2 to 3 hours per day",12,"UK"]
[null,"ID1188","2012-05-28T23:02:08",75000,75000,"USD",{"$f":"Data!$E947*VLOOKUP(Data!$F947,tblXrate[],2,FALSE)","v":6000},"Financial Analyst","Analyst","USA",{"$f":"VLOOKUP(Data!$J947,tblCountries[[Actual]:[Mapping]],2,FALSE)","v":"Colombia"},"4 to 6 hours a day",12,"USA"]
[null,"ID1215","2012-05-29T00:29:32",60000,60000,"USD",{"$f":"Data!$E967*VLOOKUP(Data!$F967,tblXrate[],2,FALSE)","v":26678.388218823762},"sample manager","Manager","USA",{"$f":"VLOOKUP(Data!$J967,tblCountries[[Actual]:[Mapping]],2,FALSE)","v":"Portugal"},"4 to 6 hours a day",12,"USA"]
[null,"ID1266","2012-05-29T08:59:41",107000,107000,"USD",{"$f":"Data!$E1005*VLOOKUP(Data!$F1005,tblXrate[],2,FALSE)","v":140000},"Certified Public Accountant","Accountant","USA",{"$f":"VLOOKUP(Data!$J1005,tblCountries[[Actual]:[Mapping]],2,FALSE)","v":"USA"},"4 to 6 hours a day",12,"USA"]
[null,"ID1288","2012-05-29T12:17:07",18000,18000,"USD",{"$f":"Data!$E1022*VLOOKUP(Data!$F1022,tblXrate[],2,FALSE)","v":159105.90639881117},"Manager","Manager","India",{"$f":"VLOOKUP(Data!$J1022,tblCountries[[Actual]:[Mapping]],2,FALSE)","v":"Australia"},"4 to 6 hours a day",12,"India"]
[null,"ID1292","2012-05-29T12:29:12","us $ 14000",14000,"USD",{"$f":"Data!$E1025*VLOOKUP(Data!$F1025,tblXrate[],2,FALSE)","v":48000},"Pricing Analyst","Analyst","India",{"$f":"VLOOKUP(Data!$J1025,tblCountries[[Actual]:[Mapping]],2,FALSE)","v":"USA"},"4 to 6 hours a day",12,"India"]
[null,"ID1296","2012-05-29T13:15:17",140000,140000,"USD",{"$f":"Data!$E1027*VLOOKUP(Data!$F1027,tblXrate[],2,FALSE)","v":12000},"Senior Accountant","Accountant","USA",{"$f":"VLOOKUP(Data!$J1027,tblCountries[[Actual]:[Mapping]],2,FALSE)","v":"UAE"},"4 to 6 hours a day",12,"USA"]
[null,"ID1365","2012-05-29T19:23:32",60000,60000,"USD",{"$f":"Data!$E1078*VLOOKUP(Data!$F1078,tblXrate[],2,FALSE)","v":23000},"Business Information Analyst","Analyst","USA",{"$f":"VLOOKUP(Data!$J1078,tblCountries[[Actual]:[Mapping]],2,FALSE)","v":"Saudi Arabia"},"All the 8 hours baby, all the 8!",12,"USA"]
[null,"ID1383","2012-05-29T21:33:42","$83000 USD ",83000,"USD",{"$f":"Data!$E1093*VLOOKUP(Data!$F1093,tblXrate[],2,FALSE)","v":50000},"Senior Planning Analyst","Analyst","Canada",{"$f":"VLOOKUP(Data!$J1093,tblCountries[[Actual]:[Mapping]],2,FALSE)","v":"USA"},"4 to 6 hours a day",12,"Canada"]
[null,"ID1420","2012-05-30T00:50:03",81000,81000,"USD",{"$f":"Data!$E1126*VLOOKUP(Data!$F1126,tblXrate[],2,FALSE)","v":31200},"Finance & IT Manager","Manager","USA",{"$f":"VLOOKUP(Data!$J1126,tblCountries[[Actual]:[Mapping]],2,FALSE)","v":"USA"},"1 or 2 hours a day",12,"USA"]
[null,"ID1429","2012-05-30T01:52:33",61000,61000,"USD",{"$f":"Data!$E1135*VLOOKUP(Data!$F1135,tblXrate[],2,FALSE)","v":60000},"Treasury Analyst","Analyst","USA",{"$f":"VLOOKUP(Data!$J1135,tblCountries[[Actual]:[Mapping]],2,FALSE)","v":"USA"},"4 to 6 hours a day",12,"USA"]
[null,"ID1466","2012-05-30T14:28:57","Rs. 1150000/-",1150000,"INR",{"$f":"Data!$E1166*VLOOKUP(Data!$F1166,tblXrate[],2,FALSE)","v":4487.5950052355274},"Project Manager","Manager","India",{"$f":"VLOOKUP(Data!$J1166,tblCountries[[Actual]:[Mapping]],2,FALSE)","v":"India"},"All the 8 hours baby, all the 8!",12,"India"]
[null,"ID1488","2012-05-30T20:19:51",64000,64000,"USD",{"$f":"Data!$E1183*VLOOKUP(Data!$F1183,tblXrate[],2,FALSE)","v":100000},"Program Manager","Manager","USA",{"$f":"VLOOKUP(Data!$J1183,tblCountries[[Actual]:[Mapping]],2,FALSE)","v":"Uganda"},"2 to 3 hours per day",12,"USA"]
[null,"ID1600","2012-06-01T19:57:45","Â£80000",80000,"GBP",{"$f":"Data!$E1266*VLOOKUP(Data!$F1266,tblXrate[],2,FALSE)","v":21369.500024931083},"Owner of Business Improvement Consultancy","Consultant","UK",{"$f":"VLOOKUP(Data!$J1266,tblCountries[[Actual]:[Mapping]],2,FALSE)","v":"India"},"4 to 6 hours a day",12,"UK"]
[null,"ID1604","2012-06-01T20:38:57",10000,10000,"USD",{"$f":"Data!$E1270*VLOOKUP(Data!$F1270,tblXrate[],2,FALSE)","v":52500},"dgm","Manager","India",{"$f":"VLOOKUP(Data!$J1270,tblCountries[[Actual]:[Mapping]],2,FALSE)","v":"South Africa"},"All the 8 hours baby, all the 8!",12,"India"]
[null,"ID1605","2012-06-01T20:53:08",50000,50000,"USD",{"$f":"Data!$E1271*VLOOKUP(Data!$F1271,tblXrate[],2,FALSE)","v":150000},"Catalog Circulation Analyst","Analyst","USA",{"$f":"VLOOKUP(Data!$J1271,tblCountries[[Actual]:[Mapping]],2,FALSE)","v":"USA"},"All the 8 hours baby, all the 8!",12,"USA"]
[null,"ID1619","2012-06-02T06:43:25",68000,68000,"USD",{"$f":"Data!$E1284*VLOOKUP(Data!$F1284,tblXrate[],2,FALSE)","v":50000},"Supply Chain Analyst","Analyst","USA",{"$f":"VLOOKUP(Data!$J1284,tblCountries[[Actual]:[Mapping]],2,FALSE)","v":"India"},"4 to 6 hours a day",12,"USA"]
[null,"ID1626","2012-06-02T19:14:35",140000,140000,"USD",{"$f":"Data!$E1289*VLOOKUP(Data!$F1289,tblXrate[],2,FALSE)","v":63835.220018725006},"sr manager","Manager","USA",{"$f":"VLOOKUP(Data!$J1289,tblCountries[[Actual]:[Mapping]],2,FALSE)","v":"UK"},"4 to 6 hours a day",12,"USA"]
[null,"ID1668","2012-06-04T23:00:10",92000,92000,"USD",{"$f":"Data!$E1321*VLOOKUP(Data!$F1321,tblXrate[],2,FALSE)","v":50000},"BI director","Reporting","USA",{"$f":"VLOOKUP(Data!$J1321,tblCountries[[Actual]:[Mapping]],2,FALSE)","v":"India"},"2 to 3 hours per day",12,"USA"]
[null,"ID1688","2012-06-05T19:14:04",62000,62000,"USD",{"$f":"Data!$E1334*VLOOKUP(Data!$F1334,tblXrate[],2,FALSE)","v":245840.3807575817},"Quality Engineer","Engineer","USA",{"$f":"VLOOKUP(Data!$J1334,tblCountries[[Actual]:[Mapping]],2,FALSE)","v":"Canada"},"2 to 3 hours per day",12,"USA"]
[null,"ID1694","2012-06-05T21:33:47",85000,85000,"USD",{"$f":"Data!$E1337*VLOOKUP(Data!$F1337,tblXrate[],2,FALSE)","v":109130.33323508203},"Financial Analyst","Analyst","USA",{"$f":"VLOOKUP(Data!$J1337,tblCountries[[Actual]:[Mapping]],2,FALSE)","v":"Australia"},"4 to 6 hours a day",12,"USA"]
[null,"ID1796","2012-06-11T21:52:14",56600,56600,"USD",{"$f":"Data!$E1422*VLOOKUP(Data!$F1422,tblXrate[],2,FALSE)","v":66000},"ECommerce Manager","Manager","USA",{"$f":"VLOOKUP(Data!$J1422,tblCountries[[Actual]:[Mapping]],2,FALSE)","v":"USA"},"4 to 6 hours a day",12,"USA"]
[null,"ID1799","2012-06-12T00:26:07",100000,100000,"USD",{"$f":"Data!$E1423*VLOOKUP(Data!$F1423,tblXrate[],2,FALSE)","v":85000},"analyst","Analyst","USA",{"$f":"VLOOKUP(Data!$J1423,tblCountries[[Actual]:[Mapping]],2,FALSE)","v":"USA"},"All the 8 hours baby, all the 8!",12,"USA"]
[null,"ID1810","2012-06-12T15:09:22",156000,156000,"AUD",{"$f":"Data!$E1434*VLOOKUP(Data!$F1434,tblXrate[],2,FALSE)","v":80000},"Senior Associate Engineer","Engineer","Australia",{"$f":"VLOOKUP(Data!$J1434,tblCountries[[Actual]:[Mapping]],2,FALSE)","v":"USA"},"2 to 3 hours per day",12,"Australia"]
[null,"ID1877","2012-06-16T17:07:45","INR 50000",600000,"INR",{"$f":"Data!$E1489*VLOOKUP(Data!$F1489,tblXrate[],2,FALSE)","v":40700},"Manager- Customer Support","Manager","India",{"$f":"VLOOKUP(Data!$J1489,tblCountries[[Actual]:[Mapping]],2,FALSE)","v":"USA"},"4 to 6 hours a day",12,"India"]
[null,"ID1880","2012-06-16T18:31:59",2342342,2342342,"INR",{"$f":"Data!$E1492*VLOOKUP(Data!$F1492,tblXrate[],2,FALSE)","v":90469.260118790073},"3r23regedf","Misc.","India",{"$f":"VLOOKUP(Data!$J1492,tblCountries[[Actual]:[Mapping]],2,FALSE)","v":"Canada"},"2 to 3 hours per day",12,"India"]
[null,"ID1900","2012-06-19T06:50:47",48000,48000,"USD",{"$f":"Data!$E1507*VLOOKUP(Data!$F1507,tblXrate[],2,FALSE)","v":100000},"Inventory Analyst","Analyst","USA",{"$f":"VLOOKUP(Data!$J1507,tblCountries[[Actual]:[Mapping]],2,FALSE)","v":"USA"},"4 to 6 hours a day",12,"USA"]
[null,"ID0670","2012-05-26T12:52:37",24000,24000,"USD",{"$f":"Data!$E1633*VLOOKUP(Data!$F1633,tblXrate[],2,FALSE)","v":157337.8436848523},"Management Accountant","Manager","Saudi Arabai","Other Countries","4 to 6 hours a day",12,"Saudi Arabia"]
[null,"ID0715","2012-05-26T14:22:05",1000,12000,"USD",{"$f":"Data!$E1641*VLOOKUP(Data!$F1641,tblXrate[],2,FALSE)","v":62500},"tech operator (oil)","Analyst","uae","Other Countries","4 to 6 hours a day",12,"UAE"]
[null,"ID0940","2012-05-27T23:46:03",18060,18060,"USD",{"$f":"Data!$E1695*VLOOKUP(Data!$F1695,tblXrate[],2,FALSE)","v":76600},"Reporting Supervisor","Reporting","Philippines","Other Countries","4 to 6 hours a day",12,"Philippines"]
[null,"ID1127","2012-05-28T17:42:22","AED 120000",120000,"AED",{"$f":"Data!$E1733*VLOOKUP(Data!$F1733,tblXrate[],2,FALSE)","v":1229201.9037879086},"Finance Manager","Manager","UAE","Other Countries","2 to 3 hours per day",12,"UAE"]
[null,"ID1208","2012-05-29T00:07:36",20000,20000,"EUR",{"$f":"Data!$E1755*VLOOKUP(Data!$F1755,tblXrate[],2,FALSE)","v":100000},"warehouse management","Manager","GREECE","Other Countries","1 or 2 hours a day",12,"Greece"]
[null,"ID1235","2012-05-29T02:26:28","100000 USD",100000,"USD",{"$f":"Data!$E1761*VLOOKUP(Data!$F1761,tblXrate[],2,FALSE)","v":122941.90522124816},"Controller","Controller","Norway","Other Countries","4 to 6 hours a day",12,"Norway"]
[null,"ID1238","2012-05-29T03:28:37","â‚¬35,000 / â‚¬44,000",35000,"EUR",{"$f":"Data!$E1762*VLOOKUP(Data!$F1762,tblXrate[],2,FALSE)","v":76000},"Business Analyst","Analyst","Ireland","Other Countries","All the 8 hours baby, all the 8!",12,"Ireland"]
[null,"ID1277","2012-05-29T10:11:28",35000,35000,"USD",{"$f":"Data!$E1771*VLOOKUP(Data!$F1771,tblXrate[],2,FALSE)","v":104000},"AVP Securitisation","CXO or Top Mgmt.","Malaysia","Other Countries","All the 8 hours baby, all the 8!",12,"malaysia"]
[null,"ID1333","2012-05-29T16:41:19","41000 â‚¬",41000,"EUR",{"$f":"Data!$E1784*VLOOKUP(Data!$F1784,tblXrate[],2,FALSE)","v":86692.320794224041},"engineer","Engineer","Spain","Other Countries","4 to 6 hours a day",12,"Spain"]
[null,"ID1343","2012-05-29T17:36:13",18000,18000,"USD",{"$f":"Data!$E1788*VLOOKUP(Data!$F1788,tblXrate[],2,FALSE)","v":8903.9583437212841},"liquidity manager","Manager","Ghana","Other Countries","4 to 6 hours a day",12,"Ghana"]
[null,"ID1367","2012-05-29T19:33:07",45000,45000,"EUR",{"$f":"Data!$E1792*VLOOKUP(Data!$F1792,tblXrate[],2,FALSE)","v":67000},"Junior Controller","Controller","Germany","Other Countries","4 to 6 hours a day",12,"Germany"]
[null,"ID1671","2012-06-04T23:38:47","30000 â‚¬",30000,"EUR",{"$f":"Data!$E1846*VLOOKUP(Data!$F1846,tblXrate[],2,FALSE)","v":4545},"Safety technician","Analyst","Spain","Other Countries","1 or 2 hours a day",12,"Spain"]
[null,"ID1781","2012-06-10T15:59:17",30000,30000,"USD",{"$f":"Data!$E1865*VLOOKUP(Data!$F1865,tblXrate[],2,FALSE)","v":89944.280280605832},"Teacher","Analyst","Malaysia","Other Countries","1 or 2 hours a day",12,"malaysia"]
[null,"ID1792","2012-06-11T19:40:47","3000 $",3000,"USD",{"$f":"Data!$E1867*VLOOKUP(Data!$F1867,tblXrate[],2,FALSE)","v":6629},"executive","Analyst","Bangladesh","Other Countries","1 or 2 hours a day",12,"Bangladesh"]
[null,"ID0735","2012-05-26T15:27:48","8 Lakhs",800000,"INR",{"$f":"Data!$E613*VLOOKUP(Data!$F613,tblXrate[],2,FALSE)","v":47285.348162018527},"Manager","Manager","India",{"$f":"VLOOKUP(Data!$J613,tblCountries[[Actual]:[Mapping]],2,FALSE)","v":"UK"},"2 to 3 hours per day",13,"India"]
[null,"ID0815","2012-05-26T22:22:58",95000,95000,"USD",{"$f":"Data!$E677*VLOOKUP(Data!$F677,tblXrate[],2,FALSE)","v":6713.584591165848},"Business Analyst","Analyst","USA",{"$f":"VLOOKUP(Data!$J677,tblCountries[[Actual]:[Mapping]],2,FALSE)","v":"India"},"2 to 3 hours per day",13,"USA"]
[null,"ID0966","2012-05-28T05:51:10","AUD90000",90000,"AUD",{"$f":"Data!$E775*VLOOKUP(Data!$F775,tblXrate[],2,FALSE)","v":4950.6008391090336},"Senior Research Analyst","Analyst","Australia",{"$f":"VLOOKUP(Data!$J775,tblCountries[[Actual]:[Mapping]],2,FALSE)","v":"India"},"4 to 6 hours a day",13,"Australia"]
[null,"ID1027","2012-05-28T12:35:38","Net- 56000Rs, Gross - 61000Rs",612000,"INR",{"$f":"Data!$E824*VLOOKUP(Data!$F824,tblXrate[],2,FALSE)","v":75000},"Asst. Manager ","Manager","India",{"$f":"VLOOKUP(Data!$J824,tblCountries[[Actual]:[Mapping]],2,FALSE)","v":"USA"},"2 to 3 hours per day",13,"India"]
[null,"ID1203","2012-05-28T23:53:02",1100000,1100000,"INR",{"$f":"Data!$E958*VLOOKUP(Data!$F958,tblXrate[],2,FALSE)","v":18018.883790212141},"Sr. Consultant","Consultant","India",{"$f":"VLOOKUP(Data!$J958,tblCountries[[Actual]:[Mapping]],2,FALSE)","v":"Poland"},"All the 8 hours baby, all the 8!",13,"India"]
[null,"ID1210","2012-05-29T00:16:55","Rs. 900000",900000,"INR",{"$f":"Data!$E963*VLOOKUP(Data!$F963,tblXrate[],2,FALSE)","v":30489.586535798586},"Manager F & A","Manager","India",{"$f":"VLOOKUP(Data!$J963,tblCountries[[Actual]:[Mapping]],2,FALSE)","v":"italy"},"1 or 2 hours a day",13,"India"]
[null,"ID1219","2012-05-29T00:47:17",95856,95856,"USD",{"$f":"Data!$E971*VLOOKUP(Data!$F971,tblXrate[],2,FALSE)","v":38666},"Analyst","Analyst","USA",{"$f":"VLOOKUP(Data!$J971,tblCountries[[Actual]:[Mapping]],2,FALSE)","v":"South Africa"},"2 to 3 hours per day",13,"USA"]
[null,"ID1414","2012-05-30T00:02:08",64500,64500,"USD",{"$f":"Data!$E1121*VLOOKUP(Data!$F1121,tblXrate[],2,FALSE)","v":109000},"Lead Budget/Financial Analyst","Analyst","USA",{"$f":"VLOOKUP(Data!$J1121,tblCountries[[Actual]:[Mapping]],2,FALSE)","v":"USA"},"4 to 6 hours a day",13,"USA"]
[null,"ID1486","2012-05-30T19:42:50",77000,77000,"USD",{"$f":"Data!$E1181*VLOOKUP(Data!$F1181,tblXrate[],2,FALSE)","v":30000},"Chemical Engineer","Engineer","USA",{"$f":"VLOOKUP(Data!$J1181,tblCountries[[Actual]:[Mapping]],2,FALSE)","v":"Mexico"},"2 to 3 hours per day",13,"USA"]
[null,"ID1641","2012-06-03T12:09:27","10 lacs INR",1000000,"INR",{"$f":"Data!$E1298*VLOOKUP(Data!$F1298,tblXrate[],2,FALSE)","v":61000},"Category Manager","Manager","India",{"$f":"VLOOKUP(Data!$J1298,tblCountries[[Actual]:[Mapping]],2,FALSE)","v":"USA"},"2 to 3 hours per day",13,"India"]
[null,"ID1719","2012-06-06T19:39:06",550000,550000,"INR",{"$f":"Data!$E1356*VLOOKUP(Data!$F1356,tblXrate[],2,FALSE)","v":40000},"Accounts manager","Manager","India",{"$f":"VLOOKUP(Data!$J1356,tblCountries[[Actual]:[Mapping]],2,FALSE)","v":"USA"},"4 to 6 hours a day",13,"India"]
[null,"ID1769","2012-06-09T01:47:30",72000,72000,"USD",{"$f":"Data!$E1401*VLOOKUP(Data!$F1401,tblXrate[],2,FALSE)","v":120000},"Consultant","Consultant","USA",{"$f":"VLOOKUP(Data!$J1401,tblCountries[[Actual]:[Mapping]],2,FALSE)","v":"USA"},"2 to 3 hours per day",13,"USA"]
[null,"ID1804","2012-06-12T03:32:27",65000,65000,"USD",{"$f":"Data!$E1428*VLOOKUP(Data!$F1428,tblXrate[],2,FALSE)","v":56160},"Assistant Controller","Controller","USA",{"$f":"VLOOKUP(Data!$J1428,tblCountries[[Actual]:[Mapping]],2,FALSE)","v":"USA"},"2 to 3 hours per day",13,"USA"]
[null,"ID0864","2012-05-27T04:12:04",5000,5000,"USD",{"$f":"Data!$E1670*VLOOKUP(Data!$F1670,tblXrate[],2,FALSE)","v":85000},"Policy advisor","Consultant","Aruba","Other Countries","1 or 2 hours a day",13,"Aruba"]
[null,"ID0903","2012-05-27T15:25:40",1300,15600,"USD",{"$f":"Data!$E1684*VLOOKUP(Data!$F1684,tblXrate[],2,FALSE)","v":56000},"Document controller ","Controller","Kuwait ","Other Countries","4 to 6 hours a day",13,"Kuwait "]
[null,"ID1155","2012-05-28T20:45:35",13.5,13500,"USD",{"$f":"Data!$E1742*VLOOKUP(Data!$F1742,tblXrate[],2,FALSE)","v":55000},"Project manager","Manager","Montenegro","Other Countries","4 to 6 hours a day",13,"Montenegro"]
[null,"ID1493","2012-05-30T20:47:55","50000 US$",50000,"USD",{"$f":"Data!$E1809*VLOOKUP(Data!$F1809,tblXrate[],2,FALSE)","v":19200},"Sr. Financial Analyst","Analyst","Kuwait","Other Countries","4 to 6 hours a day",13,"Kuwait"]
[null,"ID0699","2012-05-26T13:42:21",180000,180000,"INR",{"$f":"Data!$E582*VLOOKUP(Data!$F582,tblXrate[],2,FALSE)","v":6410.8500074793246},"accounts","Accountant","India",{"$f":"VLOOKUP(Data!$J582,tblCountries[[Actual]:[Mapping]],2,FALSE)","v":"India"},"2 to 3 hours per day",14,"India"]
[null,"ID0770","2012-05-26T17:44:34","Rs 1200000",1200000,"INR",{"$f":"Data!$E640*VLOOKUP(Data!$F640,tblXrate[],2,FALSE)","v":63000},"Regional Formwork Head ","Manager","India",{"$f":"VLOOKUP(Data!$J640,tblCountries[[Actual]:[Mapping]],2,FALSE)","v":"USA"},"All the 8 hours baby, all the 8!",14,"India"]
[null,"ID1008","2012-05-28T10:41:38",94000,94000,"AUD",{"$f":"Data!$E810*VLOOKUP(Data!$F810,tblXrate[],2,FALSE)","v":13745.704467353951},"Principal Analyst","Analyst","Australia",{"$f":"VLOOKUP(Data!$J810,tblCountries[[Actual]:[Mapping]],2,FALSE)","v":"Morocco"},"2 to 3 hours per day",14,"Australia"]
[null,"ID1103","2012-05-28T16:21:27",79000,79000,"GBP",{"$f":"Data!$E887*VLOOKUP(Data!$F887,tblXrate[],2,FALSE)","v":60000},"Market Analyst","Analyst","UK",{"$f":"VLOOKUP(Data!$J887,tblCountries[[Actual]:[Mapping]],2,FALSE)","v":"USA"},"2 to 3 hours per day",14,"UK"]
[null,"ID1121","2012-05-28T17:17:39",60000,60000,"USD",{"$f":"Data!$E900*VLOOKUP(Data!$F900,tblXrate[],2,FALSE)","v":60800},"manager","Manager","India",{"$f":"VLOOKUP(Data!$J900,tblCountries[[Actual]:[Mapping]],2,FALSE)","v":"USA"},"All the 8 hours baby, all the 8!",14,"India"]
[null,"ID1141","2012-05-28T18:50:35",29000,29000,"GBP",{"$f":"Data!$E914*VLOOKUP(Data!$F914,tblXrate[],2,FALSE)","v":26711.875031163851},"Financial Analyst","Analyst","UK",{"$f":"VLOOKUP(Data!$J914,tblCountries[[Actual]:[Mapping]],2,FALSE)","v":"India"},"4 to 6 hours a day",14,"UK"]
[null,"ID1168","2012-05-28T22:36:47",59000,59000,"USD",{"$f":"Data!$E933*VLOOKUP(Data!$F933,tblXrate[],2,FALSE)","v":31523.565441345683},"Management Analyst","Analyst","USA",{"$f":"VLOOKUP(Data!$J933,tblCountries[[Actual]:[Mapping]],2,FALSE)","v":"UK"},"4 to 6 hours a day",14,"USA"]
[null,"ID1243","2012-05-29T04:11:58","Â£30000",30000,"GBP",{"$f":"Data!$E989*VLOOKUP(Data!$F989,tblXrate[],2,FALSE)","v":12821.700014958649},"Infection Prevention Surveillance Specialist","Specialist","UK",{"$f":"VLOOKUP(Data!$J989,tblCountries[[Actual]:[Mapping]],2,FALSE)","v":"India"},"4 to 6 hours a day",14,"UK"]
[null,"ID1352","2012-05-29T18:33:08",80000,80000,"USD",{"$f":"Data!$E1067*VLOOKUP(Data!$F1067,tblXrate[],2,FALSE)","v":95000},"Developer","Analyst","USA",{"$f":"VLOOKUP(Data!$J1067,tblCountries[[Actual]:[Mapping]],2,FALSE)","v":"USA"},"1 or 2 hours a day",14,"USA"]
[null,"ID1387","2012-05-29T21:46:28","97,000 USD",97000,"USD",{"$f":"Data!$E1097*VLOOKUP(Data!$F1097,tblXrate[],2,FALSE)","v":203981.93128052715},"Sr. Manager of Finance","Manager","USA",{"$f":"VLOOKUP(Data!$J1097,tblCountries[[Actual]:[Mapping]],2,FALSE)","v":"Australia"},"4 to 6 hours a day",14,"USA"]
[null,"ID1400","2012-05-29T22:35:17",95000,95000,"USD",{"$f":"Data!$E1108*VLOOKUP(Data!$F1108,tblXrate[],2,FALSE)","v":78764.765217479682},"Stress Engineer","Engineer","USA",{"$f":"VLOOKUP(Data!$J1108,tblCountries[[Actual]:[Mapping]],2,FALSE)","v":"Netherlands"},"4 to 6 hours a day",14,"USA"]
[null,"ID1407","2012-05-29T23:09:29",65000,65000,"USD",{"$f":"Data!$E1115*VLOOKUP(Data!$F1115,tblXrate[],2,FALSE)","v":70928.022243027779},"Data Analyst","Analyst","USA",{"$f":"VLOOKUP(Data!$J1115,tblCountries[[Actual]:[Mapping]],2,FALSE)","v":"UK"},"All the 8 hours baby, all the 8!",14,"USA"]
[null,"ID1504","2012-05-30T23:01:48",55000,55000,"USD",{"$f":"Data!$E1194*VLOOKUP(Data!$F1194,tblXrate[],2,FALSE)","v":69871.969144538423},"Supplier Manager","Manager","USA",{"$f":"VLOOKUP(Data!$J1194,tblCountries[[Actual]:[Mapping]],2,FALSE)","v":"italy"},"2 to 3 hours per day",14,"USA"]
[null,"ID1529","2012-05-31T08:20:03",89000,89000,"USD",{"$f":"Data!$E1214*VLOOKUP(Data!$F1214,tblXrate[],2,FALSE)","v":96891.417358250401},"BI Analyst","Analyst","USA",{"$f":"VLOOKUP(Data!$J1214,tblCountries[[Actual]:[Mapping]],2,FALSE)","v":"Australia"},"All the 8 hours baby, all the 8!",14,"USA"]
[null,"ID1541","2012-05-31T16:16:11","Â£30500",30500,"GBP",{"$f":"Data!$E1223*VLOOKUP(Data!$F1223,tblXrate[],2,FALSE)","v":118213.37040504631},"Construction Estimator","Consultant","UK",{"$f":"VLOOKUP(Data!$J1223,tblCountries[[Actual]:[Mapping]],2,FALSE)","v":"UK"},"4 to 6 hours a day",14,"UK"]
[null,"ID1655","2012-06-04T09:49:44",155000,155000,"USD",{"$f":"Data!$E1310*VLOOKUP(Data!$F1310,tblXrate[],2,FALSE)","v":45393.934235537781},"Consulting Practice Manager","Manager","USA",{"$f":"VLOOKUP(Data!$J1310,tblCountries[[Actual]:[Mapping]],2,FALSE)","v":"UK"},"1 or 2 hours a day",14,"USA"]
[null,"ID1802","2012-06-12T02:43:17","$65,000 US",65000,"USD",{"$f":"Data!$E1426*VLOOKUP(Data!$F1426,tblXrate[],2,FALSE)","v":37900},"Sr Financial Systems Analyst","Analyst","USA",{"$f":"VLOOKUP(Data!$J1426,tblCountries[[Actual]:[Mapping]],2,FALSE)","v":"USA"},"4 to 6 hours a day",14,"USA"]
[null,"ID1822","2012-06-13T00:37:24","â‚¬ 45000",45000,"EUR",{"$f":"Data!$E1445*VLOOKUP(Data!$F1445,tblXrate[],2,FALSE)","v":68835.306612122877},"IT Trainer","Analyst","Netherlands",{"$f":"VLOOKUP(Data!$J1445,tblCountries[[Actual]:[Mapping]],2,FALSE)","v":"Canada"},"2 to 3 hours per day",14,"Netherlands"]
[null,"ID0868","2012-05-27T06:37:13",98000,98000,"USD",{"$f":"Data!$E1672*VLOOKUP(Data!$F1672,tblXrate[],2,FALSE)","v":40000},"supply chain manager","Manager","indonesia","Other Countries","2 to 3 hours per day",14,"Indonesia"]
[null,"ID1129","2012-05-28T17:42:57",50000,50000,"EUR",{"$f":"Data!$E1734*VLOOKUP(Data!$F1734,tblXrate[],2,FALSE)","v":30000},"Network Enginer","Engineer","Portugal","Other Countries","2 to 3 hours per day",14,"Portugal"]
[null,"ID1134","2012-05-28T18:11:36","â‚¬ 45000",45000,"EUR",{"$f":"Data!$E1735*VLOOKUP(Data!$F1735,tblXrate[],2,FALSE)","v":92000},"Sales Planning","Manager","Spain","Other Countries","4 to 6 hours a day",14,"Spain"]
[null,"ID1209","2012-05-29T00:12:23",23000,23000,"USD",{"$f":"Data!$E1756*VLOOKUP(Data!$F1756,tblXrate[],2,FALSE)","v":10684.750012465542},"Chief Accountant","Accountant","Saudi Arabia","Other Countries","All the 8 hours baby, all the 8!",14,"Saudi Arabia"]
[null,"ID1485","2012-05-30T19:27:35","60000 Euros",60000,"EUR",{"$f":"Data!$E1808*VLOOKUP(Data!$F1808,tblXrate[],2,FALSE)","v":41000},"Sales Analyst","Analyst","Italy","Other Countries","All the 8 hours baby, all the 8!",14,"italy"]
[null,"ID1718","2012-06-06T18:52:03",700,8400,"USD",{"$f":"Data!$E1857*VLOOKUP(Data!$F1857,tblXrate[],2,FALSE)","v":99147},"gov employee","Analyst","indonesia","Other Countries","4 to 6 hours a day",14,"Indonesia"]
[null,"ID0579","2012-05-26T07:18:57",90000,90000,"USD",{"$f":"Data!$E478*VLOOKUP(Data!$F478,tblXrate[],2,FALSE)","v":47285.348162018527},"Manager","Manager","USA",{"$f":"VLOOKUP(Data!$J478,tblCountries[[Actual]:[Mapping]],2,FALSE)","v":"UK"},"2 to 3 hours per day",15,"USA"]
[null,"ID0586","2012-05-26T07:50:50",115000,115000,"USD",{"$f":"Data!$E485*VLOOKUP(Data!$F485,tblXrate[],2,FALSE)","v":91791.869076237213},"Mgr Op Excellence","Manager","USA",{"$f":"VLOOKUP(Data!$J485,tblCountries[[Actual]:[Mapping]],2,FALSE)","v":"Australia"},"4 to 6 hours a day",15,"USA"]
[null,"ID0600","2012-05-26T08:55:12",45000,45000,"USD",{"$f":"Data!$E496*VLOOKUP(Data!$F496,tblXrate[],2,FALSE)","v":11040.908346214392},"Technical Analyst","Analyst","USA",{"$f":"VLOOKUP(Data!$J496,tblCountries[[Actual]:[Mapping]],2,FALSE)","v":"India"},"4 to 6 hours a day",15,"USA"]
[null,"ID0618","2012-05-26T10:51:05",80000,80000,"USD",{"$f":"Data!$E511*VLOOKUP(Data!$F511,tblXrate[],2,FALSE)","v":15000},"Sales Controller","Controller","USA",{"$f":"VLOOKUP(Data!$J511,tblCountries[[Actual]:[Mapping]],2,FALSE)","v":"India"},"4 to 6 hours a day",15,"USA"]
[null,"ID0677","2012-05-26T13:01:44",105000,105000,"USD",{"$f":"Data!$E563*VLOOKUP(Data!$F563,tblXrate[],2,FALSE)","v":67700.452577525488},"Senior Consultant","Consultant","USA",{"$f":"VLOOKUP(Data!$J563,tblCountries[[Actual]:[Mapping]],2,FALSE)","v":"Norway"},"2 to 3 hours per day",15,"USA"]
[null,"ID0737","2012-05-26T15:35:43",40000,40000,"USD",{"$f":"Data!$E615*VLOOKUP(Data!$F615,tblXrate[],2,FALSE)","v":20000},"Revenue Manager","Manager","India",{"$f":"VLOOKUP(Data!$J615,tblCountries[[Actual]:[Mapping]],2,FALSE)","v":"India"},"All the 8 hours baby, all the 8!",15,"India"]
[null,"ID0738","2012-05-26T15:44:32",5022,5022,"USD",{"$f":"Data!$E616*VLOOKUP(Data!$F616,tblXrate[],2,FALSE)","v":40000},"Accounts analyst","Analyst","Pakistan",{"$f":"VLOOKUP(Data!$J616,tblCountries[[Actual]:[Mapping]],2,FALSE)","v":"USA"},"4 to 6 hours a day",15,"Pakistan"]
[null,"ID0748","2012-05-26T16:16:39",65000,65000,"GBP",{"$f":"Data!$E623*VLOOKUP(Data!$F623,tblXrate[],2,FALSE)","v":6767.0083412281756},"compliance manager","Manager","UK",{"$f":"VLOOKUP(Data!$J623,tblCountries[[Actual]:[Mapping]],2,FALSE)","v":"India"},"4 to 6 hours a day",15,"UK"]
[null,"ID0777","2012-05-26T18:35:20","45000 $",45000,"USD",{"$f":"Data!$E645*VLOOKUP(Data!$F645,tblXrate[],2,FALSE)","v":18499.860539512854},"AGM","Manager","India",{"$f":"VLOOKUP(Data!$J645,tblCountries[[Actual]:[Mapping]],2,FALSE)","v":"Romania"},"1 or 2 hours a day",15,"India"]
[null,"ID0800","2012-05-26T21:07:14","Â£29000",29000,"GBP",{"$f":"Data!$E665*VLOOKUP(Data!$F665,tblXrate[],2,FALSE)","v":108000},"Reporting Assistant","Reporting","UK",{"$f":"VLOOKUP(Data!$J665,tblCountries[[Actual]:[Mapping]],2,FALSE)","v":"USA"},"2 to 3 hours per day",15,"UK"]
[null,"ID0806","2012-05-26T21:27:17",85000,85000,"USD",{"$f":"Data!$E670*VLOOKUP(Data!$F670,tblXrate[],2,FALSE)","v":5342.3750062327708},"Director, IT/Operations","CXO or Top Mgmt.","USA",{"$f":"VLOOKUP(Data!$J670,tblCountries[[Actual]:[Mapping]],2,FALSE)","v":"India"},"4 to 6 hours a day",15,"USA"]
[null,"ID0854","2012-05-27T03:06:02",92500,92500,"USD",{"$f":"Data!$E706*VLOOKUP(Data!$F706,tblXrate[],2,FALSE)","v":80000},"Dir of Analytics","Analyst","USA",{"$f":"VLOOKUP(Data!$J706,tblCountries[[Actual]:[Mapping]],2,FALSE)","v":"USA"},"2 to 3 hours per day",15,"USA"]
[null,"ID0869","2012-05-27T06:37:15",50000,50000,"USD",{"$f":"Data!$E716*VLOOKUP(Data!$F716,tblXrate[],2,FALSE)","v":18000},"Boss","CXO or Top Mgmt.","USA",{"$f":"VLOOKUP(Data!$J716,tblCountries[[Actual]:[Mapping]],2,FALSE)","v":"Poland"},"All the 8 hours baby, all the 8!",15,"USA"]
[null,"ID0874","2012-05-27T09:17:47",70000,70000,"USD",{"$f":"Data!$E719*VLOOKUP(Data!$F719,tblXrate[],2,FALSE)","v":12500},"Financial Analyst","Analyst","USA",{"$f":"VLOOKUP(Data!$J719,tblCountries[[Actual]:[Mapping]],2,FALSE)","v":"Philippines"},"All the 8 hours baby, all the 8!",15,"USA"]
[null,"ID0916","2012-05-27T17:17:24","Â£65000",65000,"GBP",{"$f":"Data!$E748*VLOOKUP(Data!$F748,tblXrate[],2,FALSE)","v":85000},"Manager","Manager","UK",{"$f":"VLOOKUP(Data!$J748,tblCountries[[Actual]:[Mapping]],2,FALSE)","v":"Australia"},"1 or 2 hours a day",15,"UK"]
[null,"ID0954","2012-05-28T01:47:29",135000,135000,"USD",{"$f":"Data!$E769*VLOOKUP(Data!$F769,tblXrate[],2,FALSE)","v":4451.9791718606421},"Marketing Insights Manager","Manager","USA",{"$f":"VLOOKUP(Data!$J769,tblCountries[[Actual]:[Mapping]],2,FALSE)","v":"India"},"All the 8 hours baby, all the 8!",15,"USA"]
[null,"ID0976","2012-05-28T07:28:07","AUD$200,000",200000,"AUD",{"$f":"Data!$E784*VLOOKUP(Data!$F784,tblXrate[],2,FALSE)","v":50000},"Corporate Finance Manager","Manager","Australia",{"$f":"VLOOKUP(Data!$J784,tblCountries[[Actual]:[Mapping]],2,FALSE)","v":"India"},"4 to 6 hours a day",15,"Australia"]
[null,"ID0978","2012-05-28T07:29:43",125000,125000,"AUD",{"$f":"Data!$E786*VLOOKUP(Data!$F786,tblXrate[],2,FALSE)","v":90000},"Director, Informatics","CXO or Top Mgmt.","Australia",{"$f":"VLOOKUP(Data!$J786,tblCountries[[Actual]:[Mapping]],2,FALSE)","v":"USA"},"4 to 6 hours a day",15,"Australia"]
[null,"ID1023","2012-05-28T12:20:48","INR 4.5 Lac",450000,"INR",{"$f":"Data!$E820*VLOOKUP(Data!$F820,tblXrate[],2,FALSE)","v":44519.791718606422},"Asst. Manager","Manager","India",{"$f":"VLOOKUP(Data!$J820,tblCountries[[Actual]:[Mapping]],2,FALSE)","v":"India"},"All the 8 hours baby, all the 8!",15,"India"]
[null,"ID1050","2012-05-28T14:00:56",194,2400,"USD",{"$f":"Data!$E843*VLOOKUP(Data!$F843,tblXrate[],2,FALSE)","v":140000},"Accounts Officer","Accountant","Pakistan",{"$f":"VLOOKUP(Data!$J843,tblCountries[[Actual]:[Mapping]],2,FALSE)","v":"USA"},"2 to 3 hours per day",15,"Pakistan"]
[null,"ID1079","2012-05-28T15:29:53","Â£30000",30000,"GBP",{"$f":"Data!$E864*VLOOKUP(Data!$F864,tblXrate[],2,FALSE)","v":98336.152303032693},"Data Analyst","Analyst","UK",{"$f":"VLOOKUP(Data!$J864,tblCountries[[Actual]:[Mapping]],2,FALSE)","v":"Canada"},"All the 8 hours baby, all the 8!",15,"UK"]
[null,"ID1120","2012-05-28T17:15:29","Â£28500",28500,"GBP",{"$f":"Data!$E899*VLOOKUP(Data!$F899,tblXrate[],2,FALSE)","v":80000},"Development (Project & Planning) Manager","Manager","UK",{"$f":"VLOOKUP(Data!$J899,tblCountries[[Actual]:[Mapping]],2,FALSE)","v":"USA"},"1 or 2 hours a day",15,"UK"]
[null,"ID1170","2012-05-28T22:39:09","Â£80000",80000,"GBP",{"$f":"Data!$E935*VLOOKUP(Data!$F935,tblXrate[],2,FALSE)","v":72000},"Financial Controller","Controller","UK",{"$f":"VLOOKUP(Data!$J935,tblCountries[[Actual]:[Mapping]],2,FALSE)","v":"USA"},"4 to 6 hours a day",15,"UK"]
[null,"ID1176","2012-05-28T22:45:49","Â£43000",43000,"GBP",{"$f":"Data!$E939*VLOOKUP(Data!$F939,tblXrate[],2,FALSE)","v":25000},"Head of Finance","Accountant","UK",{"$f":"VLOOKUP(Data!$J939,tblCountries[[Actual]:[Mapping]],2,FALSE)","v":"India"},"All the 8 hours baby, all the 8!",15,"UK"]
[null,"ID1202","2012-05-28T23:52:42",480000,480000,"INR",{"$f":"Data!$E957*VLOOKUP(Data!$F957,tblXrate[],2,FALSE)","v":48000},"Documentation Consultant","Consultant","India",{"$f":"VLOOKUP(Data!$J957,tblCountries[[Actual]:[Mapping]],2,FALSE)","v":"Qatar"},"All the 8 hours baby, all the 8!",15,"India"]
[null,"ID1220","2012-05-29T01:03:19","40,000 US",40000,"USD",{"$f":"Data!$E972*VLOOKUP(Data!$F972,tblXrate[],2,FALSE)","v":95000},"Staff Accountant","Accountant","USA",{"$f":"VLOOKUP(Data!$J972,tblCountries[[Actual]:[Mapping]],2,FALSE)","v":"Australia"},"2 to 3 hours per day",15,"USA"]
[null,"ID1231","2012-05-29T02:02:39","$40K",40000,"USD",{"$f":"Data!$E980*VLOOKUP(Data!$F980,tblXrate[],2,FALSE)","v":56095.031102144967},"SOX,SAP, Insurance Coordinator","Manager","Pakistan, Angola",{"$f":"VLOOKUP(Data!$J980,tblCountries[[Actual]:[Mapping]],2,FALSE)","v":"Australia"},"4 to 6 hours a day",15,"Pakistan"]
[null,"ID1236","2012-05-29T02:43:44","62.000 euro",62000,"EUR",{"$f":"Data!$E984*VLOOKUP(Data!$F984,tblXrate[],2,FALSE)","v":71500},"Stafmember","Analyst","Netherlands",{"$f":"VLOOKUP(Data!$J984,tblCountries[[Actual]:[Mapping]],2,FALSE)","v":"USA"},"4 to 6 hours a day",15,"Netherlands"]
[null,"ID1259","2012-05-29T07:52:56",65000,65000,"CAD",{"$f":"Data!$E1001*VLOOKUP(Data!$F1001,tblXrate[],2,FALSE)","v":60000},"it manager","Manager","Canada",{"$f":"VLOOKUP(Data!$J1001,tblCountries[[Actual]:[Mapping]],2,FALSE)","v":"USA"},"2 to 3 hours per day",15,"Canada"]
[null,"ID1268","2012-05-29T09:25:31",100000,100000,"AUD",{"$f":"Data!$E1007*VLOOKUP(Data!$F1007,tblXrate[],2,FALSE)","v":83000},"Contractor/Consultant","Consultant","Australia",{"$f":"VLOOKUP(Data!$J1007,tblCountries[[Actual]:[Mapping]],2,FALSE)","v":"Canada"},"4 to 6 hours a day",15,"Australia"]
[null,"ID1348","2012-05-29T18:05:50","Â£70000",70000,"GBP",{"$f":"Data!$E1063*VLOOKUP(Data!$F1063,tblXrate[],2,FALSE)","v":59000},"Consultant","Consultant","UK",{"$f":"VLOOKUP(Data!$J1063,tblCountries[[Actual]:[Mapping]],2,FALSE)","v":"USA"},"4 to 6 hours a day",15,"UK"]
[null,"ID1351","2012-05-29T18:21:13",34500,34500,"EUR",{"$f":"Data!$E1066*VLOOKUP(Data!$F1066,tblXrate[],2,FALSE)","v":97000},"Analyst","Analyst","Netherlands",{"$f":"VLOOKUP(Data!$J1066,tblCountries[[Actual]:[Mapping]],2,FALSE)","v":"USA"},"4 to 6 hours a day",15,"Netherlands"]
[null,"ID1357","2012-05-29T18:55:20",105000,105000,"USD",{"$f":"Data!$E1071*VLOOKUP(Data!$F1071,tblXrate[],2,FALSE)","v":48073.437298052166},"Director of Technology","CXO or Top Mgmt.","USA",{"$f":"VLOOKUP(Data!$J1071,tblCountries[[Actual]:[Mapping]],2,FALSE)","v":"UK"},"1 or 2 hours a day",15,"USA"]
[null,"ID1370","2012-05-29T19:50:25",62000,62000,"EUR",{"$f":"Data!$E1081*VLOOKUP(Data!$F1081,tblXrate[],2,FALSE)","v":90000},"Controller","Controller","Netherlands",{"$f":"VLOOKUP(Data!$J1081,tblCountries[[Actual]:[Mapping]],2,FALSE)","v":"USA"},"4 to 6 hours a day",15,"Netherlands"]
[null,"ID1372","2012-05-29T19:54:38","Â£45000",45000,"GBP",{"$f":"Data!$E1083*VLOOKUP(Data!$F1083,tblXrate[],2,FALSE)","v":45000},"Management Accountant","Manager","UK",{"$f":"VLOOKUP(Data!$J1083,tblCountries[[Actual]:[Mapping]],2,FALSE)","v":"USA"},"2 to 3 hours per day",15,"UK"]
[null,"ID1390","2012-05-29T21:50:45","Rs 250000",250000,"INR",{"$f":"Data!$E1099*VLOOKUP(Data!$F1099,tblXrate[],2,FALSE)","v":8013.5625093491553},"Manager","Manager","India",{"$f":"VLOOKUP(Data!$J1099,tblCountries[[Actual]:[Mapping]],2,FALSE)","v":"India"},"1 or 2 hours a day",15,"India"]
[null,"ID1392","2012-05-29T21:59:35",44000,44000,"USD",{"$f":"Data!$E1101*VLOOKUP(Data!$F1101,tblXrate[],2,FALSE)","v":47285.348162018527},"Test engineer","Engineer","USA",{"$f":"VLOOKUP(Data!$J1101,tblCountries[[Actual]:[Mapping]],2,FALSE)","v":"UK"},"4 to 6 hours a day",15,"USA"]
[null,"ID1410","2012-05-29T23:21:25",60000,60000,"USD",{"$f":"Data!$E1118*VLOOKUP(Data!$F1118,tblXrate[],2,FALSE)","v":60000},"business analyst","Analyst","USA",{"$f":"VLOOKUP(Data!$J1118,tblCountries[[Actual]:[Mapping]],2,FALSE)","v":"USA"},"4 to 6 hours a day",15,"USA"]
[null,"ID1416","2012-05-30T00:22:28",50000,50000,"USD",{"$f":"Data!$E1122*VLOOKUP(Data!$F1122,tblXrate[],2,FALSE)","v":95000},"Accounting Supervisor","Accountant","USA",{"$f":"VLOOKUP(Data!$J1122,tblCountries[[Actual]:[Mapping]],2,FALSE)","v":"USA"},"4 to 6 hours a day",15,"USA"]
[null,"ID1464","2012-05-30T14:19:07","Rs.2,50,000.00",250000,"INR",{"$f":"Data!$E1164*VLOOKUP(Data!$F1164,tblXrate[],2,FALSE)","v":101206.40684944032},"Manager Commercial","Manager","India",{"$f":"VLOOKUP(Data!$J1164,tblCountries[[Actual]:[Mapping]],2,FALSE)","v":"UK"},"2 to 3 hours per day",15,"India"]
[null,"ID1484","2012-05-30T19:04:44",109000,109000,"USD",{"$f":"Data!$E1180*VLOOKUP(Data!$F1180,tblXrate[],2,FALSE)","v":34675.92198548025},"Mgr Technology","Manager","USA",{"$f":"VLOOKUP(Data!$J1180,tblCountries[[Actual]:[Mapping]],2,FALSE)","v":"UK"},"4 to 6 hours a day",15,"USA"]
[null,"ID1514","2012-05-31T01:50:26",95000,95000,"USD",{"$f":"Data!$E1202*VLOOKUP(Data!$F1202,tblXrate[],2,FALSE)","v":86692.320794224041},"Sr Financial Analyst","Analyst","USA",{"$f":"VLOOKUP(Data!$J1202,tblCountries[[Actual]:[Mapping]],2,FALSE)","v":"Australia"},"4 to 6 hours a day",15,"USA"]
[null,"ID1515","2012-05-31T02:24:37",64300,64300,"USD",{"$f":"Data!$E1203*VLOOKUP(Data!$F1203,tblXrate[],2,FALSE)","v":50000},"Financial Analst","Accountant","USA",{"$f":"VLOOKUP(Data!$J1203,tblCountries[[Actual]:[Mapping]],2,FALSE)","v":"USA"},"4 to 6 hours a day",15,"USA"]
[null,"ID1542","2012-05-31T16:25:23","60K â‚¬",60000,"EUR",{"$f":"Data!$E1224*VLOOKUP(Data!$F1224,tblXrate[],2,FALSE)","v":69000},"Trade Marketing","Manager","NL",{"$f":"VLOOKUP(Data!$J1224,tblCountries[[Actual]:[Mapping]],2,FALSE)","v":"USA"},"2 to 3 hours per day",15,"Netherlands"]
[null,"ID1560","2012-05-31T22:56:21","$59,000 USD",59000,"USD",{"$f":"Data!$E1237*VLOOKUP(Data!$F1237,tblXrate[],2,FALSE)","v":131770.4440860638},"Operations Manager","Manager","USA",{"$f":"VLOOKUP(Data!$J1237,tblCountries[[Actual]:[Mapping]],2,FALSE)","v":"Canada"},"4 to 6 hours a day",15,"USA"]
[null,"ID1571","2012-06-01T02:33:02",31200,31200,"USD",{"$f":"Data!$E1246*VLOOKUP(Data!$F1246,tblXrate[],2,FALSE)","v":6000},"Data Analyst","Analyst","USA",{"$f":"VLOOKUP(Data!$J1246,tblCountries[[Actual]:[Mapping]],2,FALSE)","v":"Guyana"},"4 to 6 hours a day",15,"USA"]
[null,"ID1581","2012-06-01T06:17:19",50000,50000,"USD",{"$f":"Data!$E1251*VLOOKUP(Data!$F1251,tblXrate[],2,FALSE)","v":150000},"Staff Accountant","Accountant","USA",{"$f":"VLOOKUP(Data!$J1251,tblCountries[[Actual]:[Mapping]],2,FALSE)","v":"Switzerland"},"4 to 6 hours a day",15,"USA"]
[null,"ID1656","2012-06-04T10:23:27",225000,225000,"USD",{"$f":"Data!$E1311*VLOOKUP(Data!$F1311,tblXrate[],2,FALSE)","v":132588.25533234264},"SVP of Acquisitions","CXO or Top Mgmt.","USA",{"$f":"VLOOKUP(Data!$J1311,tblCountries[[Actual]:[Mapping]],2,FALSE)","v":"Australia"},"4 to 6 hours a day",15,"USA"]
[null,"ID1660","2012-06-04T14:25:45","240000 INR",240000,"INR",{"$f":"Data!$E1315*VLOOKUP(Data!$F1315,tblXrate[],2,FALSE)","v":6232.7708406048987},"Exicutive TQM","Controller","India",{"$f":"VLOOKUP(Data!$J1315,tblCountries[[Actual]:[Mapping]],2,FALSE)","v":"India"},"2 to 3 hours per day",15,"India"]
[null,"ID1674","2012-06-05T02:03:48",55000,55000,"USD",{"$f":"Data!$E1325*VLOOKUP(Data!$F1325,tblXrate[],2,FALSE)","v":57500},"Customer Sales Analyst","Analyst","USA",{"$f":"VLOOKUP(Data!$J1325,tblCountries[[Actual]:[Mapping]],2,FALSE)","v":"USA"},"4 to 6 hours a day",15,"USA"]
[null,"ID1724","2012-06-06T21:20:38",40000,40000,"GBP",{"$f":"Data!$E1360*VLOOKUP(Data!$F1360,tblXrate[],2,FALSE)","v":6410.8500074793246},"project manager","Manager","UK",{"$f":"VLOOKUP(Data!$J1360,tblCountries[[Actual]:[Mapping]],2,FALSE)","v":"India"},"4 to 6 hours a day",15,"UK"]
[null,"ID1746","2012-06-08T03:23:20",69000,69000,"USD",{"$f":"Data!$E1380*VLOOKUP(Data!$F1380,tblXrate[],2,FALSE)","v":7500},"Business Analyst II","Analyst","USA",{"$f":"VLOOKUP(Data!$J1380,tblCountries[[Actual]:[Mapping]],2,FALSE)","v":"India"},"All the 8 hours baby, all the 8!",15,"USA"]
[null,"ID1775","2012-06-10T02:20:05",85000,85000,"USD",{"$f":"Data!$E1405*VLOOKUP(Data!$F1405,tblXrate[],2,FALSE)","v":40000},"purchasing manager","Manager","USA",{"$f":"VLOOKUP(Data!$J1405,tblCountries[[Actual]:[Mapping]],2,FALSE)","v":"USA"},"2 to 3 hours per day",15,"USA"]
[null,"ID1816","2012-06-12T20:47:33","aud145000",145000,"AUD",{"$f":"Data!$E1440*VLOOKUP(Data!$F1440,tblXrate[],2,FALSE)","v":45000},"Financial controller","Controller","Australia",{"$f":"VLOOKUP(Data!$J1440,tblCountries[[Actual]:[Mapping]],2,FALSE)","v":"USA"},"2 to 3 hours per day",15,"Australia"]
[null,"ID1839","2012-06-14T01:55:13",60000,60000,"USD",{"$f":"Data!$E1460*VLOOKUP(Data!$F1460,tblXrate[],2,FALSE)","v":65000},"Business Analyst","Analyst","USA",{"$f":"VLOOKUP(Data!$J1460,tblCountries[[Actual]:[Mapping]],2,FALSE)","v":"USA"},"4 to 6 hours a day",15,"USA"]
[null,"ID1847","2012-06-15T00:35:45",50000,50000,"USD",{"$f":"Data!$E1466*VLOOKUP(Data!$F1466,tblXrate[],2,FALSE)","v":7479.3250087258784},"Digital Media Analyst","Analyst","USA",{"$f":"VLOOKUP(Data!$J1466,tblCountries[[Actual]:[Mapping]],2,FALSE)","v":"India"},"All the 8 hours baby, all the 8!",15,"USA"]
[null,"ID1852","2012-06-15T02:30:11","US$ 85000",85000,"USD",{"$f":"Data!$E1470*VLOOKUP(Data!$F1470,tblXrate[],2,FALSE)","v":60000},"Chief Financial Officer","CXO or Top Mgmt.","USA",{"$f":"VLOOKUP(Data!$J1470,tblCountries[[Actual]:[Mapping]],2,FALSE)","v":"USA"},"2 to 3 hours per day",15,"USA"]
[null,"ID1922","2012-06-20T05:03:44",115000,115000,"USD",{"$f":"Data!$E1527*VLOOKUP(Data!$F1527,tblXrate[],2,FALSE)","v":67775.665698893223},"Business Analyst","Analyst","USA",{"$f":"VLOOKUP(Data!$J1527,tblCountries[[Actual]:[Mapping]],2,FALSE)","v":"UK"},"All the 8 hours baby, all the 8!",15,"USA"]
[null,"ID0671","2012-05-26T12:53:43","Us$24000",24000,"USD",{"$f":"Data!$E1634*VLOOKUP(Data!$F1634,tblXrate[],2,FALSE)","v":44200},"Accountant","Accountant","UAE","Other Countries","2 to 3 hours per day",15,"UAE"]
[null,"ID0721","2012-05-26T14:51:02",85000,85000,"NZD",{"$f":"Data!$E1642*VLOOKUP(Data!$F1642,tblXrate[],2,FALSE)","v":25000},"Systems Manager","Manager","New Zealand","Other Countries","4 to 6 hours a day",15,"New Zealand"]
[null,"ID0763","2012-05-26T17:07:30",20000,20000,"USD",{"$f":"Data!$E1651*VLOOKUP(Data!$F1651,tblXrate[],2,FALSE)","v":194000},"Consultat","Consultant","Denmark","Other Countries","2 to 3 hours per day",15,"Denmark"]
[null,"ID0811","2012-05-26T22:02:53",5000,60000,"USD",{"$f":"Data!$E1659*VLOOKUP(Data!$F1659,tblXrate[],2,FALSE)","v":46000},"Audit Manager","Manager","UAE","Other Countries","2 to 3 hours per day",15,"UAE"]
[null,"ID0863","2012-05-27T04:07:07",12000,12000,"USD",{"$f":"Data!$E1669*VLOOKUP(Data!$F1669,tblXrate[],2,FALSE)","v":100000},"Guide for About.com","Consultant","Spain","Other Countries","2 to 3 hours per day",15,"Spain"]
[null,"ID0892","2012-05-27T13:45:47",36500,36500,"USD",{"$f":"Data!$E1681*VLOOKUP(Data!$F1681,tblXrate[],2,FALSE)","v":56000},"Accountant","Accountant","Saudi Arabia","Other Countries","4 to 6 hours a day",15,"Saudi Arabia"]
[null,"ID0933","2012-05-27T22:35:22",42000,42000,"USD",{"$f":"Data!$E1691*VLOOKUP(Data!$F1691,tblXrate[],2,FALSE)","v":4273.9000049862161},"Credit Controller","Controller","Saudi Arabia","Other Countries","All the 8 hours baby, all the 8!",15,"Saudi Arabia"]
[null,"ID1021","2012-05-28T12:15:53","SGD92,000",92000,"SGD",{"$f":"Data!$E1715*VLOOKUP(Data!$F1715,tblXrate[],2,FALSE)","v":60000},"Finance Manager","Manager","Singapore","Other Countries","All the 8 hours baby, all the 8!",15,"Singapore"]
[null,"ID1108","2012-05-28T16:35:19",57000,57000,"EUR",{"$f":"Data!$E1728*VLOOKUP(Data!$F1728,tblXrate[],2,FALSE)","v":150000},"Spare Part Coordinator","Manager","Norway","Other Countries","1 or 2 hours a day",15,"Norway"]
[null,"ID1116","2012-05-28T17:04:04","R100,000",100000,"ZAR",{"$f":"Data!$E1730*VLOOKUP(Data!$F1730,tblXrate[],2,FALSE)","v":70000},"Q.A.Officer","Manager","South Africa","Other Countries","All the 8 hours baby, all the 8!",15,"South Africa"]
[null,"ID1143","2012-05-28T19:09:37",30000,30000,"EUR",{"$f":"Data!$E1738*VLOOKUP(Data!$F1738,tblXrate[],2,FALSE)","v":92994.518051969761},"Translator","Analyst","Belgium","Other Countries","1 or 2 hours a day",15,"Belgium"]
[null,"ID1158","2012-05-28T21:14:25","R366252",366252,"ZAR",{"$f":"Data!$E1743*VLOOKUP(Data!$F1743,tblXrate[],2,FALSE)","v":20000},"Accountant","Accountant","South Africa","Other Countries","All the 8 hours baby, all the 8!",15,"South Africa"]
[null,"ID1256","2012-05-29T07:21:41",50700,50700,"USD",{"$f":"Data!$E1767*VLOOKUP(Data!$F1767,tblXrate[],2,FALSE)","v":15000},"Sr. Systems Analyst","Analyst","Brazil","Other Countries","1 or 2 hours a day",15,"Brazil"]
[null,"ID1298","2012-05-29T13:16:59","30000 EUR",30000,"EUR",{"$f":"Data!$E1776*VLOOKUP(Data!$F1776,tblXrate[],2,FALSE)","v":82300},"Employee","Analyst","Belgium","Other Countries","2 to 3 hours per day",15,"Belgium"]
[null,"ID1335","2012-05-29T16:55:43",80000,80000,"NZD",{"$f":"Data!$E1785*VLOOKUP(Data!$F1785,tblXrate[],2,FALSE)","v":8013.5625093491553},"accountant","Accountant","new zealand","Other Countries","All the 8 hours baby, all the 8!",15,"New Zealand"]
[null,"ID1394","2012-05-29T22:04:09",180000,180000,"EUR",{"$f":"Data!$E1796*VLOOKUP(Data!$F1796,tblXrate[],2,FALSE)","v":60000},"MIS Controller","Controller","Europe","Other Countries","4 to 6 hours a day",15,"Europe"]
[null,"ID1508","2012-05-31T00:36:30",50000,50000,"EUR",{"$f":"Data!$E1814*VLOOKUP(Data!$F1814,tblXrate[],2,FALSE)","v":54627.175876639136},"accountant","Accountant","italy","Other Countries","All the 8 hours baby, all the 8!",15,"italy"]
[null,"ID1543","2012-05-31T16:25:24",320000,320000,"SAR",{"$f":"Data!$E1819*VLOOKUP(Data!$F1819,tblXrate[],2,FALSE)","v":31330},"Merchandise Planning Manager","Manager","Saudi Arabia","Other Countries","2 to 3 hours per day",15,"Saudi Arabia"]
[null,"ID1557","2012-05-31T21:48:35",1200,14400,"USD",{"$f":"Data!$E1823*VLOOKUP(Data!$F1823,tblXrate[],2,FALSE)","v":48000},"FA /financial Analyst","Analyst","Bulgaria","Other Countries","All the 8 hours baby, all the 8!",15,"Bulgaria"]
[null,"ID1578","2012-06-01T05:37:32",240000,240000,"PHP",{"$f":"Data!$E1827*VLOOKUP(Data!$F1827,tblXrate[],2,FALSE)","v":50000},"IT Coordinator","Manager","Philippines","Other Countries","4 to 6 hours a day",15,"Philippines"]
[null,"ID1609","2012-06-02T01:43:24",2300,27600,"EUR",{"$f":"Data!$E1833*VLOOKUP(Data!$F1833,tblXrate[],2,FALSE)","v":138000},"controller","Controller","Hungary","Other Countries","All the 8 hours baby, all the 8!",15,"Hungary"]
[null,"ID1774","2012-06-10T01:48:44",1400,16800,"EUR",{"$f":"Data!$E1863*VLOOKUP(Data!$F1863,tblXrate[],2,FALSE)","v":8500},"account","Accountant","portugal","Other Countries","4 to 6 hours a day",15,"Portugal"]
[null,"ID1884","2012-06-17T04:02:00","US$100,000",100000,"USD",{"$f":"Data!$E1880*VLOOKUP(Data!$F1880,tblXrate[],2,FALSE)","v":12000},"Senior Manager MIS","Manager","UAE","Other Countries","All the 8 hours baby, all the 8!",15,"UAE"]
[null,"ID0588","2012-05-26T07:57:04",106000,106000,"AUD",{"$f":"Data!$E487*VLOOKUP(Data!$F487,tblXrate[],2,FALSE)","v":10239.552095279476},"Pricing and Strategy Specialist","Specialist","Australia",{"$f":"VLOOKUP(Data!$J487,tblCountries[[Actual]:[Mapping]],2,FALSE)","v":"India"},"4 to 6 hours a day",16,"Australia"]
[null,"ID0808","2012-05-26T21:43:54",48000,48000,"USD",{"$f":"Data!$E672*VLOOKUP(Data!$F672,tblXrate[],2,FALSE)","v":10684.750012465542},"Operations Support Coordinator","Manager","USA",{"$f":"VLOOKUP(Data!$J672,tblCountries[[Actual]:[Mapping]],2,FALSE)","v":"India"},"2 to 3 hours per day",16,"USA"]
[null,"ID0918","2012-05-27T18:19:31",64210.1,64210,"GBP",{"$f":"Data!$E749*VLOOKUP(Data!$F749,tblXrate[],2,FALSE)","v":17807.916687442568},"HR Advisor - Systems & MI","Consultant","UK",{"$f":"VLOOKUP(Data!$J749,tblCountries[[Actual]:[Mapping]],2,FALSE)","v":"India"},"4 to 6 hours a day",16,"UK"]
[null,"ID1062","2012-05-28T14:34:37","Â£28000",28000,"GBP",{"$f":"Data!$E849*VLOOKUP(Data!$F849,tblXrate[],2,FALSE)","v":32054.250037396621},"Modeller","Analyst","UK",{"$f":"VLOOKUP(Data!$J849,tblCountries[[Actual]:[Mapping]],2,FALSE)","v":"India"},"2 to 3 hours per day",16,"UK"]
[null,"ID1123","2012-05-28T17:22:19","252000 INR",252000,"INR",{"$f":"Data!$E902*VLOOKUP(Data!$F902,tblXrate[],2,FALSE)","v":65000},"Inventory Manager","Manager","India",{"$f":"VLOOKUP(Data!$J902,tblCountries[[Actual]:[Mapping]],2,FALSE)","v":"USA"},"1 or 2 hours a day",16,"India"]
[null,"ID1254","2012-05-29T06:24:36",63000,63000,"USD",{"$f":"Data!$E997*VLOOKUP(Data!$F997,tblXrate[],2,FALSE)","v":87456},"Senior Staff Accountant","Accountant","USA",{"$f":"VLOOKUP(Data!$J997,tblCountries[[Actual]:[Mapping]],2,FALSE)","v":"USA"},"All the 8 hours baby, all the 8!",16,"USA"]
[null,"ID1331","2012-05-29T16:31:06",75000,75000,"EUR",{"$f":"Data!$E1052*VLOOKUP(Data!$F1052,tblXrate[],2,FALSE)","v":65000},"Financial Analyst","Analyst","Netherlands",{"$f":"VLOOKUP(Data!$J1052,tblCountries[[Actual]:[Mapping]],2,FALSE)","v":"USA"},"All the 8 hours baby, all the 8!",16,"Netherlands"]
[null,"ID1427","2012-05-30T01:29:51",80442,80442,"USD",{"$f":"Data!$E1133*VLOOKUP(Data!$F1133,tblXrate[],2,FALSE)","v":85000},"Senior Budget Analyst","Analyst","USA",{"$f":"VLOOKUP(Data!$J1133,tblCountries[[Actual]:[Mapping]],2,FALSE)","v":"USA"},"4 to 6 hours a day",16,"USA"]
[null,"ID1687","2012-06-05T18:31:59","200000 INR",200000,"INR",{"$f":"Data!$E1333*VLOOKUP(Data!$F1333,tblXrate[],2,FALSE)","v":30000},"Executive","Analyst","India",{"$f":"VLOOKUP(Data!$J1333,tblCountries[[Actual]:[Mapping]],2,FALSE)","v":"iran"},"1 or 2 hours a day",16,"India"]
[null,"ID1762","2012-06-08T21:00:25",67000,67000,"USD",{"$f":"Data!$E1395*VLOOKUP(Data!$F1395,tblXrate[],2,FALSE)","v":15000},"Manager","Manager","USA",{"$f":"VLOOKUP(Data!$J1395,tblCountries[[Actual]:[Mapping]],2,FALSE)","v":"USA"},"4 to 6 hours a day",16,"USA"]
[null,"ID1789","2012-06-11T16:55:40","Â£26500",26500,"GBP",{"$f":"Data!$E1416*VLOOKUP(Data!$F1416,tblXrate[],2,FALSE)","v":74000},"Compliance Manager","Manager","UK",{"$f":"VLOOKUP(Data!$J1416,tblCountries[[Actual]:[Mapping]],2,FALSE)","v":"USA"},"4 to 6 hours a day",16,"UK"]
[null,"ID1057","2012-05-28T14:22:02","16000 euro",16000,"EUR",{"$f":"Data!$E1723*VLOOKUP(Data!$F1723,tblXrate[],2,FALSE)","v":39404.456801682099},"Management Information Systems","Manager","Greece","Other Countries","All the 8 hours baby, all the 8!",16,"Greece"]
[null,"ID1631","2012-06-02T22:38:56",60000,60000,"USD",{"$f":"Data!$E1835*VLOOKUP(Data!$F1835,tblXrate[],2,FALSE)","v":96000},"Head of Business","Manager","Indonesia","Other Countries","2 to 3 hours per day",16,"Indonesia"]
[null,"ID0605","2012-05-26T09:28:50",65000,65000,"USD",{"$f":"Data!$E501*VLOOKUP(Data!$F501,tblXrate[],2,FALSE)","v":86692.320794224041},"Helicopter Mechanic","Analyst","USA",{"$f":"VLOOKUP(Data!$J501,tblCountries[[Actual]:[Mapping]],2,FALSE)","v":"Australia"},"2 to 3 hours per day",17,"USA"]
[null,"ID0896","2012-05-27T14:27:33","rs 100000",1200000,"INR",{"$f":"Data!$E733*VLOOKUP(Data!$F733,tblXrate[],2,FALSE)","v":5800},"ASST VICE PREDISDENT","CXO or Top Mgmt.","India",{"$f":"VLOOKUP(Data!$J733,tblCountries[[Actual]:[Mapping]],2,FALSE)","v":"India"},"4 to 6 hours a day",17,"India"]
[null,"ID1381","2012-05-29T21:28:07",85000,85000,"USD",{"$f":"Data!$E1092*VLOOKUP(Data!$F1092,tblXrate[],2,FALSE)","v":92500},"Senior Analyst","Analyst","USA",{"$f":"VLOOKUP(Data!$J1092,tblCountries[[Actual]:[Mapping]],2,FALSE)","v":"USA"},"4 to 6 hours a day",17,"USA"]
[null,"ID1492","2012-05-30T20:42:47","AUD 165000",165000,"AUD",{"$f":"Data!$E1187*VLOOKUP(Data!$F1187,tblXrate[],2,FALSE)","v":21369.500024931083},"Engineer","Engineer","Australia",{"$f":"VLOOKUP(Data!$J1187,tblCountries[[Actual]:[Mapping]],2,FALSE)","v":"India"},"2 to 3 hours per day",17,"Australia"]
[null,"ID1554","2012-05-31T21:06:45",70970,70970,"USD",{"$f":"Data!$E1233*VLOOKUP(Data!$F1233,tblXrate[],2,FALSE)","v":250000},"Sr. Risk Analyst","Analyst","USA",{"$f":"VLOOKUP(Data!$J1233,tblCountries[[Actual]:[Mapping]],2,FALSE)","v":"USA"},"4 to 6 hours a day",17,"USA"]
[null,"ID1664","2012-06-04T19:11:18","Â£22k",22000,"GBP",{"$f":"Data!$E1319*VLOOKUP(Data!$F1319,tblXrate[],2,FALSE)","v":300000},"Supply/Demand Planner","Manager","UK",{"$f":"VLOOKUP(Data!$J1319,tblCountries[[Actual]:[Mapping]],2,FALSE)","v":"USA"},"4 to 6 hours a day",17,"UK"]
[null,"ID1162","2012-05-28T22:10:12",30000,30000,"USD",{"$f":"Data!$E1744*VLOOKUP(Data!$F1744,tblXrate[],2,FALSE)","v":6000},"pricing and cost manager","Manager","mexico","Other Countries","All the 8 hours baby, all the 8!",17,"Mexico"]
[null,"ID1247","2012-05-29T05:03:26","dkk 450000",450000,"DKK",{"$f":"Data!$E1765*VLOOKUP(Data!$F1765,tblXrate[],2,FALSE)","v":61000},"owner","CXO or Top Mgmt.","Denmark","Other Countries","All the 8 hours baby, all the 8!",17,"Denmark"]
[null,"ID1305","2012-05-29T13:58:30","US$ 100,000",100000,"USD",{"$f":"Data!$E1777*VLOOKUP(Data!$F1777,tblXrate[],2,FALSE)","v":95000},"Business Analyst","Analyst","Uganda","Other Countries","4 to 6 hours a day",17,"Uganda"]
[null,"ID0606","2012-05-26T09:36:28",70000,70000,"USD",{"$f":"Data!$E502*VLOOKUP(Data!$F502,tblXrate[],2,FALSE)","v":30000},"Program/Mgt Analyst","Analyst","USA",{"$f":"VLOOKUP(Data!$J502,tblCountries[[Actual]:[Mapping]],2,FALSE)","v":"Pakistan"},"2 to 3 hours per day",18,"USA"]
[null,"ID0683","2012-05-26T13:08:39",52000,52000,"USD",{"$f":"Data!$E568*VLOOKUP(Data!$F568,tblXrate[],2,FALSE)","v":152986.44846039536},"Maint Sys Support Specialist","Specialist","USA",{"$f":"VLOOKUP(Data!$J568,tblCountries[[Actual]:[Mapping]],2,FALSE)","v":"Australia"},"4 to 6 hours a day",18,"USA"]
[null,"ID0836","2012-05-26T23:36:14","Rs. 6,00,000",600000,"INR",{"$f":"Data!$E692*VLOOKUP(Data!$F692,tblXrate[],2,FALSE)","v":11753.225013712095},"Project Manager","Manager","India",{"$f":"VLOOKUP(Data!$J692,tblCountries[[Actual]:[Mapping]],2,FALSE)","v":"India"},"2 to 3 hours per day",18,"India"]
[null,"ID0845","2012-05-27T00:33:06","1200000 Rs",1200000,"INR",{"$f":"Data!$E699*VLOOKUP(Data!$F699,tblXrate[],2,FALSE)","v":50000},"project manager","Manager","India",{"$f":"VLOOKUP(Data!$J699,tblCountries[[Actual]:[Mapping]],2,FALSE)","v":"USA"},"1 or 2 hours a day",18,"India"]
[null,"ID1173","2012-05-28T22:41:26","8725 $",8725,"USD",{"$f":"Data!$E937*VLOOKUP(Data!$F937,tblXrate[],2,FALSE)","v":5000},"Administration Officer","Manager","Pakistan",{"$f":"VLOOKUP(Data!$J937,tblCountries[[Actual]:[Mapping]],2,FALSE)","v":"India"},"2 to 3 hours per day",18,"Pakistan"]
[null,"ID1265","2012-05-29T08:47:48",40000,40000,"USD",{"$f":"Data!$E1004*VLOOKUP(Data!$F1004,tblXrate[],2,FALSE)","v":14000},"Senior Materials Handler","Manager","USA",{"$f":"VLOOKUP(Data!$J1004,tblCountries[[Actual]:[Mapping]],2,FALSE)","v":"India"},"2 to 3 hours per day",18,"USA"]
[null,"ID1443","2012-05-30T10:11:19",96230,96230,"USD",{"$f":"Data!$E1148*VLOOKUP(Data!$F1148,tblXrate[],2,FALSE)","v":12192.177986291113},"Manager, Data Management","Manager","USA",{"$f":"VLOOKUP(Data!$J1148,tblCountries[[Actual]:[Mapping]],2,FALSE)","v":"South Africa"},"4 to 6 hours a day",18,"USA"]
[null,"ID1523","2012-05-31T05:31:54",170000,170000,"USD",{"$f":"Data!$E1209*VLOOKUP(Data!$F1209,tblXrate[],2,FALSE)","v":64901.860520001574},"CFO","CXO or Top Mgmt.","USA",{"$f":"VLOOKUP(Data!$J1209,tblCountries[[Actual]:[Mapping]],2,FALSE)","v":"Canada"},"2 to 3 hours per day",18,"USA"]
[null,"ID1539","2012-05-31T16:00:16",8000,8000,"USD",{"$f":"Data!$E1221*VLOOKUP(Data!$F1221,tblXrate[],2,FALSE)","v":75000},"Owner","CXO or Top Mgmt.","India",{"$f":"VLOOKUP(Data!$J1221,tblCountries[[Actual]:[Mapping]],2,FALSE)","v":"USA"},"4 to 6 hours a day",18,"India"]
[null,"ID1872","2012-06-16T02:50:49",54000,54000,"USD",{"$f":"Data!$E1485*VLOOKUP(Data!$F1485,tblXrate[],2,FALSE)","v":40000},"materials","Analyst","USA",{"$f":"VLOOKUP(Data!$J1485,tblCountries[[Actual]:[Mapping]],2,FALSE)","v":"USA"},"4 to 6 hours a day",18,"USA"]
[null,"ID0778","2012-05-26T18:38:41",55000,55000,"EUR",{"$f":"Data!$E1655*VLOOKUP(Data!$F1655,tblXrate[],2,FALSE)","v":94570.696324037053},"CFO","CXO or Top Mgmt.","italy","Other Countries","2 to 3 hours per day",18,"italy"]
[null,"ID0878","2012-05-27T11:50:16",1000,12000,"USD",{"$f":"Data!$E1676*VLOOKUP(Data!$F1676,tblXrate[],2,FALSE)","v":52000},"sup","Manager","UAE","Other Countries","All the 8 hours baby, all the 8!",18,"UAE"]
[null,"ID1638","2012-06-03T07:16:47","485000 DKK",485000,"DKK",{"$f":"Data!$E1839*VLOOKUP(Data!$F1839,tblXrate[],2,FALSE)","v":14000},"Controller","Controller","Denmark","Other Countries","4 to 6 hours a day",18,"Denmark"]
[null,"ID1481","2012-05-30T18:47:17","US $ 3200",3200,"USD",{"$f":"Data!$E1178*VLOOKUP(Data!$F1178,tblXrate[],2,FALSE)","v":168285.09330643489},"Regional Business Manager ","Manager","India",{"$f":"VLOOKUP(Data!$J1178,tblCountries[[Actual]:[Mapping]],2,FALSE)","v":"Australia"},"All the 8 hours baby, all the 8!",19,"India"]
[null,"ID0563","2012-05-26T06:10:08",188000,188000,"USD",{"$f":"Data!$E465*VLOOKUP(Data!$F465,tblXrate[],2,FALSE)","v":4487.5950052355274},"Director, Supply Chain Operations","CXO or Top Mgmt.","USA",{"$f":"VLOOKUP(Data!$J465,tblCountries[[Actual]:[Mapping]],2,FALSE)","v":"India"},"1 or 2 hours a day",20,"USA"]
[null,"ID0569","2012-05-26T06:47:00","AUD $155,000",155000,"AUD",{"$f":"Data!$E471*VLOOKUP(Data!$F471,tblXrate[],2,FALSE)","v":21369.500024931083},"Finance Manager Business Services","Manager","Australia",{"$f":"VLOOKUP(Data!$J471,tblCountries[[Actual]:[Mapping]],2,FALSE)","v":"India"},"4 to 6 hours a day",20,"Australia"]
[null,"ID0602","2012-05-26T08:56:13","90 k",90000,"USD",{"$f":"Data!$E498*VLOOKUP(Data!$F498,tblXrate[],2,FALSE)","v":61000},"Operations","Manager","USA",{"$f":"VLOOKUP(Data!$J498,tblCountries[[Actual]:[Mapping]],2,FALSE)","v":"USA"},"2 to 3 hours per day",20,"USA"]
[null,"ID0609","2012-05-26T09:52:22",100000,100000,"AUD",{"$f":"Data!$E504*VLOOKUP(Data!$F504,tblXrate[],2,FALSE)","v":69871.969144538423},"Purchasing Manager","Manager","Australia",{"$f":"VLOOKUP(Data!$J504,tblCountries[[Actual]:[Mapping]],2,FALSE)","v":"Netherlands"},"2 to 3 hours per day",20,"Australia"]
[null,"ID0623","2012-05-26T11:03:02","A$85000",85000,"AUD",{"$f":"Data!$E516*VLOOKUP(Data!$F516,tblXrate[],2,FALSE)","v":6054.6916737304728},"Trainer","Consultant","Australia",{"$f":"VLOOKUP(Data!$J516,tblCountries[[Actual]:[Mapping]],2,FALSE)","v":"India"},"1 or 2 hours a day",20,"Australia"]
[null,"ID0624","2012-05-26T11:03:06",50000,50000,"USD",{"$f":"Data!$E517*VLOOKUP(Data!$F517,tblXrate[],2,FALSE)","v":3419.1200039889732},"Project coordinator","Manager","USA",{"$f":"VLOOKUP(Data!$J517,tblCountries[[Actual]:[Mapping]],2,FALSE)","v":"India"},"4 to 6 hours a day",20,"USA"]
[null,"ID0634","2012-05-26T11:31:08",125000,125000,"USD",{"$f":"Data!$E526*VLOOKUP(Data!$F526,tblXrate[],2,FALSE)","v":14000},"Analyst","Analyst","USA",{"$f":"VLOOKUP(Data!$J526,tblCountries[[Actual]:[Mapping]],2,FALSE)","v":"India"},"2 to 3 hours per day",20,"USA"]
[null,"ID0681","2012-05-26T13:03:58",100000,100000,"AUD",{"$f":"Data!$E566*VLOOKUP(Data!$F566,tblXrate[],2,FALSE)","v":60000},"principal developer","Manager","Australia",{"$f":"VLOOKUP(Data!$J566,tblCountries[[Actual]:[Mapping]],2,FALSE)","v":"UAE"},"1 or 2 hours a day",20,"Australia"]
[null,"ID0690","2012-05-26T13:19:42",50000,50000,"USD",{"$f":"Data!$E574*VLOOKUP(Data!$F574,tblXrate[],2,FALSE)","v":15136.729184326183},"AREA SALES MANAGER","Manager","India",{"$f":"VLOOKUP(Data!$J574,tblCountries[[Actual]:[Mapping]],2,FALSE)","v":"India"},"2 to 3 hours per day",20,"India"]
[null,"ID0760","2012-05-26T17:03:26","INR 20000",240000,"INR",{"$f":"Data!$E632*VLOOKUP(Data!$F632,tblXrate[],2,FALSE)","v":81000},"EXECUTIVE","Analyst","India",{"$f":"VLOOKUP(Data!$J632,tblCountries[[Actual]:[Mapping]],2,FALSE)","v":"USA"},"2 to 3 hours per day",20,"India"]
[null,"ID0764","2012-05-26T17:08:09",62000,62000,"USD",{"$f":"Data!$E635*VLOOKUP(Data!$F635,tblXrate[],2,FALSE)","v":67000},"System Analyst ","Analyst","USA",{"$f":"VLOOKUP(Data!$J635,tblCountries[[Actual]:[Mapping]],2,FALSE)","v":"USA"},"2 to 3 hours per day",20,"USA"]
[null,"ID0790","2012-05-26T20:16:28","CA$66000",66000,"CAD",{"$f":"Data!$E656*VLOOKUP(Data!$F656,tblXrate[],2,FALSE)","v":56628.754645950656},"Programmer-analyst","Analyst","Canada",{"$f":"VLOOKUP(Data!$J656,tblCountries[[Actual]:[Mapping]],2,FALSE)","v":"New Zealand"},"2 to 3 hours per day",20,"Canada"]
[null,"ID0831","2012-05-26T23:05:15",40000,40000,"USD",{"$f":"Data!$E689*VLOOKUP(Data!$F689,tblXrate[],2,FALSE)","v":112190.06220428993},"High School Teacher","Manager","USA",{"$f":"VLOOKUP(Data!$J689,tblCountries[[Actual]:[Mapping]],2,FALSE)","v":"Australia"},"2 to 3 hours per day",20,"USA"]
[null,"ID0835","2012-05-26T23:21:57","Rs.6,00,000/-",600000,"INR",{"$f":"Data!$E691*VLOOKUP(Data!$F691,tblXrate[],2,FALSE)","v":26711.875031163851},"AO","Manager","India",{"$f":"VLOOKUP(Data!$J691,tblCountries[[Actual]:[Mapping]],2,FALSE)","v":"India"},"All the 8 hours baby, all the 8!",20,"India"]
[null,"ID0844","2012-05-27T00:19:04",100000,100000,"GBP",{"$f":"Data!$E698*VLOOKUP(Data!$F698,tblXrate[],2,FALSE)","v":77500},"Financial Controller","Controller","UK",{"$f":"VLOOKUP(Data!$J698,tblCountries[[Actual]:[Mapping]],2,FALSE)","v":"USA"},"2 to 3 hours per day",20,"UK"]
[null,"ID0930","2012-05-27T21:49:55",105000,105000,"USD",{"$f":"Data!$E757*VLOOKUP(Data!$F757,tblXrate[],2,FALSE)","v":21369.500024931083},"business analyst","Analyst","USA",{"$f":"VLOOKUP(Data!$J757,tblCountries[[Actual]:[Mapping]],2,FALSE)","v":"India"},"4 to 6 hours a day",20,"USA"]
[null,"ID0965","2012-05-28T05:48:56",95000,95000,"AUD",{"$f":"Data!$E774*VLOOKUP(Data!$F774,tblXrate[],2,FALSE)","v":15761.782720672842},"financial analyst","Analyst","Australia",{"$f":"VLOOKUP(Data!$J774,tblCountries[[Actual]:[Mapping]],2,FALSE)","v":"UK"},"2 to 3 hours per day",20,"Australia"]
[null,"ID0994","2012-05-28T09:21:56",100000,100000,"AUD",{"$f":"Data!$E799*VLOOKUP(Data!$F799,tblXrate[],2,FALSE)","v":38111.983169748237},"Reporting Analyst","Analyst","Australia",{"$f":"VLOOKUP(Data!$J799,tblCountries[[Actual]:[Mapping]],2,FALSE)","v":"Portugal"},"4 to 6 hours a day",20,"Australia"]
[null,"ID1099","2012-05-28T16:10:52","Rs. 20000",240000,"INR",{"$f":"Data!$E884*VLOOKUP(Data!$F884,tblXrate[],2,FALSE)","v":36252.100257547536},"Accountant","Accountant","India",{"$f":"VLOOKUP(Data!$J884,tblCountries[[Actual]:[Mapping]],2,FALSE)","v":"UK"},"All the 8 hours baby, all the 8!",20,"India"]
[null,"ID1107","2012-05-28T16:34:48","Â£40000",40000,"GBP",{"$f":"Data!$E890*VLOOKUP(Data!$F890,tblXrate[],2,FALSE)","v":74000},"Buyer","Manager","UK",{"$f":"VLOOKUP(Data!$J890,tblCountries[[Actual]:[Mapping]],2,FALSE)","v":"USA"},"1 or 2 hours a day",20,"UK"]
[null,"ID1152","2012-05-28T20:20:54",35000,35000,"USD",{"$f":"Data!$E921*VLOOKUP(Data!$F921,tblXrate[],2,FALSE)","v":32884},"BI Analyst","Analyst","USA",{"$f":"VLOOKUP(Data!$J921,tblCountries[[Actual]:[Mapping]],2,FALSE)","v":"USA"},"All the 8 hours baby, all the 8!",20,"USA"]
[null,"ID1159","2012-05-28T21:17:04",69000,69000,"USD",{"$f":"Data!$E926*VLOOKUP(Data!$F926,tblXrate[],2,FALSE)","v":88000},"Financial Analysist","Analyst","USA",{"$f":"VLOOKUP(Data!$J926,tblCountries[[Actual]:[Mapping]],2,FALSE)","v":"USA"},"2 to 3 hours per day",20,"USA"]
[null,"ID1166","2012-05-28T22:35:56","CAD$65000",65000,"CAD",{"$f":"Data!$E931*VLOOKUP(Data!$F931,tblXrate[],2,FALSE)","v":78808.913603364199},"IT Analyst (Reporting)","Analyst","Canada",{"$f":"VLOOKUP(Data!$J931,tblCountries[[Actual]:[Mapping]],2,FALSE)","v":"UK"},"4 to 6 hours a day",20,"Canada"]
[null,"ID1167","2012-05-28T22:36:22",75000,75000,"USD",{"$f":"Data!$E932*VLOOKUP(Data!$F932,tblXrate[],2,FALSE)","v":24931.083362419595},"Controller","Controller","USA",{"$f":"VLOOKUP(Data!$J932,tblCountries[[Actual]:[Mapping]],2,FALSE)","v":"India"},"2 to 3 hours per day",20,"USA"]
[null,"ID1200","2012-05-28T23:47:10",19000,19000,"USD",{"$f":"Data!$E956*VLOOKUP(Data!$F956,tblXrate[],2,FALSE)","v":50815.977559664309},"Accountant","Accountant","UK",{"$f":"VLOOKUP(Data!$J956,tblCountries[[Actual]:[Mapping]],2,FALSE)","v":"Portugal"},"4 to 6 hours a day",20,"UK"]
[null,"ID1240","2012-05-29T03:51:28",75000,75000,"GBP",{"$f":"Data!$E987*VLOOKUP(Data!$F987,tblXrate[],2,FALSE)","v":47004.779242689488},"Finance Manager","Manager","UK",{"$f":"VLOOKUP(Data!$J987,tblCountries[[Actual]:[Mapping]],2,FALSE)","v":"Spain"},"4 to 6 hours a day",20,"UK"]
[null,"ID1271","2012-05-29T09:38:14",69000,69000,"USD",{"$f":"Data!$E1009*VLOOKUP(Data!$F1009,tblXrate[],2,FALSE)","v":61000},"master scheduler","Controller","USA",{"$f":"VLOOKUP(Data!$J1009,tblCountries[[Actual]:[Mapping]],2,FALSE)","v":"USA"},"4 to 6 hours a day",20,"USA"]
[null,"ID1316","2012-05-29T15:10:24",13500,13500,"USD",{"$f":"Data!$E1043*VLOOKUP(Data!$F1043,tblXrate[],2,FALSE)","v":10898.445012714852},"Asst. Manager","Manager","India",{"$f":"VLOOKUP(Data!$J1043,tblCountries[[Actual]:[Mapping]],2,FALSE)","v":"India"},"2 to 3 hours per day",20,"India"]
[null,"ID1375","2012-05-29T20:40:12","$60,000 USD",60000,"USD",{"$f":"Data!$E1086*VLOOKUP(Data!$F1086,tblXrate[],2,FALSE)","v":40000},"project manager","Manager","USA",{"$f":"VLOOKUP(Data!$J1086,tblCountries[[Actual]:[Mapping]],2,FALSE)","v":"India"},"2 to 3 hours per day",20,"USA"]
[null,"ID1421","2012-05-30T01:05:26",45000,45000,"USD",{"$f":"Data!$E1127*VLOOKUP(Data!$F1127,tblXrate[],2,FALSE)","v":50000},"Technical Support Specialist","Specialist","USA",{"$f":"VLOOKUP(Data!$J1127,tblCountries[[Actual]:[Mapping]],2,FALSE)","v":"USA"},"4 to 6 hours a day",20,"USA"]
[null,"ID1424","2012-05-30T01:15:32",72000,72000,"USD",{"$f":"Data!$E1130*VLOOKUP(Data!$F1130,tblXrate[],2,FALSE)","v":55000},"Manager","Manager","USA",{"$f":"VLOOKUP(Data!$J1130,tblCountries[[Actual]:[Mapping]],2,FALSE)","v":"USA"},"1 or 2 hours a day",20,"USA"]
[null,"ID1435","2012-05-30T02:32:17",80000,80000,"USD",{"$f":"Data!$E1141*VLOOKUP(Data!$F1141,tblXrate[],2,FALSE)","v":20000},"Senior analyst, ops support","Analyst","USA",{"$f":"VLOOKUP(Data!$J1141,tblCountries[[Actual]:[Mapping]],2,FALSE)","v":"Denmark"},"4 to 6 hours a day",20,"USA"]
[null,"ID1449","2012-05-30T12:12:38",67000,67000,"USD",{"$f":"Data!$E1153*VLOOKUP(Data!$F1153,tblXrate[],2,FALSE)","v":63807.047488395103},"accounting systems manager ","Manager","USA",{"$f":"VLOOKUP(Data!$J1153,tblCountries[[Actual]:[Mapping]],2,FALSE)","v":"New Zealand"},"2 to 3 hours per day",20,"USA"]
[null,"ID1476","2012-05-30T17:07:47","Â£37000",37000,"GBP",{"$f":"Data!$E1174*VLOOKUP(Data!$F1174,tblXrate[],2,FALSE)","v":60000},"Planning & Scheduling Manager","Manager","UK",{"$f":"VLOOKUP(Data!$J1174,tblCountries[[Actual]:[Mapping]],2,FALSE)","v":"Indonesia"},"All the 8 hours baby, all the 8!",20,"UK"]
[null,"ID1498","2012-05-30T21:45:06",74000,74000,"AUD",{"$f":"Data!$E1190*VLOOKUP(Data!$F1190,tblXrate[],2,FALSE)","v":96230},"operations Administrator","Analyst","Australia",{"$f":"VLOOKUP(Data!$J1190,tblCountries[[Actual]:[Mapping]],2,FALSE)","v":"USA"},"All the 8 hours baby, all the 8!",20,"Australia"]
[null,"ID1516","2012-05-31T02:37:09",250000,250000,"USD",{"$f":"Data!$E1204*VLOOKUP(Data!$F1204,tblXrate[],2,FALSE)","v":125000},"consultant","Consultant","USA",{"$f":"VLOOKUP(Data!$J1204,tblCountries[[Actual]:[Mapping]],2,FALSE)","v":"USA"},"All the 8 hours baby, all the 8!",20,"USA"]
[null,"ID1584","2012-06-01T07:22:36",100000,100000,"AUD",{"$f":"Data!$E1254*VLOOKUP(Data!$F1254,tblXrate[],2,FALSE)","v":127039.94389916077},"Management Accountant","Manager","Australia",{"$f":"VLOOKUP(Data!$J1254,tblCountries[[Actual]:[Mapping]],2,FALSE)","v":"Spain"},"4 to 6 hours a day",20,"Australia"]
[null,"ID1613","2012-06-02T03:13:57",35500,35500,"USD",{"$f":"Data!$E1278*VLOOKUP(Data!$F1278,tblXrate[],2,FALSE)","v":7000},"SAS Adminstrator","Analyst","USA",{"$f":"VLOOKUP(Data!$J1278,tblCountries[[Actual]:[Mapping]],2,FALSE)","v":"India"},"4 to 6 hours a day",20,"USA"]
[null,"ID1661","2012-06-04T16:31:09","Rs. 5 lacs",500000,"INR",{"$f":"Data!$E1316*VLOOKUP(Data!$F1316,tblXrate[],2,FALSE)","v":10684.750012465542},"Team Leader","Manager","India",{"$f":"VLOOKUP(Data!$J1316,tblCountries[[Actual]:[Mapping]],2,FALSE)","v":"India"},"All the 8 hours baby, all the 8!",20,"India"]
[null,"ID1730","2012-06-07T08:36:51",134000,134000,"CAD",{"$f":"Data!$E1365*VLOOKUP(Data!$F1365,tblXrate[],2,FALSE)","v":30000},"Senior Production Accountant","Accountant","Canada",{"$f":"VLOOKUP(Data!$J1365,tblCountries[[Actual]:[Mapping]],2,FALSE)","v":"USA"},"All the 8 hours baby, all the 8!",20,"Canada"]
[null,"ID1751","2012-06-08T09:46:59",85000,85000,"USD",{"$f":"Data!$E1384*VLOOKUP(Data!$F1384,tblXrate[],2,FALSE)","v":68000},"Actuary","Accountant","USA",{"$f":"VLOOKUP(Data!$J1384,tblCountries[[Actual]:[Mapping]],2,FALSE)","v":"USA"},"4 to 6 hours a day",20,"USA"]
[null,"ID1761","2012-06-08T20:47:58",45000,45000,"GBP",{"$f":"Data!$E1394*VLOOKUP(Data!$F1394,tblXrate[],2,FALSE)","v":58460.842544152933},"bUSINESS aNALYST","Analyst","UK",{"$f":"VLOOKUP(Data!$J1394,tblCountries[[Actual]:[Mapping]],2,FALSE)","v":"Canada"},"All the 8 hours baby, all the 8!",20,"UK"]
[null,"ID1813","2012-06-12T18:09:58","Â£32000",32000,"GBP",{"$f":"Data!$E1437*VLOOKUP(Data!$F1437,tblXrate[],2,FALSE)","v":65000},"Business Analyst","Analyst","UK",{"$f":"VLOOKUP(Data!$J1437,tblCountries[[Actual]:[Mapping]],2,FALSE)","v":"USA"},"4 to 6 hours a day",20,"UK"]
[null,"ID1825","2012-06-13T03:23:05","$214,000  USD",214000,"USD",{"$f":"Data!$E1448*VLOOKUP(Data!$F1448,tblXrate[],2,FALSE)","v":60968.414427880263},"Assistant Corporate Controller","Controller","USA",{"$f":"VLOOKUP(Data!$J1448,tblCountries[[Actual]:[Mapping]],2,FALSE)","v":"Canada"},"All the 8 hours baby, all the 8!",20,"USA"]
[null,"ID1828","2012-06-13T04:40:03",33250,33250,"USD",{"$f":"Data!$E1451*VLOOKUP(Data!$F1451,tblXrate[],2,FALSE)","v":104000},"Planning and Logistics Coordinator","Manager","USA",{"$f":"VLOOKUP(Data!$J1451,tblCountries[[Actual]:[Mapping]],2,FALSE)","v":"USA"},"All the 8 hours baby, all the 8!",20,"USA"]
[null,"ID1830","2012-06-13T06:19:24",120000,120000,"USD",{"$f":"Data!$E1452*VLOOKUP(Data!$F1452,tblXrate[],2,FALSE)","v":57000},"Financial Modeler","Accountant","USA",{"$f":"VLOOKUP(Data!$J1452,tblCountries[[Actual]:[Mapping]],2,FALSE)","v":"USA"},"4 to 6 hours a day",20,"USA"]
[null,"ID1882","2012-06-16T22:24:30",20500,20500,"GBP",{"$f":"Data!$E1494*VLOOKUP(Data!$F1494,tblXrate[],2,FALSE)","v":80000},"analyst","Analyst","UK",{"$f":"VLOOKUP(Data!$J1494,tblCountries[[Actual]:[Mapping]],2,FALSE)","v":"USA"},"4 to 6 hours a day",20,"UK"]
[null,"ID0561","2012-05-26T06:01:57",1300,15600,"USD",{"$f":"Data!$E1624*VLOOKUP(Data!$F1624,tblXrate[],2,FALSE)","v":13000},"CONTROLLER","Controller","BRA","Other Countries","4 to 6 hours a day",20,"Brazil"]
[null,"ID0577","2012-05-26T07:14:02",6000,6000,"USD",{"$f":"Data!$E1626*VLOOKUP(Data!$F1626,tblXrate[],2,FALSE)","v":95000},"In Charge","Manager","Guyana","Other Countries","1 or 2 hours a day",20,"Guyana"]
[null,"ID0615","2012-05-26T10:32:07","1150 $",13800,"USD",{"$f":"Data!$E1630*VLOOKUP(Data!$F1630,tblXrate[],2,FALSE)","v":53000},"QS","Controller","Sri Lanka","Other Countries","4 to 6 hours a day",20,"Sri Lanka"]
[null,"ID0772","2012-05-26T17:47:10","$1,589.00/per month",19068,"USD",{"$f":"Data!$E1653*VLOOKUP(Data!$F1653,tblXrate[],2,FALSE)","v":8903.9583437212841},"Accounting Head","Accountant","Philippines","Other Countries","All the 8 hours baby, all the 8!",20,"Philippines"]
[null,"ID0887","2012-05-27T13:29:52","$125000 / a excl bonus",125000,"USD",{"$f":"Data!$E1679*VLOOKUP(Data!$F1679,tblXrate[],2,FALSE)","v":55166.239522354947},"Commercial Director","CXO or Top Mgmt.","South Africa","Other Countries","4 to 6 hours a day",20,"South Africa"]
[null,"ID0917","2012-05-27T17:24:09",36400,36400,"USD",{"$f":"Data!$E1687*VLOOKUP(Data!$F1687,tblXrate[],2,FALSE)","v":3561.5833374885137},"Analyst","Analyst","Zimbabwe","Other Countries","4 to 6 hours a day",20,"Zimbabwe"]
[null,"ID0963","2012-05-28T05:12:38",150000,150000,"USD",{"$f":"Data!$E1705*VLOOKUP(Data!$F1705,tblXrate[],2,FALSE)","v":80000},"Software Tester","Analyst","Switzerland","Other Countries","1 or 2 hours a day",20,"Switzerland"]
[null,"ID0973","2012-05-28T07:00:25",95000,95000,"NZD",{"$f":"Data!$E1706*VLOOKUP(Data!$F1706,tblXrate[],2,FALSE)","v":53423.750062327701},"Cost Accountant","Accountant","New Zealand","Other Countries","4 to 6 hours a day",20,"New Zealand"]
[null,"ID1059","2012-05-28T14:30:05","ZAR240000",240000,"ZAR",{"$f":"Data!$E1724*VLOOKUP(Data!$F1724,tblXrate[],2,FALSE)","v":60000},"Bookkeeper","Accountant","South Africa","Other Countries","2 to 3 hours per day",20,"South Africa"]
[null,"ID1137","2012-05-28T18:38:06",100000,100000,"EUR",{"$f":"Data!$E1737*VLOOKUP(Data!$F1737,tblXrate[],2,FALSE)","v":169000},"Finance Director","CXO or Top Mgmt.","Spain","Other Countries","1 or 2 hours a day",20,"Spain"]
[null,"ID1147","2012-05-28T19:25:35",90000,90000,"EUR",{"$f":"Data!$E1739*VLOOKUP(Data!$F1739,tblXrate[],2,FALSE)","v":50000},"Management Information Manager","Manager","Continental Europe","Other Countries","2 to 3 hours per day",20,"CEE"]
[null,"ID1150","2012-05-28T20:05:20","â‚¬70k",70000,"EUR",{"$f":"Data!$E1740*VLOOKUP(Data!$F1740,tblXrate[],2,FALSE)","v":65000},"Construction Planner","Consultant","Ireland","Other Countries","2 to 3 hours per day",20,"Ireland"]
[null,"ID1279","2012-05-29T10:45:46","MYR89500",89500,"MYR",{"$f":"Data!$E1772*VLOOKUP(Data!$F1772,tblXrate[],2,FALSE)","v":10684.750012465542},"Manager","Manager","Malaysia","Other Countries","2 to 3 hours per day",20,"malaysia"]
[null,"ID1337","2012-05-29T17:09:02","60000 USD p.a.",60000,"USD",{"$f":"Data!$E1787*VLOOKUP(Data!$F1787,tblXrate[],2,FALSE)","v":55000},"Controlling Manager","Manager","CEE","Other Countries","All the 8 hours baby, all the 8!",20,"CEE"]
[null,"ID1358","2012-05-29T19:01:05",40000,40000,"EUR",{"$f":"Data!$E1791*VLOOKUP(Data!$F1791,tblXrate[],2,FALSE)","v":80000},"officer","Manager","Austria","Other Countries","4 to 6 hours a day",20,"Austria"]
[null,"ID1382","2012-05-29T21:29:36",100000,100000,"USD",{"$f":"Data!$E1794*VLOOKUP(Data!$F1794,tblXrate[],2,FALSE)","v":31523.565441345683},"Vice Head of Dpt in Education","CXO or Top Mgmt.","Sweden","Other Countries","2 to 3 hours per day",20,"Sweden"]
[null,"ID1415","2012-05-30T00:13:07","216000.00 Saudi Riyak",216000,"SAR",{"$f":"Data!$E1798*VLOOKUP(Data!$F1798,tblXrate[],2,FALSE)","v":15000},"Senior Electrical Engineer","Engineer","Saudi Arabia","Other Countries","4 to 6 hours a day",20,"Saudi Arabia"]
[null,"ID1867","2012-06-15T20:50:49","EUR 90000",90000,"EUR",{"$f":"Data!$E1877*VLOOKUP(Data!$F1877,tblXrate[],2,FALSE)","v":23000},"Controller","Controller","mainland Europe (Euro zone)","Other Countries","2 to 3 hours per day",20,"Europe"]
[null,"ID1890","2012-06-18T05:42:18",600000,600000,"DKK",{"$f":"Data!$E1883*VLOOKUP(Data!$F1883,tblXrate[],2,FALSE)","v":120000},"Engineer","Engineer","DK","Other Countries","2 to 3 hours per day",20,"Denmark"]
[null,"ID1925","2012-06-20T13:05:17","60000 EUR",60000,"EUR",{"$f":"Data!$E1886*VLOOKUP(Data!$F1886,tblXrate[],2,FALSE)","v":18000},"Project Manager","Manager","Europe","Other Countries","2 to 3 hours per day",20,"Europe"]
[null,"ID1179","2012-05-28T22:49:15","4.5 laks",450000,"INR",{"$f":"Data!$E942*VLOOKUP(Data!$F942,tblXrate[],2,FALSE)","v":15092.18020692008},"Production Manager","Manager","India",{"$f":"VLOOKUP(Data!$J942,tblCountries[[Actual]:[Mapping]],2,FALSE)","v":"china"},"4 to 6 hours a day",21,"India"]
[null,"ID1342","2012-05-29T17:30:43",1200000,1200000,"INR",{"$f":"Data!$E1059*VLOOKUP(Data!$F1059,tblXrate[],2,FALSE)","v":95871.50770184776},"Consultant","Consultant","India",{"$f":"VLOOKUP(Data!$J1059,tblCountries[[Actual]:[Mapping]],2,FALSE)","v":"Australia"},"2 to 3 hours per day",21,"India"]
[null,"ID1413","2012-05-29T23:44:26",88000,88000,"USD",{"$f":"Data!$E1120*VLOOKUP(Data!$F1120,tblXrate[],2,FALSE)","v":4451.9791718606421},"Manager, Financial Planning & Analysis","Manager","USA",{"$f":"VLOOKUP(Data!$J1120,tblCountries[[Actual]:[Mapping]],2,FALSE)","v":"India"},"4 to 6 hours a day",21,"USA"]
[null,"ID1507","2012-05-30T23:59:22","6.5 LAKHS",650000,"INR",{"$f":"Data!$E1197*VLOOKUP(Data!$F1197,tblXrate[],2,FALSE)","v":3200},"HR/ADMINISTRATION","Analyst","India",{"$f":"VLOOKUP(Data!$J1197,tblCountries[[Actual]:[Mapping]],2,FALSE)","v":"India"},"4 to 6 hours a day",21,"India"]
[null,"ID1187","2012-05-28T22:59:16",2000,24000,"USD",{"$f":"Data!$E1750*VLOOKUP(Data!$F1750,tblXrate[],2,FALSE)","v":52013.882978220376},"Administration Manager","Manager","Argentina","Other Countries","4 to 6 hours a day",21,"Argentina"]
[null,"ID1927","2012-06-20T14:08:51",52500,52500,"USD",{"$f":"Data!$E1887*VLOOKUP(Data!$F1887,tblXrate[],2,FALSE)","v":111000},"Business Analist","Analyst","south africa","Other Countries","4 to 6 hours a day",21,"South Africa"]
[null,"ID0580","2012-05-26T07:23:11",150000,150000,"USD",{"$f":"Data!$E479*VLOOKUP(Data!$F479,tblXrate[],2,FALSE)","v":59106.685202523156},"CFO","CXO or Top Mgmt.","USA",{"$f":"VLOOKUP(Data!$J479,tblCountries[[Actual]:[Mapping]],2,FALSE)","v":"UK"},"4 to 6 hours a day",22,"USA"]
[null,"ID1087","2012-05-28T15:47:46","Â£55000",55000,"GBP",{"$f":"Data!$E872*VLOOKUP(Data!$F872,tblXrate[],2,FALSE)","v":260000},"Finance Director","CXO or Top Mgmt.","UK",{"$f":"VLOOKUP(Data!$J872,tblCountries[[Actual]:[Mapping]],2,FALSE)","v":"USA"},"2 to 3 hours per day",22,"UK"]
[null,"ID1130","2012-05-28T17:53:43","Rs. 900000",900000,"INR",{"$f":"Data!$E906*VLOOKUP(Data!$F906,tblXrate[],2,FALSE)","v":72000},"officer","Manager","India",{"$f":"VLOOKUP(Data!$J906,tblCountries[[Actual]:[Mapping]],2,FALSE)","v":"USA"},"4 to 6 hours a day",22,"India"]
[null,"ID1379","2012-05-29T21:25:03",103000,103000,"USD",{"$f":"Data!$E1090*VLOOKUP(Data!$F1090,tblXrate[],2,FALSE)","v":45709.169889951241},"Controller","Controller","USA",{"$f":"VLOOKUP(Data!$J1090,tblCountries[[Actual]:[Mapping]],2,FALSE)","v":"UK"},"4 to 6 hours a day",22,"USA"]
[null,"ID1386","2012-05-29T21:44:00",69960,69960,"USD",{"$f":"Data!$E1096*VLOOKUP(Data!$F1096,tblXrate[],2,FALSE)","v":135000},"Measurement & Verification Engineer","Engineer","USA",{"$f":"VLOOKUP(Data!$J1096,tblCountries[[Actual]:[Mapping]],2,FALSE)","v":"USA"},"2 to 3 hours per day",22,"USA"]
[null,"ID1522","2012-05-31T05:23:58",127500,127500,"USD",{"$f":"Data!$E1208*VLOOKUP(Data!$F1208,tblXrate[],2,FALSE)","v":62000},"SVP","CXO or Top Mgmt.","USA",{"$f":"VLOOKUP(Data!$J1208,tblCountries[[Actual]:[Mapping]],2,FALSE)","v":"USA"},"All the 8 hours baby, all the 8!",22,"USA"]
[null,"ID0619","2012-05-26T10:54:22",21000,21000,"USD",{"$f":"Data!$E512*VLOOKUP(Data!$F512,tblXrate[],2,FALSE)","v":5698.5333399816218},"Manager","Manager","India",{"$f":"VLOOKUP(Data!$J512,tblCountries[[Actual]:[Mapping]],2,FALSE)","v":"India"},"All the 8 hours baby, all the 8!",23,"India"]
[null,"ID0693","2012-05-26T13:24:14",7000,7000,"USD",{"$f":"Data!$E577*VLOOKUP(Data!$F577,tblXrate[],2,FALSE)","v":6767.0083412281756},"Business Executive","Manager","India",{"$f":"VLOOKUP(Data!$J577,tblCountries[[Actual]:[Mapping]],2,FALSE)","v":"India"},"4 to 6 hours a day",23,"India"]
[null,"ID1095","2012-05-28T16:03:45","Rs500000",500000,"INR",{"$f":"Data!$E880*VLOOKUP(Data!$F880,tblXrate[],2,FALSE)","v":75656.557059229643},"Executive","Analyst","India",{"$f":"VLOOKUP(Data!$J880,tblCountries[[Actual]:[Mapping]],2,FALSE)","v":"UK"},"2 to 3 hours per day",23,"India"]
[null,"ID1662","2012-06-04T18:03:21",42000,42000,"GBP",{"$f":"Data!$E1317*VLOOKUP(Data!$F1317,tblXrate[],2,FALSE)","v":8903.9583437212841},"Management Accountant","Manager","UK",{"$f":"VLOOKUP(Data!$J1317,tblCountries[[Actual]:[Mapping]],2,FALSE)","v":"India"},"4 to 6 hours a day",23,"UK"]
[null,"ID0570","2012-05-26T06:47:59","NZ $80,000",80000,"NZD",{"$f":"Data!$E1625*VLOOKUP(Data!$F1625,tblXrate[],2,FALSE)","v":63000},"Accountant/Analyst","Analyst","New Zealand","Other Countries","4 to 6 hours a day",23,"New Zealand"]
[null,"ID1848","2012-06-15T00:52:38",2000,24000,"USD",{"$f":"Data!$E1874*VLOOKUP(Data!$F1874,tblXrate[],2,FALSE)","v":110000},"Plant Controller","Controller","Russia","Other Countries","All the 8 hours baby, all the 8!",23,"Russia"]
[null,"ID0589","2012-05-26T08:01:44",75000,75000,"USD",{"$f":"Data!$E488*VLOOKUP(Data!$F488,tblXrate[],2,FALSE)","v":36206.384011260823},"Sr. Human Resources Analyst","Analyst","USA",{"$f":"VLOOKUP(Data!$J488,tblCountries[[Actual]:[Mapping]],2,FALSE)","v":"Netherlands"},"2 to 3 hours per day",25,"USA"]
[null,"ID0599","2012-05-26T08:52:00",50000,50000,"USD",{"$f":"Data!$E495*VLOOKUP(Data!$F495,tblXrate[],2,FALSE)","v":4356},"General manager","Manager","India",{"$f":"VLOOKUP(Data!$J495,tblCountries[[Actual]:[Mapping]],2,FALSE)","v":"India"},"1 or 2 hours a day",25,"India"]
[null,"ID0870","2012-05-27T07:19:14",135000,135000,"USD",{"$f":"Data!$E717*VLOOKUP(Data!$F717,tblXrate[],2,FALSE)","v":18987},"Director, P&A","CXO or Top Mgmt.","USA",{"$f":"VLOOKUP(Data!$J717,tblCountries[[Actual]:[Mapping]],2,FALSE)","v":"Nigeria"},"4 to 6 hours a day",25,"USA"]
[null,"ID0927","2012-05-27T21:21:41",150000,150000,"USD",{"$f":"Data!$E755*VLOOKUP(Data!$F755,tblXrate[],2,FALSE)","v":12000},"Controller","Controller","USA",{"$f":"VLOOKUP(Data!$J755,tblCountries[[Actual]:[Mapping]],2,FALSE)","v":"India"},"4 to 6 hours a day",25,"USA"]
[null,"ID0964","2012-05-28T05:20:41",80000,80000,"AUD",{"$f":"Data!$E773*VLOOKUP(Data!$F773,tblXrate[],2,FALSE)","v":25000},"Billing manager","Manager","Australia",{"$f":"VLOOKUP(Data!$J773,tblCountries[[Actual]:[Mapping]],2,FALSE)","v":"India"},"4 to 6 hours a day",25,"Australia"]
[null,"ID1041","2012-05-28T13:27:46","10 Lakh",1000000,"INR",{"$f":"Data!$E835*VLOOKUP(Data!$F835,tblXrate[],2,FALSE)","v":57000},"Teaching","Analyst","India",{"$f":"VLOOKUP(Data!$J835,tblCountries[[Actual]:[Mapping]],2,FALSE)","v":"USA"},"1 or 2 hours a day",25,"India"]
[null,"ID1092","2012-05-28T15:59:46",40500,40500,"GBP",{"$f":"Data!$E877*VLOOKUP(Data!$F877,tblXrate[],2,FALSE)","v":7200},"Policy, Performance and Research Officer","Manager","UK",{"$f":"VLOOKUP(Data!$J877,tblCountries[[Actual]:[Mapping]],2,FALSE)","v":"India"},"2 to 3 hours per day",25,"UK"]
[null,"ID1161","2012-05-28T22:08:12","Rs.5,00,000",500000,"INR",{"$f":"Data!$E928*VLOOKUP(Data!$F928,tblXrate[],2,FALSE)","v":65000},"Deputy Manager","Manager","India",{"$f":"VLOOKUP(Data!$J928,tblCountries[[Actual]:[Mapping]],2,FALSE)","v":"USA"},"1 or 2 hours a day",25,"India"]
[null,"ID1197","2012-05-28T23:25:32","82.000 Euro (pre-tax)",82000,"EUR",{"$f":"Data!$E953*VLOOKUP(Data!$F953,tblXrate[],2,FALSE)","v":43867.345148271634},"Finance Project Manager","Manager","Netherlands",{"$f":"VLOOKUP(Data!$J953,tblCountries[[Actual]:[Mapping]],2,FALSE)","v":"New Zealand"},"All the 8 hours baby, all the 8!",25,"Netherlands"]
[null,"ID1251","2012-05-29T05:47:34","GBP 43,000",43000,"GBP",{"$f":"Data!$E994*VLOOKUP(Data!$F994,tblXrate[],2,FALSE)","v":36000},"Financial Controller","Controller","UK",{"$f":"VLOOKUP(Data!$J994,tblCountries[[Actual]:[Mapping]],2,FALSE)","v":"Australia"},"4 to 6 hours a day",25,"UK"]
[null,"ID1253","2012-05-29T06:08:12",50846,50846,"USD",{"$f":"Data!$E996*VLOOKUP(Data!$F996,tblXrate[],2,FALSE)","v":86689.804963700633},"Program & Policy Analyst-Advanced","Analyst","USA",{"$f":"VLOOKUP(Data!$J996,tblCountries[[Actual]:[Mapping]],2,FALSE)","v":"UK"},"4 to 6 hours a day",25,"USA"]
[null,"ID1364","2012-05-29T19:12:19",125000,125000,"USD",{"$f":"Data!$E1077*VLOOKUP(Data!$F1077,tblXrate[],2,FALSE)","v":57167.974754622352},"Finance Manager","Manager","USA",{"$f":"VLOOKUP(Data!$J1077,tblCountries[[Actual]:[Mapping]],2,FALSE)","v":"Spain"},"4 to 6 hours a day",25,"USA"]
[null,"ID1384","2012-05-29T21:38:10",85000,85000,"USD",{"$f":"Data!$E1094*VLOOKUP(Data!$F1094,tblXrate[],2,FALSE)","v":70000},"energy engineer","Engineer","USA",{"$f":"VLOOKUP(Data!$J1094,tblCountries[[Actual]:[Mapping]],2,FALSE)","v":"USA"},"2 to 3 hours per day",25,"USA"]
[null,"ID1391","2012-05-29T21:54:33",62000,62000,"USD",{"$f":"Data!$E1100*VLOOKUP(Data!$F1100,tblXrate[],2,FALSE)","v":2400},"Measurement Specialist","Specialist","USA",{"$f":"VLOOKUP(Data!$J1100,tblCountries[[Actual]:[Mapping]],2,FALSE)","v":"Pakistan"},"All the 8 hours baby, all the 8!",25,"USA"]
[null,"ID1401","2012-05-29T22:47:10",130000,130000,"USD",{"$f":"Data!$E1109*VLOOKUP(Data!$F1109,tblXrate[],2,FALSE)","v":63918.498996971248},"Manager","Manager","USA",{"$f":"VLOOKUP(Data!$J1109,tblCountries[[Actual]:[Mapping]],2,FALSE)","v":"Canada"},"1 or 2 hours a day",25,"USA"]
[null,"ID1439","2012-05-30T04:13:50",61000,61000,"USD",{"$f":"Data!$E1145*VLOOKUP(Data!$F1145,tblXrate[],2,FALSE)","v":42000},"Accounting manager","Manager","USA",{"$f":"VLOOKUP(Data!$J1145,tblCountries[[Actual]:[Mapping]],2,FALSE)","v":"Saudi Arabia"},"2 to 3 hours per day",25,"USA"]
[null,"ID1564","2012-05-31T23:48:36","USD90,000",90000,"USD",{"$f":"Data!$E1240*VLOOKUP(Data!$F1240,tblXrate[],2,FALSE)","v":50437.70470615309},"Operationsl Regional Manager","Manager","USA",{"$f":"VLOOKUP(Data!$J1240,tblCountries[[Actual]:[Mapping]],2,FALSE)","v":"UK"},"4 to 6 hours a day",25,"USA"]
[null,"ID1682","2012-06-05T06:51:36","Â£40000",40000,"GBP",{"$f":"Data!$E1330*VLOOKUP(Data!$F1330,tblXrate[],2,FALSE)","v":12465.541681209797},"Technical Specialist","Specialist","UK",{"$f":"VLOOKUP(Data!$J1330,tblCountries[[Actual]:[Mapping]],2,FALSE)","v":"India"},"2 to 3 hours per day",25,"UK"]
[null,"ID1725","2012-06-06T22:14:27","36000stg",36000,"GBP",{"$f":"Data!$E1361*VLOOKUP(Data!$F1361,tblXrate[],2,FALSE)","v":55166.239522354947},"contracts officer","Manager","UK",{"$f":"VLOOKUP(Data!$J1361,tblCountries[[Actual]:[Mapping]],2,FALSE)","v":"UK"},"1 or 2 hours a day",25,"UK"]
[null,"ID1827","2012-06-13T04:39:37",42307.199999999997,42307,"USD",{"$f":"Data!$E1450*VLOOKUP(Data!$F1450,tblXrate[],2,FALSE)","v":53000},"purchasing operations administrator","Analyst","USA",{"$f":"VLOOKUP(Data!$J1450,tblCountries[[Actual]:[Mapping]],2,FALSE)","v":"USA"},"2 to 3 hours per day",25,"USA"]
[null,"ID1002","2012-05-28T10:21:58","NZD 180000",180000,"NZD",{"$f":"Data!$E1711*VLOOKUP(Data!$F1711,tblXrate[],2,FALSE)","v":94570.696324037053},"Commercial Manager","Manager","New Zealand","Other Countries","4 to 6 hours a day",25,"New Zealand"]
[null,"ID1185","2012-05-28T22:55:40","S$50000",50000,"USD",{"$f":"Data!$E1748*VLOOKUP(Data!$F1748,tblXrate[],2,FALSE)","v":3561.5833374885137},"Engineer","Engineer","Singapore","Other Countries","2 to 3 hours per day",25,"Singapore"]
[null,"ID1213","2012-05-29T00:26:21","DKK 625000",625000,"DKK",{"$f":"Data!$E1757*VLOOKUP(Data!$F1757,tblXrate[],2,FALSE)","v":8400},"Manager Business Controlling","Manager","Denmark","Other Countries","4 to 6 hours a day",25,"Denmark"]
[null,"ID1228","2012-05-29T01:45:13",4100,49200,"USD",{"$f":"Data!$E1760*VLOOKUP(Data!$F1760,tblXrate[],2,FALSE)","v":25849.323661903458},"Chief Accountant","Accountant","QATAR","Other Countries","2 to 3 hours per day",25,"Qatar"]
[null,"ID1320","2012-05-29T15:36:42",139000,139000,"EUR",{"$f":"Data!$E1780*VLOOKUP(Data!$F1780,tblXrate[],2,FALSE)","v":50000},"NAF Support Manager","Manager","Germany","Other Countries","1 or 2 hours a day",25,"Germany"]
[null,"ID0622","2012-05-26T11:01:56",700,8400,"USD",{"$f":"Data!$E515*VLOOKUP(Data!$F515,tblXrate[],2,FALSE)","v":15000},"SYSTEM MANAGER","Manager","India",{"$f":"VLOOKUP(Data!$J515,tblCountries[[Actual]:[Mapping]],2,FALSE)","v":"Pakistan"},"All the 8 hours baby, all the 8!",26,"India"]
[null,"ID1070","2012-05-28T14:53:02",50000,50000,"USD",{"$f":"Data!$E856*VLOOKUP(Data!$F856,tblXrate[],2,FALSE)","v":35000},"Managing Partner","CXO or Top Mgmt.","India",{"$f":"VLOOKUP(Data!$J856,tblCountries[[Actual]:[Mapping]],2,FALSE)","v":"India"},"1 or 2 hours a day",26,"India"]
[null,"ID0574","2012-05-26T06:57:09","Â£28800",28800,"GBP",{"$f":"Data!$E474*VLOOKUP(Data!$F474,tblXrate[],2,FALSE)","v":2675.675098121621},"Finance Manager","Manager","UK",{"$f":"VLOOKUP(Data!$J474,tblCountries[[Actual]:[Mapping]],2,FALSE)","v":"India"},"4 to 6 hours a day",27,"UK"]
[null,"ID0581","2012-05-26T07:32:19",130000,130000,"AUD",{"$f":"Data!$E480*VLOOKUP(Data!$F480,tblXrate[],2,FALSE)","v":12608.005014709339},"Accountant","Accountant","Australia",{"$f":"VLOOKUP(Data!$J480,tblCountries[[Actual]:[Mapping]],2,FALSE)","v":"India"},"2 to 3 hours per day",27,"Australia"]
[null,"ID0824","2012-05-26T22:49:34",75000,75000,"USD",{"$f":"Data!$E684*VLOOKUP(Data!$F684,tblXrate[],2,FALSE)","v":21369.500024931083},"sr financial analyst","Analyst","USA",{"$f":"VLOOKUP(Data!$J684,tblCountries[[Actual]:[Mapping]],2,FALSE)","v":"India"},"2 to 3 hours per day",27,"USA"]
[null,"ID1286","2012-05-29T11:51:35",192000,192000,"USD",{"$f":"Data!$E1020*VLOOKUP(Data!$F1020,tblXrate[],2,FALSE)","v":56600},"Publisher","CXO or Top Mgmt.","USA",{"$f":"VLOOKUP(Data!$J1020,tblCountries[[Actual]:[Mapping]],2,FALSE)","v":"USA"},"All the 8 hours baby, all the 8!",27,"USA"]
[null,"ID1525","2012-05-31T06:13:42",62000,62000,"USD",{"$f":"Data!$E1210*VLOOKUP(Data!$F1210,tblXrate[],2,FALSE)","v":40000},"info analyst","Analyst","USA",{"$f":"VLOOKUP(Data!$J1210,tblCountries[[Actual]:[Mapping]],2,FALSE)","v":"USA"},"All the 8 hours baby, all the 8!",27,"USA"]
[null,"ID1894","2012-06-18T17:51:52","Rs. 350000",350000,"INR",{"$f":"Data!$E1502*VLOOKUP(Data!$F1502,tblXrate[],2,FALSE)","v":99000},"manager purchase","Manager","India",{"$f":"VLOOKUP(Data!$J1502,tblCountries[[Actual]:[Mapping]],2,FALSE)","v":"USA"},"2 to 3 hours per day",27,"India"]
[null,"ID1319","2012-05-29T15:36:25","6lakhs",600000,"INR",{"$f":"Data!$E1045*VLOOKUP(Data!$F1045,tblXrate[],2,FALSE)","v":16027.125018698311},"General Manager","Manager","India",{"$f":"VLOOKUP(Data!$J1045,tblCountries[[Actual]:[Mapping]],2,FALSE)","v":"India"},"2 to 3 hours per day",28,"India"]
[null,"ID1278","2012-05-29T10:43:49",500000,500000,"INR",{"$f":"Data!$E1014*VLOOKUP(Data!$F1014,tblXrate[],2,FALSE)","v":50000},"Asstt. Manager","Manager","India",{"$f":"VLOOKUP(Data!$J1014,tblCountries[[Actual]:[Mapping]],2,FALSE)","v":"USA"},"2 to 3 hours per day",29,"India"]
[null,"ID1418","2012-05-30T00:34:53",107000,107000,"USD",{"$f":"Data!$E1124*VLOOKUP(Data!$F1124,tblXrate[],2,FALSE)","v":76223.966339496474},"Tax Manager","Manager","USA",{"$f":"VLOOKUP(Data!$J1124,tblCountries[[Actual]:[Mapping]],2,FALSE)","v":"Netherlands"},"All the 8 hours baby, all the 8!",29,"USA"]
[null,"ID0584","2012-05-26T07:44:04",300000,300000,"USD",{"$f":"Data!$E483*VLOOKUP(Data!$F483,tblXrate[],2,FALSE)","v":85000},"CEO","CXO or Top Mgmt.","USA",{"$f":"VLOOKUP(Data!$J483,tblCountries[[Actual]:[Mapping]],2,FALSE)","v":"USA"},"2 to 3 hours per day",30,"USA"]
[null,"ID0643","2012-05-26T11:47:18",53000,53000,"USD",{"$f":"Data!$E535*VLOOKUP(Data!$F535,tblXrate[],2,FALSE)","v":20000},"Financial Analyst","Analyst","USA",{"$f":"VLOOKUP(Data!$J535,tblCountries[[Actual]:[Mapping]],2,FALSE)","v":"India"},"4 to 6 hours a day",30,"USA"]
[null,"ID1088","2012-05-28T15:48:23","50000 US $ per year",50000,"USD",{"$f":"Data!$E873*VLOOKUP(Data!$F873,tblXrate[],2,FALSE)","v":125000},"Sr. Manager MIS","Manager","India",{"$f":"VLOOKUP(Data!$J873,tblCountries[[Actual]:[Mapping]],2,FALSE)","v":"USA"},"2 to 3 hours per day",30,"India"]
[null,"ID1222","2012-05-29T01:12:28",90000,90000,"USD",{"$f":"Data!$E973*VLOOKUP(Data!$F973,tblXrate[],2,FALSE)","v":38000},"Senior Analyst","Analyst","USA",{"$f":"VLOOKUP(Data!$J973,tblCountries[[Actual]:[Mapping]],2,FALSE)","v":"USA"},"4 to 6 hours a day",30,"USA"]
[null,"ID1307","2012-05-29T14:10:28","AUS 49,000",49000,"AUD",{"$f":"Data!$E1035*VLOOKUP(Data!$F1035,tblXrate[],2,FALSE)","v":18000},"Document Control","Controller","Australia",{"$f":"VLOOKUP(Data!$J1035,tblCountries[[Actual]:[Mapping]],2,FALSE)","v":"Ghana"},"4 to 6 hours a day",30,"Australia"]
[null,"ID1356","2012-05-29T18:55:18",100000,100000,"AUD",{"$f":"Data!$E1070*VLOOKUP(Data!$F1070,tblXrate[],2,FALSE)","v":89000},"Principal advisor","Consultant","Australia",{"$f":"VLOOKUP(Data!$J1070,tblCountries[[Actual]:[Mapping]],2,FALSE)","v":"USA"},"1 or 2 hours a day",30,"Australia"]
[null,"ID1369","2012-05-29T19:47:18",57500,57500,"USD",{"$f":"Data!$E1080*VLOOKUP(Data!$F1080,tblXrate[],2,FALSE)","v":8400},"Planning Supervisor","Manager","USA",{"$f":"VLOOKUP(Data!$J1080,tblCountries[[Actual]:[Mapping]],2,FALSE)","v":"Indonesia"},"4 to 6 hours a day",30,"USA"]
[null,"ID1393","2012-05-29T22:02:31",150000,150000,"USD",{"$f":"Data!$E1102*VLOOKUP(Data!$F1102,tblXrate[],2,FALSE)","v":44921.080753917595},"VP, Business Management","Manager","USA",{"$f":"VLOOKUP(Data!$J1102,tblCountries[[Actual]:[Mapping]],2,FALSE)","v":"UK"},"2 to 3 hours per day",30,"USA"]
[null,"ID1404","2012-05-29T22:56:24","37K",37000,"USD",{"$f":"Data!$E1112*VLOOKUP(Data!$F1112,tblXrate[],2,FALSE)","v":43828.780645210471},"Credentialing Coordinator & Productivity Reports \"Guru\"","Reporting","USA",{"$f":"VLOOKUP(Data!$J1112,tblCountries[[Actual]:[Mapping]],2,FALSE)","v":"Netherlands"},"2 to 3 hours per day",30,"USA"]
[null,"ID1412","2012-05-29T23:39:13",150000,150000,"USD",{"$f":"Data!$E1119*VLOOKUP(Data!$F1119,tblXrate[],2,FALSE)","v":50000},"Senior Analyst","Analyst","USA",{"$f":"VLOOKUP(Data!$J1119,tblCountries[[Actual]:[Mapping]],2,FALSE)","v":"USA"},"2 to 3 hours per day",30,"USA"]
[null,"ID1534","2012-05-31T10:37:38",105000,105000,"USD",{"$f":"Data!$E1218*VLOOKUP(Data!$F1218,tblXrate[],2,FALSE)","v":35000},"Business Banker","Manager","USA",{"$f":"VLOOKUP(Data!$J1218,tblCountries[[Actual]:[Mapping]],2,FALSE)","v":"USA"},"1 or 2 hours a day",30,"USA"]
[null,"ID1565","2012-06-01T00:02:34","Rs. 700000",700000,"INR",{"$f":"Data!$E1241*VLOOKUP(Data!$F1241,tblXrate[],2,FALSE)","v":214000},"Manager - Business Development","Manager","India",{"$f":"VLOOKUP(Data!$J1241,tblCountries[[Actual]:[Mapping]],2,FALSE)","v":"USA"},"All the 8 hours baby, all the 8!",30,"India"]
[null,"ID1577","2012-06-01T05:32:31","35000 GBP",35000,"GBP",{"$f":"Data!$E1250*VLOOKUP(Data!$F1250,tblXrate[],2,FALSE)","v":36400},"finance director","CXO or Top Mgmt.","UK",{"$f":"VLOOKUP(Data!$J1250,tblCountries[[Actual]:[Mapping]],2,FALSE)","v":"Zimbabwe"},"2 to 3 hours per day",30,"UK"]
[null,"ID1586","2012-06-01T08:52:31",85000,85000,"AUD",{"$f":"Data!$E1256*VLOOKUP(Data!$F1256,tblXrate[],2,FALSE)","v":88927.960729412545},"Administrator","Analyst","Australia",{"$f":"VLOOKUP(Data!$J1256,tblCountries[[Actual]:[Mapping]],2,FALSE)","v":"Ireland"},"4 to 6 hours a day",30,"Australia"]
[null,"ID0941","2012-05-27T23:47:25","30000 $",30000,"USD",{"$f":"Data!$E1696*VLOOKUP(Data!$F1696,tblXrate[],2,FALSE)","v":102451.58768437347},"Financial Expert","Accountant","Iran","Other Countries","2 to 3 hours per day",30,"iran"]
[null,"ID0620","2012-05-26T10:59:10",250000,250000,"CAD",{"$f":"Data!$E513*VLOOKUP(Data!$F513,tblXrate[],2,FALSE)","v":94570.696324037053},"Business Analyst","Analyst","Canada",{"$f":"VLOOKUP(Data!$J513,tblCountries[[Actual]:[Mapping]],2,FALSE)","v":"UK"},"4 to 6 hours a day",32,"Canada"]
[null,"ID1377","2012-05-29T21:07:27",24000,24000,"USD",{"$f":"Data!$E1088*VLOOKUP(Data!$F1088,tblXrate[],2,FALSE)","v":102451.58768437347},"clerk 24 hrs per week","Analyst","USA",{"$f":"VLOOKUP(Data!$J1088,tblCountries[[Actual]:[Mapping]],2,FALSE)","v":"UK"},"1 or 2 hours a day",33,"USA"]
[null,"ID1895","2012-06-18T18:26:47","Â£35000",35000,"GBP",{"$f":"Data!$E1503*VLOOKUP(Data!$F1503,tblXrate[],2,FALSE)","v":90000},"Process Analyst","Analyst","UK",{"$f":"VLOOKUP(Data!$J1503,tblCountries[[Actual]:[Mapping]],2,FALSE)","v":"USA"},"All the 8 hours baby, all the 8!",34,"UK"]
[null,"ID0987","2012-05-28T08:35:32","A$107000",107000,"AUD",{"$f":"Data!$E794*VLOOKUP(Data!$F794,tblXrate[],2,FALSE)","v":112000},"Management Accountant","Manager","Australia",{"$f":"VLOOKUP(Data!$J794,tblCountries[[Actual]:[Mapping]],2,FALSE)","v":"USA"},"4 to 6 hours a day",35,"Australia"]
[null,"ID1472","2012-05-30T16:49:15","Â£25000",25000,"GBP",{"$f":"Data!$E1171*VLOOKUP(Data!$F1171,tblXrate[],2,FALSE)","v":67000},"Assistant Financial Accountant","Accountant","UK",{"$f":"VLOOKUP(Data!$J1171,tblCountries[[Actual]:[Mapping]],2,FALSE)","v":"USA"},"4 to 6 hours a day",35,"UK"]
[null,"ID1452","2012-05-30T12:56:38","Rs  6 lakhs/annum",600000,"INR",{"$f":"Data!$E1156*VLOOKUP(Data!$F1156,tblXrate[],2,FALSE)","v":85333.333333333328},"consultant","Consultant","India",{"$f":"VLOOKUP(Data!$J1156,tblCountries[[Actual]:[Mapping]],2,FALSE)","v":"Saudi Arabia"},"2 to 3 hours per day",36,"India"]
[null,"ID0804","2012-05-26T21:24:39","ZAR900,000",900000,"ZAR",{"$f":"Data!$E1658*VLOOKUP(Data!$F1658,tblXrate[],2,FALSE)","v":48000},"Business Analyst","Analyst","South Africa","Other Countries","All the 8 hours baby, all the 8!",40,"South Africa"]
[null,"ID0001","2012-05-25T03:11:32",5846,5846,"USD",{"$f":"Data!$E6*VLOOKUP(Data!$F6,tblXrate[],2,FALSE)","v":2136.9500024931081},"MIS Analyst","Analyst","India",{"$f":"VLOOKUP(Data!$J6,tblCountries[[Actual]:[Mapping]],2,FALSE)","v":"India"},"4 to 6 hours a day",null,"India"]
[null,"ID0003","2012-05-25T03:16:26",58000,58000,"USD",{"$f":"Data!$E7*VLOOKUP(Data!$F7,tblXrate[],2,FALSE)","v":7123.1666749770275},"Financial Analyst","Analyst","USA",{"$f":"VLOOKUP(Data!$J7,tblCountries[[Actual]:[Mapping]],2,FALSE)","v":"India"},"All the 8 hours baby, all the 8!",null,"USA"]
[null,"ID0004","2012-05-25T03:23:42",48000,48000,"USD",{"$f":"Data!$E8*VLOOKUP(Data!$F8,tblXrate[],2,FALSE)","v":9188.8850107203652},"Quality Control","Controller","Pakistan",{"$f":"VLOOKUP(Data!$J8,tblCountries[[Actual]:[Mapping]],2,FALSE)","v":"India"},"2 to 3 hours per day",null,"Pakistan"]
[null,"ID0005","2012-05-25T03:27:04",54000,54000,"USD",{"$f":"Data!$E9*VLOOKUP(Data!$F9,tblXrate[],2,FALSE)","v":3632.815004238284},"Quality Engineer","Engineer","USA",{"$f":"VLOOKUP(Data!$J9,tblCountries[[Actual]:[Mapping]],2,FALSE)","v":"India"},"All the 8 hours baby, all the 8!",null,"USA"]
[null,"ID0010","2012-05-25T03:38:57","PKR 8,000",1152000,"PKR",{"$f":"Data!$E10*VLOOKUP(Data!$F10,tblXrate[],2,FALSE)","v":24588.381044249632},"Audit Trainee ","Accountant","Pakistan",{"$f":"VLOOKUP(Data!$J10,tblCountries[[Actual]:[Mapping]],2,FALSE)","v":"UK"},"All the 8 hours baby, all the 8!",null,"Pakistan"]
[null,"ID0013","2012-05-25T03:48:53","749000 INR",749000,"INR",{"$f":"Data!$E11*VLOOKUP(Data!$F11,tblXrate[],2,FALSE)","v":8903.9583437212841},"Senion Analyst","Analyst","India",{"$f":"VLOOKUP(Data!$J11,tblCountries[[Actual]:[Mapping]],2,FALSE)","v":"India"},"All the 8 hours baby, all the 8!",null,"India"]
[null,"ID0014","2012-05-25T03:50:58",49000,49000,"USD",{"$f":"Data!$E12*VLOOKUP(Data!$F12,tblXrate[],2,FALSE)","v":14246.333349954055},"business analyst","Analyst","USA",{"$f":"VLOOKUP(Data!$J12,tblCountries[[Actual]:[Mapping]],2,FALSE)","v":"India"},"All the 8 hours baby, all the 8!",null,"USA"]
[null,"ID0015","2012-05-25T03:53:22",85000,85000,"USD",{"$f":"Data!$E13*VLOOKUP(Data!$F13,tblXrate[],2,FALSE)","v":14246.333349954055},"Project Engineer","Engineer","USA",{"$f":"VLOOKUP(Data!$J13,tblCountries[[Actual]:[Mapping]],2,FALSE)","v":"India"},"1 or 2 hours a day",null,"USA"]
[null,"ID0016","2012-05-25T03:56:40",75000,75000,"USD",{"$f":"Data!$E14*VLOOKUP(Data!$F14,tblXrate[],2,FALSE)","v":8903.9583437212841},"Sr Project Engineer","Engineer","USA",{"$f":"VLOOKUP(Data!$J14,tblCountries[[Actual]:[Mapping]],2,FALSE)","v":"India"},"All the 8 hours baby, all the 8!",null,"USA"]
[null,"ID0019","2012-05-25T04:16:32",550000,550000,"INR",{"$f":"Data!$E15*VLOOKUP(Data!$F15,tblXrate[],2,FALSE)","v":40000},"AGM","Manager","India",{"$f":"VLOOKUP(Data!$J15,tblCountries[[Actual]:[Mapping]],2,FALSE)","v":"USA"},"2 to 3 hours per day",null,"India"]
[null,"ID0020","2012-05-25T04:19:22",50000,50000,"USD",{"$f":"Data!$E16*VLOOKUP(Data!$F16,tblXrate[],2,FALSE)","v":37500},"GM","Manager","India",{"$f":"VLOOKUP(Data!$J16,tblCountries[[Actual]:[Mapping]],2,FALSE)","v":"India"},"1 or 2 hours a day",null,"India"]
[null,"ID0021","2012-05-25T04:24:01",13500,13500,"USD",{"$f":"Data!$E17*VLOOKUP(Data!$F17,tblXrate[],2,FALSE)","v":12000},"DSE Co-ordinator","Manager","India",{"$f":"VLOOKUP(Data!$J17,tblCountries[[Actual]:[Mapping]],2,FALSE)","v":"MYS"},"4 to 6 hours a day",null,"India"]
[null,"ID0022","2012-05-25T04:24:12",96000,96000,"USD",{"$f":"Data!$E18*VLOOKUP(Data!$F18,tblXrate[],2,FALSE)","v":5591.6858398569666},"Analyst","Analyst","USA",{"$f":"VLOOKUP(Data!$J18,tblCountries[[Actual]:[Mapping]],2,FALSE)","v":"India"},"2 to 3 hours per day",null,"USA"]
[null,"ID0023","2012-05-25T04:31:41",1000000,1000000,"INR",{"$f":"Data!$E19*VLOOKUP(Data!$F19,tblXrate[],2,FALSE)","v":15000},"Manager","Manager","India",{"$f":"VLOOKUP(Data!$J19,tblCountries[[Actual]:[Mapping]],2,FALSE)","v":"India"},"4 to 6 hours a day",null,"India"]
[null,"ID0024","2012-05-25T04:32:49",75000,75000,"USD",{"$f":"Data!$E20*VLOOKUP(Data!$F20,tblXrate[],2,FALSE)","v":8400},"Marketing Director","CXO or Top Mgmt.","USA",{"$f":"VLOOKUP(Data!$J20,tblCountries[[Actual]:[Mapping]],2,FALSE)","v":"Baltic"},"4 to 6 hours a day",null,"USA"]
[null,"ID0025","2012-05-25T04:43:51","40000 us",40000,"USD",{"$f":"Data!$E21*VLOOKUP(Data!$F21,tblXrate[],2,FALSE)","v":5342.3750062327708},"sales and marketing","Manager","USA",{"$f":"VLOOKUP(Data!$J21,tblCountries[[Actual]:[Mapping]],2,FALSE)","v":"India"},"2 to 3 hours per day",null,"USA"]
[null,"ID0026","2012-05-25T04:45:01",60000,60000,"USD",{"$f":"Data!$E22*VLOOKUP(Data!$F22,tblXrate[],2,FALSE)","v":10000},"Analyst II","Analyst","USA",{"$f":"VLOOKUP(Data!$J22,tblCountries[[Actual]:[Mapping]],2,FALSE)","v":"India"},"All the 8 hours baby, all the 8!",null,"USA"]
[null,"ID0029","2012-05-25T04:52:23","900000 INR",900000,"INR",{"$f":"Data!$E23*VLOOKUP(Data!$F23,tblXrate[],2,FALSE)","v":50000},"Applications Engineer","Engineer","India",{"$f":"VLOOKUP(Data!$J23,tblCountries[[Actual]:[Mapping]],2,FALSE)","v":"USA"},"1 or 2 hours a day",null,"India"]
[null,"ID0030","2012-05-25T04:55:35","Rs 600000",600000,"INR",{"$f":"Data!$E24*VLOOKUP(Data!$F24,tblXrate[],2,FALSE)","v":9000},"strategy manager","Manager","India",{"$f":"VLOOKUP(Data!$J24,tblCountries[[Actual]:[Mapping]],2,FALSE)","v":"India"},"4 to 6 hours a day",null,"India"]
[null,"ID0032","2012-05-25T04:57:06","360000 INR",360000,"INR",{"$f":"Data!$E25*VLOOKUP(Data!$F25,tblXrate[],2,FALSE)","v":8903.9583437212841},"Specialist","Specialist","India",{"$f":"VLOOKUP(Data!$J25,tblCountries[[Actual]:[Mapping]],2,FALSE)","v":"India"},"4 to 6 hours a day",null,"India"]
[null,"ID0033","2012-05-25T04:58:45","Â£35000",35000,"GBP",{"$f":"Data!$E26*VLOOKUP(Data!$F26,tblXrate[],2,FALSE)","v":27500},"Management Information Analyst","Analyst","UK",{"$f":"VLOOKUP(Data!$J26,tblCountries[[Actual]:[Mapping]],2,FALSE)","v":"USA"},"All the 8 hours baby, all the 8!",null,"UK"]
[null,"ID0036","2012-05-25T05:04:12",500000,500000,"INR",{"$f":"Data!$E27*VLOOKUP(Data!$F27,tblXrate[],2,FALSE)","v":101990.96564026357},"Senior Consultant","Consultant","India",{"$f":"VLOOKUP(Data!$J27,tblCountries[[Actual]:[Mapping]],2,FALSE)","v":"Australia"},"All the 8 hours baby, all the 8!",null,"India"]
[null,"ID0037","2012-05-25T05:07:31",150000,150000,"USD",{"$f":"Data!$E28*VLOOKUP(Data!$F28,tblXrate[],2,FALSE)","v":5342.3750062327708},"Portfolio Manager","Manager","USA",{"$f":"VLOOKUP(Data!$J28,tblCountries[[Actual]:[Mapping]],2,FALSE)","v":"India"},"2 to 3 hours per day",null,"USA"]
[null,"ID0038","2012-05-25T05:10:29",69000,69000,"USD",{"$f":"Data!$E29*VLOOKUP(Data!$F29,tblXrate[],2,FALSE)","v":8903.9583437212841},"Design Engineer","Engineer","USA",{"$f":"VLOOKUP(Data!$J29,tblCountries[[Actual]:[Mapping]],2,FALSE)","v":"India"},"4 to 6 hours a day",null,"USA"]
[null,"ID0039","2012-05-25T05:11:37",30000,30000,"USD",{"$f":"Data!$E30*VLOOKUP(Data!$F30,tblXrate[],2,FALSE)","v":6945.0875081026015},"Academic Advisor","Consultant","USA",{"$f":"VLOOKUP(Data!$J30,tblCountries[[Actual]:[Mapping]],2,FALSE)","v":"India"},"2 to 3 hours per day",null,"USA"]
[null,"ID0040","2012-05-25T05:13:50","Rs. 400000",400000,"INR",{"$f":"Data!$E31*VLOOKUP(Data!$F31,tblXrate[],2,FALSE)","v":24000},"Coordination","Manager","India",{"$f":"VLOOKUP(Data!$J31,tblCountries[[Actual]:[Mapping]],2,FALSE)","v":"India"},"4 to 6 hours a day",null,"India"]
[null,"ID0041","2012-05-25T05:18:48",70000,70000,"AUD",{"$f":"Data!$E32*VLOOKUP(Data!$F32,tblXrate[],2,FALSE)","v":16000},"consultant","Consultant","Australia",{"$f":"VLOOKUP(Data!$J32,tblCountries[[Actual]:[Mapping]],2,FALSE)","v":"India"},"2 to 3 hours per day",null,"Australia"]
[null,"ID0042","2012-05-25T05:20:10",14500,14500,"USD",{"$f":"Data!$E33*VLOOKUP(Data!$F33,tblXrate[],2,FALSE)","v":2564.3400029917298},"Business Analsyt","Analyst","India",{"$f":"VLOOKUP(Data!$J33,tblCountries[[Actual]:[Mapping]],2,FALSE)","v":"India"},"4 to 6 hours a day",null,"India"]
[null,"ID0043","2012-05-25T05:30:39",70000,70000,"CAD",{"$f":"Data!$E34*VLOOKUP(Data!$F34,tblXrate[],2,FALSE)","v":9794.354178093412},"Product Engineer","Engineer","Canada",{"$f":"VLOOKUP(Data!$J34,tblCountries[[Actual]:[Mapping]],2,FALSE)","v":"India"},"2 to 3 hours per day",null,"Canada"]
[null,"ID0044","2012-05-25T05:35:28",58000,58000,"USD",{"$f":"Data!$E35*VLOOKUP(Data!$F35,tblXrate[],2,FALSE)","v":85000},"Senior Accountant","Accountant","USA",{"$f":"VLOOKUP(Data!$J35,tblCountries[[Actual]:[Mapping]],2,FALSE)","v":"USA"},"4 to 6 hours a day",null,"USA"]
[null,"ID0045","2012-05-25T05:45:01",90000,90000,"USD",{"$f":"Data!$E36*VLOOKUP(Data!$F36,tblXrate[],2,FALSE)","v":3561.5833374885137},"Scientist","Misc.","USA",{"$f":"VLOOKUP(Data!$J36,tblCountries[[Actual]:[Mapping]],2,FALSE)","v":"India"},"1 or 2 hours a day",null,"USA"]
[null,"ID0046","2012-05-25T05:46:47",800000,800000,"INR",{"$f":"Data!$E37*VLOOKUP(Data!$F37,tblXrate[],2,FALSE)","v":5000},"Team Lead","Manager","India",{"$f":"VLOOKUP(Data!$J37,tblCountries[[Actual]:[Mapping]],2,FALSE)","v":"India"},"2 to 3 hours per day",null,"India"]
[null,"ID0047","2012-05-25T05:47:10",32000,32000,"GBP",{"$f":"Data!$E38*VLOOKUP(Data!$F38,tblXrate[],2,FALSE)","v":9794.354178093412},"Senior intelligence analyst","Analyst","UK",{"$f":"VLOOKUP(Data!$J38,tblCountries[[Actual]:[Mapping]],2,FALSE)","v":"India"},"4 to 6 hours a day",null,"UK"]
[null,"ID0048","2012-05-25T05:47:52",1000,12000,"USD",{"$f":"Data!$E39*VLOOKUP(Data!$F39,tblXrate[],2,FALSE)","v":32000},"Freelance consultant","Consultant","USA",{"$f":"VLOOKUP(Data!$J39,tblCountries[[Actual]:[Mapping]],2,FALSE)","v":"USA"},"1 or 2 hours a day",null,"USA"]
[null,"ID0049","2012-05-25T06:04:42","â‚¬ 45",45000,"EUR",{"$f":"Data!$E40*VLOOKUP(Data!$F40,tblXrate[],2,FALSE)","v":2564.3400029917298},"Online Traffic Manager / Web Analist","Manager","The Netherlands",{"$f":"VLOOKUP(Data!$J40,tblCountries[[Actual]:[Mapping]],2,FALSE)","v":"India"},"4 to 6 hours a day",null,"Netherlands"]
[null,"ID0051","2012-05-25T06:05:17",57000,57000,"USD",{"$f":"Data!$E41*VLOOKUP(Data!$F41,tblXrate[],2,FALSE)","v":43000},"Senior Accounting Supervisor","Accountant","USA",{"$f":"VLOOKUP(Data!$J41,tblCountries[[Actual]:[Mapping]],2,FALSE)","v":"USA"},"2 to 3 hours per day",null,"USA"]
[null,"ID0052","2012-05-25T06:07:15",40000,40000,"GBP",{"$f":"Data!$E42*VLOOKUP(Data!$F42,tblXrate[],2,FALSE)","v":12465.541681209797},"Senior Accountant","Accountant","UK",{"$f":"VLOOKUP(Data!$J42,tblCountries[[Actual]:[Mapping]],2,FALSE)","v":"India"},"4 to 6 hours a day",null,"UK"]
[null,"ID0054","2012-05-25T06:10:18",4320,4320,"USD",{"$f":"Data!$E43*VLOOKUP(Data!$F43,tblXrate[],2,FALSE)","v":43856.11522531334},"Financial Planner","Accountant","India",{"$f":"VLOOKUP(Data!$J43,tblCountries[[Actual]:[Mapping]],2,FALSE)","v":"Australia"},"2 to 3 hours per day",null,"India"]
[null,"ID0055","2012-05-25T06:15:42",62000,62000,"USD",{"$f":"Data!$E44*VLOOKUP(Data!$F44,tblXrate[],2,FALSE)","v":11575.14584683767},"Analyst","Analyst","USA",{"$f":"VLOOKUP(Data!$J44,tblCountries[[Actual]:[Mapping]],2,FALSE)","v":"India"},"4 to 6 hours a day",null,"USA"]
[null,"ID0056","2012-05-25T06:26:44",7500,7500,"USD",{"$f":"Data!$E45*VLOOKUP(Data!$F45,tblXrate[],2,FALSE)","v":5342.3750062327708},"Analyst","Analyst","India",{"$f":"VLOOKUP(Data!$J45,tblCountries[[Actual]:[Mapping]],2,FALSE)","v":"India"},"4 to 6 hours a day",null,"India"]
[null,"ID0057","2012-05-25T06:27:29","Â£18000",18000,"GBP",{"$f":"Data!$E46*VLOOKUP(Data!$F46,tblXrate[],2,FALSE)","v":31523.565441345683},"Building Design and Performance Researcher","Manager","UK",{"$f":"VLOOKUP(Data!$J46,tblCountries[[Actual]:[Mapping]],2,FALSE)","v":"UK"},"1 or 2 hours a day",null,"UK"]
[null,"ID0059","2012-05-25T06:57:52",38000,38000,"USD",{"$f":"Data!$E47*VLOOKUP(Data!$F47,tblXrate[],2,FALSE)","v":99299.231140238902},"Senior Analyst","Analyst","USA",{"$f":"VLOOKUP(Data!$J47,tblCountries[[Actual]:[Mapping]],2,FALSE)","v":"UK"},"4 to 6 hours a day",null,"USA"]
[null,"ID0060","2012-05-25T07:00:52",41000,41000,"USD",{"$f":"Data!$E48*VLOOKUP(Data!$F48,tblXrate[],2,FALSE)","v":3739.6625043629392},"Specialist","Specialist","USA",{"$f":"VLOOKUP(Data!$J48,tblCountries[[Actual]:[Mapping]],2,FALSE)","v":"India"},"4 to 6 hours a day",null,"USA"]
[null,"ID0061","2012-05-25T07:11:09",68000,68000,"USD",{"$f":"Data!$E49*VLOOKUP(Data!$F49,tblXrate[],2,FALSE)","v":27840},"Engineering Data Analyst","Analyst","USA",{"$f":"VLOOKUP(Data!$J49,tblCountries[[Actual]:[Mapping]],2,FALSE)","v":"USA"},"All the 8 hours baby, all the 8!",null,"USA"]
[null,"ID0062","2012-05-25T07:13:31",56000,56000,"CAD",{"$f":"Data!$E50*VLOOKUP(Data!$F50,tblXrate[],2,FALSE)","v":4451.9791718606421},"Sales Analyst","Analyst","CANADA",{"$f":"VLOOKUP(Data!$J50,tblCountries[[Actual]:[Mapping]],2,FALSE)","v":"India"},"All the 8 hours baby, all the 8!",null,"Canada"]
[null,"ID0065","2012-05-25T07:20:08",85000,85000,"USD",{"$f":"Data!$E51*VLOOKUP(Data!$F51,tblXrate[],2,FALSE)","v":9000},"Manager","Manager","USA",{"$f":"VLOOKUP(Data!$J51,tblCountries[[Actual]:[Mapping]],2,FALSE)","v":"India"},"4 to 6 hours a day",null,"USA"]
[null,"ID0066","2012-05-25T07:21:18","â‚¬ 38000",38000,"EUR",{"$f":"Data!$E52*VLOOKUP(Data!$F52,tblXrate[],2,FALSE)","v":7123.1666749770275},"busines analist","Analyst","The Netherlands",{"$f":"VLOOKUP(Data!$J52,tblCountries[[Actual]:[Mapping]],2,FALSE)","v":"India"},"1 or 2 hours a day",null,"Netherlands"]
[null,"ID0067","2012-05-25T07:25:12",85000,85000,"AUD",{"$f":"Data!$E53*VLOOKUP(Data!$F53,tblXrate[],2,FALSE)","v":56000},"head of data","CXO or Top Mgmt.","Australia",{"$f":"VLOOKUP(Data!$J53,tblCountries[[Actual]:[Mapping]],2,FALSE)","v":"USA"},"4 to 6 hours a day",null,"Australia"]
[null,"ID0068","2012-05-25T07:29:12",85087,85087,"USD",{"$f":"Data!$E54*VLOOKUP(Data!$F54,tblXrate[],2,FALSE)","v":40586.590505732565},"Business Systems Analyst","Analyst","USA",{"$f":"VLOOKUP(Data!$J54,tblCountries[[Actual]:[Mapping]],2,FALSE)","v":"UK"},"2 to 3 hours per day",null,"USA"]
[null,"ID0069","2012-05-25T07:38:22",50000,50000,"USD",{"$f":"Data!$E55*VLOOKUP(Data!$F55,tblXrate[],2,FALSE)","v":31523.565441345683},"Financial Analyst II","Analyst","USA",{"$f":"VLOOKUP(Data!$J55,tblCountries[[Actual]:[Mapping]],2,FALSE)","v":"UK"},"All the 8 hours baby, all the 8!",null,"USA"]
[null,"ID0071","2012-05-25T22:49:00",57000,57000,"USD",{"$f":"Data!$E56*VLOOKUP(Data!$F56,tblXrate[],2,FALSE)","v":12000},"sales analyst","Analyst","USA",{"$f":"VLOOKUP(Data!$J56,tblCountries[[Actual]:[Mapping]],2,FALSE)","v":"Pakistan"},"4 to 6 hours a day",null,"USA"]
[null,"ID0072","2012-05-25T22:52:28",75000,75000,"USD",{"$f":"Data!$E57*VLOOKUP(Data!$F57,tblXrate[],2,FALSE)","v":9000},"Consumer Research Program Manager","Manager","USA",{"$f":"VLOOKUP(Data!$J57,tblCountries[[Actual]:[Mapping]],2,FALSE)","v":"India"},"All the 8 hours baby, all the 8!",null,"USA"]
[null,"ID0073","2012-05-25T22:59:05","$AUD100000",100000,"AUD",{"$f":"Data!$E58*VLOOKUP(Data!$F58,tblXrate[],2,FALSE)","v":42556.81334581667},"technical trainer","Manager","Australia",{"$f":"VLOOKUP(Data!$J58,tblCountries[[Actual]:[Mapping]],2,FALSE)","v":"UK"},"4 to 6 hours a day",null,"Australia"]
[null,"ID0075","2012-05-25T23:03:00",59450,59450,"CAD",{"$f":"Data!$E59*VLOOKUP(Data!$F59,tblXrate[],2,FALSE)","v":100000},"Process Improvement Specialist","Specialist","Canada",{"$f":"VLOOKUP(Data!$J59,tblCountries[[Actual]:[Mapping]],2,FALSE)","v":"USA"},"All the 8 hours baby, all the 8!",null,"Canada"]
[null,"ID0076","2012-05-25T23:12:29",15000,15000,"USD",{"$f":"Data!$E60*VLOOKUP(Data!$F60,tblXrate[],2,FALSE)","v":55000},"Excel Programmer Consultant","Consultant","USA",{"$f":"VLOOKUP(Data!$J60,tblCountries[[Actual]:[Mapping]],2,FALSE)","v":"USA"},"All the 8 hours baby, all the 8!",null,"USA"]
[null,"ID0077","2012-05-25T23:15:34","US $60,000",60000,"USD",{"$f":"Data!$E61*VLOOKUP(Data!$F61,tblXrate[],2,FALSE)","v":40000},"Statistical Analyst","Analyst","Canada",{"$f":"VLOOKUP(Data!$J61,tblCountries[[Actual]:[Mapping]],2,FALSE)","v":"USA"},"1 or 2 hours a day",null,"Canada"]
[null,"ID0078","2012-05-25T23:18:45",100000,100000,"GBP",{"$f":"Data!$E62*VLOOKUP(Data!$F62,tblXrate[],2,FALSE)","v":13355.937515581925},"Analyst","Analyst","UK",{"$f":"VLOOKUP(Data!$J62,tblCountries[[Actual]:[Mapping]],2,FALSE)","v":"India"},"2 to 3 hours per day",null,"UK"]
[null,"ID0080","2012-05-25T23:31:16",50000,50000,"USD",{"$f":"Data!$E63*VLOOKUP(Data!$F63,tblXrate[],2,FALSE)","v":46325},"Exceler","Manager","USA",{"$f":"VLOOKUP(Data!$J63,tblCountries[[Actual]:[Mapping]],2,FALSE)","v":"USA"},"2 to 3 hours per day",null,"USA"]
[null,"ID0082","2012-05-25T23:49:27","Â£30000",30000,"GBP",{"$f":"Data!$E64*VLOOKUP(Data!$F64,tblXrate[],2,FALSE)","v":20000},"Database Manager","Manager","UK",{"$f":"VLOOKUP(Data!$J64,tblCountries[[Actual]:[Mapping]],2,FALSE)","v":"India"},"4 to 6 hours a day",null,"UK"]
[null,"ID0083","2012-05-26T00:00:52",150000,150000,"USD",{"$f":"Data!$E65*VLOOKUP(Data!$F65,tblXrate[],2,FALSE)","v":38000},"Director","CXO or Top Mgmt.","USA",{"$f":"VLOOKUP(Data!$J65,tblCountries[[Actual]:[Mapping]],2,FALSE)","v":"USA"},"All the 8 hours baby, all the 8!",null,"USA"]
[null,"ID0084","2012-05-26T00:05:45",120000,120000,"USD",{"$f":"Data!$E66*VLOOKUP(Data!$F66,tblXrate[],2,FALSE)","v":32054.250037396621},"Manager, Forecasts & Budgets","Manager","USA",{"$f":"VLOOKUP(Data!$J66,tblCountries[[Actual]:[Mapping]],2,FALSE)","v":"India"},"4 to 6 hours a day",null,"USA"]
[null,"ID0085","2012-05-26T00:10:17",500000,500000,"INR",{"$f":"Data!$E67*VLOOKUP(Data!$F67,tblXrate[],2,FALSE)","v":33887.832849446611},"Senior Consultant","Consultant","India",{"$f":"VLOOKUP(Data!$J67,tblCountries[[Actual]:[Mapping]],2,FALSE)","v":"UK"},"All the 8 hours baby, all the 8!",null,"India"]
[null,"ID0087","2012-05-26T00:15:17",110000,110000,"USD",{"$f":"Data!$E68*VLOOKUP(Data!$F68,tblXrate[],2,FALSE)","v":60000},"Senior Scheduling Engineer","Engineer","USA",{"$f":"VLOOKUP(Data!$J68,tblCountries[[Actual]:[Mapping]],2,FALSE)","v":"USA"},"2 to 3 hours per day",null,"USA"]
[null,"ID0088","2012-05-26T00:22:49","81,000USD",81000,"USD",{"$f":"Data!$E69*VLOOKUP(Data!$F69,tblXrate[],2,FALSE)","v":7000},"Strategy Consultant","Consultant","UK",{"$f":"VLOOKUP(Data!$J69,tblCountries[[Actual]:[Mapping]],2,FALSE)","v":"India"},"4 to 6 hours a day",null,"UK"]
[null,"ID0089","2012-05-26T00:39:04",40000,40000,"USD",{"$f":"Data!$E70*VLOOKUP(Data!$F70,tblXrate[],2,FALSE)","v":55000},"Admin","Analyst","USA",{"$f":"VLOOKUP(Data!$J70,tblCountries[[Actual]:[Mapping]],2,FALSE)","v":"USA"},"4 to 6 hours a day",null,"USA"]
[null,"ID0090","2012-05-26T00:39:28",42000,42000,"CAD",{"$f":"Data!$E71*VLOOKUP(Data!$F71,tblXrate[],2,FALSE)","v":10000},"IT Asset Administrator","Analyst","Canada",{"$f":"VLOOKUP(Data!$J71,tblCountries[[Actual]:[Mapping]],2,FALSE)","v":"India"},"4 to 6 hours a day",null,"Canada"]
[null,"ID0091","2012-05-26T00:39:36",125000,125000,"USD",{"$f":"Data!$E72*VLOOKUP(Data!$F72,tblXrate[],2,FALSE)","v":55068.245289698301},"Director of Marketing","CXO or Top Mgmt.","USA",{"$f":"VLOOKUP(Data!$J72,tblCountries[[Actual]:[Mapping]],2,FALSE)","v":"Canada"},"4 to 6 hours a day",null,"USA"]
[null,"ID0092","2012-05-26T00:39:38",36000,36000,"USD",{"$f":"Data!$E73*VLOOKUP(Data!$F73,tblXrate[],2,FALSE)","v":12000},"Graphic Design Manager","Manager","USA",{"$f":"VLOOKUP(Data!$J73,tblCountries[[Actual]:[Mapping]],2,FALSE)","v":"USA"},"2 to 3 hours per day",null,"USA"]
[null,"ID0093","2012-05-26T00:39:54","Rs. 12,000/-",144000,"INR",{"$f":"Data!$E74*VLOOKUP(Data!$F74,tblXrate[],2,FALSE)","v":60000},"Financial Consultant","Consultant","India",{"$f":"VLOOKUP(Data!$J74,tblCountries[[Actual]:[Mapping]],2,FALSE)","v":"USA"},"1 or 2 hours a day",null,"India"]
[null,"ID0094","2012-05-26T00:40:00",75000,75000,"USD",{"$f":"Data!$E75*VLOOKUP(Data!$F75,tblXrate[],2,FALSE)","v":42000},"Data Analyst","Analyst","USA",{"$f":"VLOOKUP(Data!$J75,tblCountries[[Actual]:[Mapping]],2,FALSE)","v":"USA"},"1 or 2 hours a day",null,"USA"]
[null,"ID0095","2012-05-26T00:40:20",95000,95000,"USD",{"$f":"Data!$E76*VLOOKUP(Data!$F76,tblXrate[],2,FALSE)","v":30000},"CFO","CXO or Top Mgmt.","USA",{"$f":"VLOOKUP(Data!$J76,tblCountries[[Actual]:[Mapping]],2,FALSE)","v":"USA"},"4 to 6 hours a day",null,"USA"]
[null,"ID0096","2012-05-26T00:40:27",24000,24000,"USD",{"$f":"Data!$E77*VLOOKUP(Data!$F77,tblXrate[],2,FALSE)","v":75000},"Paraeducator","Manager","USA",{"$f":"VLOOKUP(Data!$J77,tblCountries[[Actual]:[Mapping]],2,FALSE)","v":"USA"},"2 to 3 hours per day",null,"USA"]
[null,"ID0097","2012-05-26T00:40:31","91,000 USD",91000,"USD",{"$f":"Data!$E78*VLOOKUP(Data!$F78,tblXrate[],2,FALSE)","v":2671.1875031163854},"Channel Marketing Manager","Manager","USA",{"$f":"VLOOKUP(Data!$J78,tblCountries[[Actual]:[Mapping]],2,FALSE)","v":"India"},"1 or 2 hours a day",null,"USA"]
[null,"ID0098","2012-05-26T00:40:39",40000,40000,"USD",{"$f":"Data!$E79*VLOOKUP(Data!$F79,tblXrate[],2,FALSE)","v":8547.8000099724322},"Sales and Marketing Analyst ","Analyst","USA",{"$f":"VLOOKUP(Data!$J79,tblCountries[[Actual]:[Mapping]],2,FALSE)","v":"India"},"4 to 6 hours a day",null,"USA"]
[null,"ID0099","2012-05-26T00:40:40",57000,57000,"USD",{"$f":"Data!$E80*VLOOKUP(Data!$F80,tblXrate[],2,FALSE)","v":3600},"Production Scheduler","Manager","USA",{"$f":"VLOOKUP(Data!$J80,tblCountries[[Actual]:[Mapping]],2,FALSE)","v":"India"},"4 to 6 hours a day",null,"USA"]
[null,"ID0100","2012-05-26T00:40:41",74000,74000,"USD",{"$f":"Data!$E81*VLOOKUP(Data!$F81,tblXrate[],2,FALSE)","v":39334.460921213074},"Senior Consultant","Consultant","USA",{"$f":"VLOOKUP(Data!$J81,tblCountries[[Actual]:[Mapping]],2,FALSE)","v":"Canada"},"4 to 6 hours a day",null,"USA"]
[null,"ID0101","2012-05-26T00:40:42","80k",80000,"USD",{"$f":"Data!$E82*VLOOKUP(Data!$F82,tblXrate[],2,FALSE)","v":50437.70470615309},"financial analyst","Analyst","USA",{"$f":"VLOOKUP(Data!$J82,tblCountries[[Actual]:[Mapping]],2,FALSE)","v":"UK"},"4 to 6 hours a day",null,"USA"]
[null,"ID0102","2012-05-26T00:40:46",90000,90000,"USD",{"$f":"Data!$E83*VLOOKUP(Data!$F83,tblXrate[],2,FALSE)","v":40000},"Product Specialist","Specialist","USA",{"$f":"VLOOKUP(Data!$J83,tblCountries[[Actual]:[Mapping]],2,FALSE)","v":"USA"},"4 to 6 hours a day",null,"USA"]
[null,"ID0104","2012-05-26T00:40:50",52000,52000,"USD",{"$f":"Data!$E84*VLOOKUP(Data!$F84,tblXrate[],2,FALSE)","v":29000},"sr. project coordinator","Manager","USA",{"$f":"VLOOKUP(Data!$J84,tblCountries[[Actual]:[Mapping]],2,FALSE)","v":"USA"},"4 to 6 hours a day",null,"USA"]
[null,"ID0106","2012-05-26T00:40:57",36000,36000,"USD",{"$f":"Data!$E85*VLOOKUP(Data!$F85,tblXrate[],2,FALSE)","v":48000},"Analyst","Analyst","USA",{"$f":"VLOOKUP(Data!$J85,tblCountries[[Actual]:[Mapping]],2,FALSE)","v":"USA"},"4 to 6 hours a day",null,"USA"]
[null,"ID0107","2012-05-26T00:41:02",57400,57400,"USD",{"$f":"Data!$E86*VLOOKUP(Data!$F86,tblXrate[],2,FALSE)","v":48000},"IT Analyst","Analyst","USA",{"$f":"VLOOKUP(Data!$J86,tblCountries[[Actual]:[Mapping]],2,FALSE)","v":"USA"},"4 to 6 hours a day",null,"USA"]
[null,"ID0108","2012-05-26T00:41:03",66000,66000,"USD",{"$f":"Data!$E87*VLOOKUP(Data!$F87,tblXrate[],2,FALSE)","v":63000},"Analyst","Analyst","USA",{"$f":"VLOOKUP(Data!$J87,tblCountries[[Actual]:[Mapping]],2,FALSE)","v":"USA"},"2 to 3 hours per day",null,"USA"]
[null,"ID0111","2012-05-26T00:41:16","$85,000+",85000,"USD",{"$f":"Data!$E88*VLOOKUP(Data!$F88,tblXrate[],2,FALSE)","v":46000},"Strategic Analyst","Analyst","USA",{"$f":"VLOOKUP(Data!$J88,tblCountries[[Actual]:[Mapping]],2,FALSE)","v":"USA"},"4 to 6 hours a day",null,"USA"]
[null,"ID0112","2012-05-26T00:41:22",50000,50000,"USD",{"$f":"Data!$E89*VLOOKUP(Data!$F89,tblXrate[],2,FALSE)","v":48000},"Transportation Specialist","Specialist","USA",{"$f":"VLOOKUP(Data!$J89,tblCountries[[Actual]:[Mapping]],2,FALSE)","v":"USA"},"4 to 6 hours a day",null,"USA"]
[null,"ID0113","2012-05-26T00:41:27","$58,000 USD",58000,"USD",{"$f":"Data!$E90*VLOOKUP(Data!$F90,tblXrate[],2,FALSE)","v":8000},"Operations Programs Support","Manager","USA",{"$f":"VLOOKUP(Data!$J90,tblCountries[[Actual]:[Mapping]],2,FALSE)","v":"Thailand"},"4 to 6 hours a day",null,"USA"]
[null,"ID0114","2012-05-26T00:41:28",37900,37900,"USD",{"$f":"Data!$E91*VLOOKUP(Data!$F91,tblXrate[],2,FALSE)","v":15000},"Accounting Coordinator","Accountant","USA",{"$f":"VLOOKUP(Data!$J91,tblCountries[[Actual]:[Mapping]],2,FALSE)","v":"Indonesia"},"All the 8 hours baby, all the 8!",null,"USA"]
[null,"ID0116","2012-05-26T00:41:32",67000,67000,"USD",{"$f":"Data!$E92*VLOOKUP(Data!$F92,tblXrate[],2,FALSE)","v":10000},"Operations Cost Analyst","Analyst","USA",{"$f":"VLOOKUP(Data!$J92,tblCountries[[Actual]:[Mapping]],2,FALSE)","v":"Brazil"},"4 to 6 hours a day",null,"USA"]
[null,"ID0118","2012-05-26T00:41:35",56160,56160,"USD",{"$f":"Data!$E93*VLOOKUP(Data!$F93,tblXrate[],2,FALSE)","v":20000},"Utilization Analyst","Analyst","USA",{"$f":"VLOOKUP(Data!$J93,tblCountries[[Actual]:[Mapping]],2,FALSE)","v":"Hong Kong"},"4 to 6 hours a day",null,"USA"]
[null,"ID0120","2012-05-26T00:41:38",52000,52000,"USD",{"$f":"Data!$E94*VLOOKUP(Data!$F94,tblXrate[],2,FALSE)","v":30000},"Market Analyst","Analyst","USA",{"$f":"VLOOKUP(Data!$J94,tblCountries[[Actual]:[Mapping]],2,FALSE)","v":"Brazil"},"Excel ?!? What Excel?",null,"USA"]
[null,"ID0121","2012-05-26T00:41:41",60000,60000,"CAD",{"$f":"Data!$E95*VLOOKUP(Data!$F95,tblXrate[],2,FALSE)","v":30273.458368652366},"Web Developer","Analyst","Canada",{"$f":"VLOOKUP(Data!$J95,tblCountries[[Actual]:[Mapping]],2,FALSE)","v":"India"},"Excel ?!? What Excel?",null,"Canada"]
[null,"ID0122","2012-05-26T00:41:43",70000,70000,"USD",{"$f":"Data!$E96*VLOOKUP(Data!$F96,tblXrate[],2,FALSE)","v":71231.666749770273},"Sr. Acct","Accountant","USA",{"$f":"VLOOKUP(Data!$J96,tblCountries[[Actual]:[Mapping]],2,FALSE)","v":"India"},"All the 8 hours baby, all the 8!",null,"USA"]
[null,"ID0123","2012-05-26T00:41:56",50000,50000,"USD",{"$f":"Data!$E97*VLOOKUP(Data!$F97,tblXrate[],2,FALSE)","v":34357.533974522659},"Information Systems Specialist","Specialist","USA",{"$f":"VLOOKUP(Data!$J97,tblCountries[[Actual]:[Mapping]],2,FALSE)","v":"UK"},"4 to 6 hours a day",null,"USA"]
[null,"ID0124","2012-05-26T00:41:58",2300000,2300000,"INR",{"$f":"Data!$E98*VLOOKUP(Data!$F98,tblXrate[],2,FALSE)","v":8013.5625093491553},"Analytics lead","Analyst","India",{"$f":"VLOOKUP(Data!$J98,tblCountries[[Actual]:[Mapping]],2,FALSE)","v":"India"},"1 or 2 hours a day",null,"India"]
[null,"ID0125","2012-05-26T00:42:00",80000,80000,"USD",{"$f":"Data!$E99*VLOOKUP(Data!$F99,tblXrate[],2,FALSE)","v":45616},"Financial Analyst","Analyst","USA",{"$f":"VLOOKUP(Data!$J99,tblCountries[[Actual]:[Mapping]],2,FALSE)","v":"Australia"},"4 to 6 hours a day",null,"USA"]
[null,"ID0126","2012-05-26T00:42:08",128000,128000,"USD",{"$f":"Data!$E100*VLOOKUP(Data!$F100,tblXrate[],2,FALSE)","v":6232.7708406048987},"Actuary","Manager","USA",{"$f":"VLOOKUP(Data!$J100,tblCountries[[Actual]:[Mapping]],2,FALSE)","v":"India"},"All the 8 hours baby, all the 8!",null,"USA"]
[null,"ID0127","2012-05-26T00:42:10","US $44,000",44000,"USD",{"$f":"Data!$E101*VLOOKUP(Data!$F101,tblXrate[],2,FALSE)","v":61000},"School Tech Coordinator","Manager","USA",{"$f":"VLOOKUP(Data!$J101,tblCountries[[Actual]:[Mapping]],2,FALSE)","v":"USA"},"1 or 2 hours a day",null,"USA"]
[null,"ID0128","2012-05-26T00:42:11",65000,65000,"USD",{"$f":"Data!$E102*VLOOKUP(Data!$F102,tblXrate[],2,FALSE)","v":6232.7708406048987},"sr accountant","Accountant","USA",{"$f":"VLOOKUP(Data!$J102,tblCountries[[Actual]:[Mapping]],2,FALSE)","v":"India"},"All the 8 hours baby, all the 8!",null,"USA"]
[null,"ID0130","2012-05-26T00:42:34",1000,12000,"USD",{"$f":"Data!$E103*VLOOKUP(Data!$F103,tblXrate[],2,FALSE)","v":75000},"Freelance","Consultant","Pakistan",{"$f":"VLOOKUP(Data!$J103,tblCountries[[Actual]:[Mapping]],2,FALSE)","v":"USA"},"1 or 2 hours a day",null,"Pakistan"]
[null,"ID0131","2012-05-26T00:42:41",28159.200000000001,28159,"GBP",{"$f":"Data!$E104*VLOOKUP(Data!$F104,tblXrate[],2,FALSE)","v":75000},"Data Analyst","Analyst","UK",{"$f":"VLOOKUP(Data!$J104,tblCountries[[Actual]:[Mapping]],2,FALSE)","v":"USA"},"All the 8 hours baby, all the 8!",null,"UK"]
[null,"ID0132","2012-05-26T00:42:46",45000,45000,"USD",{"$f":"Data!$E105*VLOOKUP(Data!$F105,tblXrate[],2,FALSE)","v":25000},"DBA","Analyst","USA",{"$f":"VLOOKUP(Data!$J105,tblCountries[[Actual]:[Mapping]],2,FALSE)","v":"India"},"4 to 6 hours a day",null,"USA"]
[null,"ID0133","2012-05-26T00:42:58",54000,54000,"USD",{"$f":"Data!$E106*VLOOKUP(Data!$F106,tblXrate[],2,FALSE)","v":49443.946165553374},"Research Analyst","Analyst","USA",{"$f":"VLOOKUP(Data!$J106,tblCountries[[Actual]:[Mapping]],2,FALSE)","v":"Belgium"},"2 to 3 hours per day",null,"USA"]
[null,"ID0134","2012-05-26T00:43:03",70000,70000,"GBP",{"$f":"Data!$E107*VLOOKUP(Data!$F107,tblXrate[],2,FALSE)","v":4095.8208381117906},"Project Manager","Manager","UK",{"$f":"VLOOKUP(Data!$J107,tblCountries[[Actual]:[Mapping]],2,FALSE)","v":"India"},"2 to 3 hours per day",null,"UK"]
[null,"ID0135","2012-05-26T00:43:07",71000,71000,"USD",{"$f":"Data!$E108*VLOOKUP(Data!$F108,tblXrate[],2,FALSE)","v":4451.9791718606421},"Market Research Analyst","Analyst","USA",{"$f":"VLOOKUP(Data!$J108,tblCountries[[Actual]:[Mapping]],2,FALSE)","v":"India"},"4 to 6 hours a day",null,"USA"]
[null,"ID0136","2012-05-26T00:43:08",800000,800000,"INR",{"$f":"Data!$E109*VLOOKUP(Data!$F109,tblXrate[],2,FALSE)","v":45000},"Manager : Accounts","Manager","India",{"$f":"VLOOKUP(Data!$J109,tblCountries[[Actual]:[Mapping]],2,FALSE)","v":"USA"},"2 to 3 hours per day",null,"India"]
[null,"ID0137","2012-05-26T00:43:17",70000,70000,"CAD",{"$f":"Data!$E110*VLOOKUP(Data!$F110,tblXrate[],2,FALSE)","v":5342.3750062327708},"project manager","Manager","canada",{"$f":"VLOOKUP(Data!$J110,tblCountries[[Actual]:[Mapping]],2,FALSE)","v":"India"},"4 to 6 hours a day",null,"Canada"]
[null,"ID0138","2012-05-26T00:43:25",50000,50000,"CAD",{"$f":"Data!$E111*VLOOKUP(Data!$F111,tblXrate[],2,FALSE)","v":15000},"Inventory manger","Manager","Canada",{"$f":"VLOOKUP(Data!$J111,tblCountries[[Actual]:[Mapping]],2,FALSE)","v":"India"},"4 to 6 hours a day",null,"Canada"]
[null,"ID0139","2012-05-26T00:43:27",40000,40000,"USD",{"$f":"Data!$E112*VLOOKUP(Data!$F112,tblXrate[],2,FALSE)","v":2122.8177433598262},"Business Analyst","Analyst","USA",{"$f":"VLOOKUP(Data!$J112,tblCountries[[Actual]:[Mapping]],2,FALSE)","v":"Pakistan"},"4 to 6 hours a day",null,"USA"]
[null,"ID0140","2012-05-26T00:43:34","$62,000 CND",62000,"CAD",{"$f":"Data!$E113*VLOOKUP(Data!$F113,tblXrate[],2,FALSE)","v":4630.058338735068},"Process Technician","Analyst","Canada",{"$f":"VLOOKUP(Data!$J113,tblCountries[[Actual]:[Mapping]],2,FALSE)","v":"India"},"2 to 3 hours per day",null,"Canada"]
[null,"ID0141","2012-05-26T00:43:36","28000rs",336000,"INR",{"$f":"Data!$E114*VLOOKUP(Data!$F114,tblXrate[],2,FALSE)","v":11539.530013462785},"MIS Team Leader","Reporting","India",{"$f":"VLOOKUP(Data!$J114,tblCountries[[Actual]:[Mapping]],2,FALSE)","v":"India"},"4 to 6 hours a day",null,"India"]
[null,"ID0142","2012-05-26T00:43:36",53000,53000,"USD",{"$f":"Data!$E115*VLOOKUP(Data!$F115,tblXrate[],2,FALSE)","v":6588.9291743537506},"Data Analyst","Analyst","USA",{"$f":"VLOOKUP(Data!$J115,tblCountries[[Actual]:[Mapping]],2,FALSE)","v":"India"},"4 to 6 hours a day",null,"USA"]
[null,"ID0143","2012-05-26T00:43:49",104000,104000,"USD",{"$f":"Data!$E116*VLOOKUP(Data!$F116,tblXrate[],2,FALSE)","v":6588.9291743537506},"Finance Director","CXO or Top Mgmt.","USA",{"$f":"VLOOKUP(Data!$J116,tblCountries[[Actual]:[Mapping]],2,FALSE)","v":"India"},"2 to 3 hours per day",null,"USA"]
[null,"ID0144","2012-05-26T00:44:02",57000,57000,"USD",{"$f":"Data!$E117*VLOOKUP(Data!$F117,tblXrate[],2,FALSE)","v":10684.750012465542},"Industrial Engineer","Engineer","USA",{"$f":"VLOOKUP(Data!$J117,tblCountries[[Actual]:[Mapping]],2,FALSE)","v":"India"},"4 to 6 hours a day",null,"USA"]
[null,"ID0145","2012-05-26T00:44:09",45000,45000,"USD",{"$f":"Data!$E118*VLOOKUP(Data!$F118,tblXrate[],2,FALSE)","v":10000},"data analyst","Analyst","USA",{"$f":"VLOOKUP(Data!$J118,tblCountries[[Actual]:[Mapping]],2,FALSE)","v":"India"},"2 to 3 hours per day",null,"USA"]
[null,"ID0146","2012-05-26T00:44:15",92000,92000,"USD",{"$f":"Data!$E119*VLOOKUP(Data!$F119,tblXrate[],2,FALSE)","v":11325.835013213473},"Senior Financial & Systems Analyst","Analyst","USA",{"$f":"VLOOKUP(Data!$J119,tblCountries[[Actual]:[Mapping]],2,FALSE)","v":"India"},"4 to 6 hours a day",null,"USA"]
[null,"ID0147","2012-05-26T00:44:18",88000,88000,"USD",{"$f":"Data!$E120*VLOOKUP(Data!$F120,tblXrate[],2,FALSE)","v":8903.9583437212841},"project manager - metrics","Manager","USA",{"$f":"VLOOKUP(Data!$J120,tblCountries[[Actual]:[Mapping]],2,FALSE)","v":"India"},"4 to 6 hours a day",null,"USA"]
[null,"ID0148","2012-05-26T00:44:20",80000,80000,"USD",{"$f":"Data!$E121*VLOOKUP(Data!$F121,tblXrate[],2,FALSE)","v":2165.2740982270229},"Informatics Research Analyst","Analyst","USA",{"$f":"VLOOKUP(Data!$J121,tblCountries[[Actual]:[Mapping]],2,FALSE)","v":"Pakistan"},"2 to 3 hours per day",null,"USA"]
[null,"ID0149","2012-05-26T00:44:22",69000,69000,"USD",{"$f":"Data!$E122*VLOOKUP(Data!$F122,tblXrate[],2,FALSE)","v":15000},"Business Technical Consultant","Consultant","USA",{"$f":"VLOOKUP(Data!$J122,tblCountries[[Actual]:[Mapping]],2,FALSE)","v":"India"},"4 to 6 hours a day",null,"USA"]
[null,"ID0151","2012-05-26T00:44:40",35000,35000,"USD",{"$f":"Data!$E123*VLOOKUP(Data!$F123,tblXrate[],2,FALSE)","v":2136.9500024931081},"Program Services Coordinator","Manager","USA",{"$f":"VLOOKUP(Data!$J123,tblCountries[[Actual]:[Mapping]],2,FALSE)","v":"India"},"2 to 3 hours per day",null,"USA"]
[null,"ID0152","2012-05-26T00:44:59",96000,96000,"USD",{"$f":"Data!$E124*VLOOKUP(Data!$F124,tblXrate[],2,FALSE)","v":3917.7416712373652},"Specialist - Finance Planning and Analysis","Analyst","USA",{"$f":"VLOOKUP(Data!$J124,tblCountries[[Actual]:[Mapping]],2,FALSE)","v":"India"},"4 to 6 hours a day",null,"USA"]
[null,"ID0153","2012-05-26T00:45:00",65000,65000,"USD",{"$f":"Data!$E125*VLOOKUP(Data!$F125,tblXrate[],2,FALSE)","v":2671.1875031163854},"Sr Accountant","Accountant","USA",{"$f":"VLOOKUP(Data!$J125,tblCountries[[Actual]:[Mapping]],2,FALSE)","v":"India"},"All the 8 hours baby, all the 8!",null,"USA"]
[null,"ID0154","2012-05-26T00:45:06",37440,37440,"USD",{"$f":"Data!$E126*VLOOKUP(Data!$F126,tblXrate[],2,FALSE)","v":15136.729184326183},"sales analyst","Analyst","USA",{"$f":"VLOOKUP(Data!$J126,tblCountries[[Actual]:[Mapping]],2,FALSE)","v":"India"},"All the 8 hours baby, all the 8!",null,"USA"]
[null,"ID0156","2012-05-26T00:45:17","90000 USD",90000,"USD",{"$f":"Data!$E127*VLOOKUP(Data!$F127,tblXrate[],2,FALSE)","v":3027.3458368652364},"Senior Data Quality Analyst","Analyst","USA",{"$f":"VLOOKUP(Data!$J127,tblCountries[[Actual]:[Mapping]],2,FALSE)","v":"India"},"2 to 3 hours per day",null,"USA"]
[null,"ID0157","2012-05-26T00:45:46",66500,66500,"USD",{"$f":"Data!$E128*VLOOKUP(Data!$F128,tblXrate[],2,FALSE)","v":53356.776437647524},"Sr Business Analyst","Analyst","USA",{"$f":"VLOOKUP(Data!$J128,tblCountries[[Actual]:[Mapping]],2,FALSE)","v":"Netherlands"},"All the 8 hours baby, all the 8!",null,"USA"]
[null,"ID0158","2012-05-26T00:45:49",100000,100000,"USD",{"$f":"Data!$E129*VLOOKUP(Data!$F129,tblXrate[],2,FALSE)","v":30000},"COST ACCOUNTANT","Accountant","USA",{"$f":"VLOOKUP(Data!$J129,tblCountries[[Actual]:[Mapping]],2,FALSE)","v":"India"},"All the 8 hours baby, all the 8!",null,"USA"]
[null,"ID0159","2012-05-26T00:45:51","Â£32250",32250,"GBP",{"$f":"Data!$E130*VLOOKUP(Data!$F130,tblXrate[],2,FALSE)","v":3561.5833374885137},"project Support","Manager","UK",{"$f":"VLOOKUP(Data!$J130,tblCountries[[Actual]:[Mapping]],2,FALSE)","v":"India"},"4 to 6 hours a day",null,"UK"]
[null,"ID0160","2012-05-26T00:45:53",420000,420000,"INR",{"$f":"Data!$E131*VLOOKUP(Data!$F131,tblXrate[],2,FALSE)","v":3000},"managerial","Manager","India",{"$f":"VLOOKUP(Data!$J131,tblCountries[[Actual]:[Mapping]],2,FALSE)","v":"Pakistan"},"1 or 2 hours a day",null,"India"]
[null,"ID0161","2012-05-26T00:46:00",75000,75000,"USD",{"$f":"Data!$E132*VLOOKUP(Data!$F132,tblXrate[],2,FALSE)","v":40000},"Program Analyst","Analyst","USA",{"$f":"VLOOKUP(Data!$J132,tblCountries[[Actual]:[Mapping]],2,FALSE)","v":"USA"},"1 or 2 hours a day",null,"USA"]
[null,"ID0162","2012-05-26T00:46:25",58,58000,"USD",{"$f":"Data!$E133*VLOOKUP(Data!$F133,tblXrate[],2,FALSE)","v":13801.135432767991},"Team Lead - Computer Discounts","Manager","Canada",{"$f":"VLOOKUP(Data!$J133,tblCountries[[Actual]:[Mapping]],2,FALSE)","v":"India"},"1 or 2 hours a day",null,"Canada"]
[null,"ID0163","2012-05-26T00:46:29",55000,55000,"USD",{"$f":"Data!$E134*VLOOKUP(Data!$F134,tblXrate[],2,FALSE)","v":8547.8000099724322},"Change Architect","Manager","USA",{"$f":"VLOOKUP(Data!$J134,tblCountries[[Actual]:[Mapping]],2,FALSE)","v":"India"},"2 to 3 hours per day",null,"USA"]
[null,"ID0164","2012-05-26T00:47:42",60000,60000,"USD",{"$f":"Data!$E135*VLOOKUP(Data!$F135,tblXrate[],2,FALSE)","v":15000},"Telecom Technician","Analyst","USA",{"$f":"VLOOKUP(Data!$J135,tblCountries[[Actual]:[Mapping]],2,FALSE)","v":"India"},"4 to 6 hours a day",null,"USA"]
[null,"ID0165","2012-05-26T00:47:45","Rs. 1300000",1300000,"INR",{"$f":"Data!$E136*VLOOKUP(Data!$F136,tblXrate[],2,FALSE)","v":57726.886552389187},"Manager","Manager","India",{"$f":"VLOOKUP(Data!$J136,tblCountries[[Actual]:[Mapping]],2,FALSE)","v":"Australia"},"4 to 6 hours a day",null,"India"]
[null,"ID0166","2012-05-26T00:47:50",107000,107000,"CAD",{"$f":"Data!$E137*VLOOKUP(Data!$F137,tblXrate[],2,FALSE)","v":20000},"Manager, Asset Optimization","Manager","Canada",{"$f":"VLOOKUP(Data!$J137,tblCountries[[Actual]:[Mapping]],2,FALSE)","v":"Australia"},"2 to 3 hours per day",null,"Canada"]
[null,"ID0168","2012-05-26T00:48:04",22880,22880,"USD",{"$f":"Data!$E138*VLOOKUP(Data!$F138,tblXrate[],2,FALSE)","v":122389.15876831629},"Accounting ","Accountant","USA",{"$f":"VLOOKUP(Data!$J138,tblCountries[[Actual]:[Mapping]],2,FALSE)","v":"Australia"},"4 to 6 hours a day",null,"USA"]
[null,"ID0169","2012-05-26T00:48:07",80000,80000,"USD",{"$f":"Data!$E139*VLOOKUP(Data!$F139,tblXrate[],2,FALSE)","v":71393.675948184507},"Consultant, HR Services & Governance","Consultant","USA",{"$f":"VLOOKUP(Data!$J139,tblCountries[[Actual]:[Mapping]],2,FALSE)","v":"Australia"},"4 to 6 hours a day",null,"USA"]
[null,"ID0170","2012-05-26T00:48:11","Rs 5 lakh",500000,"INR",{"$f":"Data!$E140*VLOOKUP(Data!$F140,tblXrate[],2,FALSE)","v":4840.0244548604041},"QA Executive","Analyst","India",{"$f":"VLOOKUP(Data!$J140,tblCountries[[Actual]:[Mapping]],2,FALSE)","v":"Pakistan"},"2 to 3 hours per day",null,"India"]
[null,"ID0171","2012-05-26T00:48:46",90000,90000,"CAD",{"$f":"Data!$E141*VLOOKUP(Data!$F141,tblXrate[],2,FALSE)","v":21369.500024931083},"Senior Actuarial Analyst","Analyst","Canada",{"$f":"VLOOKUP(Data!$J141,tblCountries[[Actual]:[Mapping]],2,FALSE)","v":"India"},"4 to 6 hours a day",null,"Canada"]
[null,"ID0172","2012-05-26T00:48:48",180000,180000,"INR",{"$f":"Data!$E142*VLOOKUP(Data!$F142,tblXrate[],2,FALSE)","v":23642.674081009263},"Sr. Associate","Analyst","India",{"$f":"VLOOKUP(Data!$J142,tblCountries[[Actual]:[Mapping]],2,FALSE)","v":"UK"},"4 to 6 hours a day",null,"India"]
[null,"ID0173","2012-05-26T00:48:48",46584,46584,"USD",{"$f":"Data!$E143*VLOOKUP(Data!$F143,tblXrate[],2,FALSE)","v":7123.1666749770275},"Budget Analyst","Analyst","USA",{"$f":"VLOOKUP(Data!$J143,tblCountries[[Actual]:[Mapping]],2,FALSE)","v":"India"},"4 to 6 hours a day",null,"USA"]
[null,"ID0174","2012-05-26T00:48:48",67000,67000,"USD",{"$f":"Data!$E144*VLOOKUP(Data!$F144,tblXrate[],2,FALSE)","v":40000},"B.I. Data Analyst II","Analyst","USA",{"$f":"VLOOKUP(Data!$J144,tblCountries[[Actual]:[Mapping]],2,FALSE)","v":"India"},"4 to 6 hours a day",null,"USA"]
[null,"ID0175","2012-05-26T00:48:57","Rd. 11 lakhs",1100000,"INR",{"$f":"Data!$E145*VLOOKUP(Data!$F145,tblXrate[],2,FALSE)","v":8600},"Asst manager investor relations and business analytics","Manager","India",{"$f":"VLOOKUP(Data!$J145,tblCountries[[Actual]:[Mapping]],2,FALSE)","v":"India"},"4 to 6 hours a day",null,"India"]
[null,"ID0176","2012-05-26T00:49:18",92000,92000,"USD",{"$f":"Data!$E146*VLOOKUP(Data!$F146,tblXrate[],2,FALSE)","v":50064.150455673145},"Industrial Engineer (Fed)","Engineer","USA",{"$f":"VLOOKUP(Data!$J146,tblCountries[[Actual]:[Mapping]],2,FALSE)","v":"UK"},"4 to 6 hours a day",null,"USA"]
[null,"ID0177","2012-05-26T00:49:21",75000,75000,"USD",{"$f":"Data!$E147*VLOOKUP(Data!$F147,tblXrate[],2,FALSE)","v":56000},"Informatics specialist","Specialist","USA",{"$f":"VLOOKUP(Data!$J147,tblCountries[[Actual]:[Mapping]],2,FALSE)","v":"USA"},"All the 8 hours baby, all the 8!",null,"USA"]
[null,"ID0178","2012-05-26T00:49:35",180000,180000,"INR",{"$f":"Data!$E148*VLOOKUP(Data!$F148,tblXrate[],2,FALSE)","v":88000},"Sr. Associate","Analyst","India",{"$f":"VLOOKUP(Data!$J148,tblCountries[[Actual]:[Mapping]],2,FALSE)","v":"USA"},"4 to 6 hours a day",null,"India"]
[null,"ID0179","2012-05-26T00:49:48",18500,18500,"GBP",{"$f":"Data!$E149*VLOOKUP(Data!$F149,tblXrate[],2,FALSE)","v":8013.5625093491553},"Trainee Management Accountant","Manager","UK",{"$f":"VLOOKUP(Data!$J149,tblCountries[[Actual]:[Mapping]],2,FALSE)","v":"India"},"All the 8 hours baby, all the 8!",null,"UK"]
[null,"ID0180","2012-05-26T00:49:50",40000,40000,"USD",{"$f":"Data!$E150*VLOOKUP(Data!$F150,tblXrate[],2,FALSE)","v":40980.635073749385},"Senior analyst","Analyst","USA",{"$f":"VLOOKUP(Data!$J150,tblCountries[[Actual]:[Mapping]],2,FALSE)","v":"UK"},"All the 8 hours baby, all the 8!",null,"USA"]
[null,"ID0181","2012-05-26T00:49:59",111680,111680,"USD",{"$f":"Data!$E151*VLOOKUP(Data!$F151,tblXrate[],2,FALSE)","v":48955.663507326513},"Director of Analytics","Analyst","USA",{"$f":"VLOOKUP(Data!$J151,tblCountries[[Actual]:[Mapping]],2,FALSE)","v":"Australia"},"2 to 3 hours per day",null,"USA"]
[null,"ID0182","2012-05-26T00:50:11",41.405999999999999,41406,"USD",{"$f":"Data!$E152*VLOOKUP(Data!$F152,tblXrate[],2,FALSE)","v":10684.750012465542},"Executive Assistant","Analyst","Canada",{"$f":"VLOOKUP(Data!$J152,tblCountries[[Actual]:[Mapping]],2,FALSE)","v":"India"},"1 or 2 hours a day",null,"Canada"]
[null,"ID0183","2012-05-26T00:50:15",70000,70000,"USD",{"$f":"Data!$E153*VLOOKUP(Data!$F153,tblXrate[],2,FALSE)","v":8903.9583437212841},"Project Speciast","Manager","USA",{"$f":"VLOOKUP(Data!$J153,tblCountries[[Actual]:[Mapping]],2,FALSE)","v":"India"},"4 to 6 hours a day",null,"USA"]
[null,"ID0184","2012-05-26T00:50:31",40700,40700,"USD",{"$f":"Data!$E154*VLOOKUP(Data!$F154,tblXrate[],2,FALSE)","v":3632.815004238284},"Sales Coordinator & Analytical Support","Analyst","USA",{"$f":"VLOOKUP(Data!$J154,tblCountries[[Actual]:[Mapping]],2,FALSE)","v":"India"},"1 or 2 hours a day",null,"USA"]
[null,"ID0185","2012-05-26T00:50:32",40000,40000,"USD",{"$f":"Data!$E155*VLOOKUP(Data!$F155,tblXrate[],2,FALSE)","v":40980.635073749385},"analyst","Analyst","USA",{"$f":"VLOOKUP(Data!$J155,tblCountries[[Actual]:[Mapping]],2,FALSE)","v":"UK"},"4 to 6 hours a day",null,"USA"]
[null,"ID0186","2012-05-26T00:50:38",60000,60000,"USD",{"$f":"Data!$E156*VLOOKUP(Data!$F156,tblXrate[],2,FALSE)","v":125000},"Senior Staff Accountant","Accountant","USA",{"$f":"VLOOKUP(Data!$J156,tblCountries[[Actual]:[Mapping]],2,FALSE)","v":"USA"},"4 to 6 hours a day",null,"USA"]
[null,"ID0187","2012-05-26T00:50:41",92000,92000,"CAD",{"$f":"Data!$E157*VLOOKUP(Data!$F157,tblXrate[],2,FALSE)","v":57678},"Consultant - Retail Mkts","Consultant","Canada",{"$f":"VLOOKUP(Data!$J157,tblCountries[[Actual]:[Mapping]],2,FALSE)","v":"USA"},"All the 8 hours baby, all the 8!",null,"Canada"]
[null,"ID0188","2012-05-26T00:50:43",13636.36,13636,"USD",{"$f":"Data!$E158*VLOOKUP(Data!$F158,tblXrate[],2,FALSE)","v":24000},"Process Manager","Manager","India",{"$f":"VLOOKUP(Data!$J158,tblCountries[[Actual]:[Mapping]],2,FALSE)","v":"USA"},"All the 8 hours baby, all the 8!",null,"India"]
[null,"ID0189","2012-05-26T00:50:43",80000,80000,"USD",{"$f":"Data!$E159*VLOOKUP(Data!$F159,tblXrate[],2,FALSE)","v":5698.5333399816218},"Project Manager (Process Owner)","Manager","USA",{"$f":"VLOOKUP(Data!$J159,tblCountries[[Actual]:[Mapping]],2,FALSE)","v":"India"},"2 to 3 hours per day",null,"USA"]
[null,"ID0190","2012-05-26T00:51:00","60000 CAD$",60000,"CAD",{"$f":"Data!$E160*VLOOKUP(Data!$F160,tblXrate[],2,FALSE)","v":42000},"Demographer","Analyst","Canada",{"$f":"VLOOKUP(Data!$J160,tblCountries[[Actual]:[Mapping]],2,FALSE)","v":"USA"},"2 to 3 hours per day",null,"Canada"]
[null,"ID0192","2012-05-26T00:51:43",28000,28000,"USD",{"$f":"Data!$E161*VLOOKUP(Data!$F161,tblXrate[],2,FALSE)","v":66000},"Administrative Assistant","Analyst","USA",{"$f":"VLOOKUP(Data!$J161,tblCountries[[Actual]:[Mapping]],2,FALSE)","v":"USA"},"4 to 6 hours a day",null,"USA"]
[null,"ID0193","2012-05-26T00:51:55",60000,60000,"USD",{"$f":"Data!$E162*VLOOKUP(Data!$F162,tblXrate[],2,FALSE)","v":39404.456801682099},"Accounting/Financial Analyst","Analyst","USA",{"$f":"VLOOKUP(Data!$J162,tblCountries[[Actual]:[Mapping]],2,FALSE)","v":"UK"},"4 to 6 hours a day",null,"USA"]
[null,"ID0194","2012-05-26T00:51:59",96000,96000,"USD",{"$f":"Data!$E163*VLOOKUP(Data!$F163,tblXrate[],2,FALSE)","v":6000},"Business Process Specialist","Specialist","USA",{"$f":"VLOOKUP(Data!$J163,tblCountries[[Actual]:[Mapping]],2,FALSE)","v":"India"},"2 to 3 hours per day",null,"USA"]
[null,"ID0195","2012-05-26T00:52:21",67000,67000,"USD",{"$f":"Data!$E164*VLOOKUP(Data!$F164,tblXrate[],2,FALSE)","v":50000},"Financial Analyst","Analyst","USA",{"$f":"VLOOKUP(Data!$J164,tblCountries[[Actual]:[Mapping]],2,FALSE)","v":"USA"},"4 to 6 hours a day",null,"USA"]
[null,"ID0196","2012-05-26T00:52:25",70000,70000,"USD",{"$f":"Data!$E165*VLOOKUP(Data!$F165,tblXrate[],2,FALSE)","v":55000},"Sr Financial Analyst","Analyst","USA",{"$f":"VLOOKUP(Data!$J165,tblCountries[[Actual]:[Mapping]],2,FALSE)","v":"USA"},"4 to 6 hours a day",null,"USA"]
[null,"ID0197","2012-05-26T00:52:30",233000,233000,"INR",{"$f":"Data!$E166*VLOOKUP(Data!$F166,tblXrate[],2,FALSE)","v":42000},"Asst. Manager (MIS)","Manager","India",{"$f":"VLOOKUP(Data!$J166,tblCountries[[Actual]:[Mapping]],2,FALSE)","v":"USA"},"All the 8 hours baby, all the 8!",null,"India"]
[null,"ID0198","2012-05-26T00:52:37","US$ 99000",99000,"USD",{"$f":"Data!$E167*VLOOKUP(Data!$F167,tblXrate[],2,FALSE)","v":12109.383347460946},"Business Controller","Controller","USA",{"$f":"VLOOKUP(Data!$J167,tblCountries[[Actual]:[Mapping]],2,FALSE)","v":"India"},"4 to 6 hours a day",null,"USA"]
[null,"ID0200","2012-05-26T00:53:00",90000,90000,"USD",{"$f":"Data!$E168*VLOOKUP(Data!$F168,tblXrate[],2,FALSE)","v":10000},"Project Manager","Manager","USA",{"$f":"VLOOKUP(Data!$J168,tblCountries[[Actual]:[Mapping]],2,FALSE)","v":"India"},"2 to 3 hours per day",null,"USA"]
[null,"ID0201","2012-05-26T00:53:02","Rs. 275000",275000,"INR",{"$f":"Data!$E169*VLOOKUP(Data!$F169,tblXrate[],2,FALSE)","v":80000},"low level monitoring","Analyst","India",{"$f":"VLOOKUP(Data!$J169,tblCountries[[Actual]:[Mapping]],2,FALSE)","v":"USA"},"2 to 3 hours per day",null,"India"]
[null,"ID0202","2012-05-26T00:53:18","INR 16000",192000,"INR",{"$f":"Data!$E170*VLOOKUP(Data!$F170,tblXrate[],2,FALSE)","v":10000},"Administrative","Analyst","India",{"$f":"VLOOKUP(Data!$J170,tblCountries[[Actual]:[Mapping]],2,FALSE)","v":"USA"},"All the 8 hours baby, all the 8!",null,"India"]
[null,"ID0203","2012-05-26T00:53:37",51000,51000,"USD",{"$f":"Data!$E171*VLOOKUP(Data!$F171,tblXrate[],2,FALSE)","v":35401.014829091764},"Service Line Coordinator","Manager","USA",{"$f":"VLOOKUP(Data!$J171,tblCountries[[Actual]:[Mapping]],2,FALSE)","v":"Canada"},"4 to 6 hours a day",null,"USA"]
[null,"ID0204","2012-05-26T00:53:42",100000,100000,"USD",{"$f":"Data!$E172*VLOOKUP(Data!$F172,tblXrate[],2,FALSE)","v":8903.9583437212841},"Strategic Sourcing Manager","Manager","USA",{"$f":"VLOOKUP(Data!$J172,tblCountries[[Actual]:[Mapping]],2,FALSE)","v":"India"},"All the 8 hours baby, all the 8!",null,"USA"]
[null,"ID0205","2012-05-26T00:53:46","INR18Lacs or US$36000",1800000,"INR",{"$f":"Data!$E173*VLOOKUP(Data!$F173,tblXrate[],2,FALSE)","v":42556.81334581667},"Chief Manager","Manager","India",{"$f":"VLOOKUP(Data!$J173,tblCountries[[Actual]:[Mapping]],2,FALSE)","v":"UK"},"1 or 2 hours a day",null,"India"]
[null,"ID0207","2012-05-26T00:54:12","Â£30000",30000,"GBP",{"$f":"Data!$E174*VLOOKUP(Data!$F174,tblXrate[],2,FALSE)","v":68835.306612122877},"Business Intelligence Analyst","Analyst","UK",{"$f":"VLOOKUP(Data!$J174,tblCountries[[Actual]:[Mapping]],2,FALSE)","v":"Canada"},"2 to 3 hours per day",null,"UK"]
[null,"ID0209","2012-05-26T00:54:16",108160,108160,"USD",{"$f":"Data!$E175*VLOOKUP(Data!$F175,tblXrate[],2,FALSE)","v":78808.913603364199},"Sr. Financial Analyst","Analyst","USA",{"$f":"VLOOKUP(Data!$J175,tblCountries[[Actual]:[Mapping]],2,FALSE)","v":"UK"},"4 to 6 hours a day",null,"USA"]
[null,"ID0210","2012-05-26T00:54:27",50000,50000,"USD",{"$f":"Data!$E176*VLOOKUP(Data!$F176,tblXrate[],2,FALSE)","v":6410.8500074793246},"Buyer","Manager","USA",{"$f":"VLOOKUP(Data!$J176,tblCountries[[Actual]:[Mapping]],2,FALSE)","v":"India"},"4 to 6 hours a day",null,"USA"]
[null,"ID0211","2012-05-26T00:54:28",400000,400000,"USD",{"$f":"Data!$E177*VLOOKUP(Data!$F177,tblXrate[],2,FALSE)","v":45000},"program manager","Manager","USA",{"$f":"VLOOKUP(Data!$J177,tblCountries[[Actual]:[Mapping]],2,FALSE)","v":"USA"},"1 or 2 hours a day",null,"USA"]
[null,"ID0212","2012-05-26T00:54:41",43000,43000,"USD",{"$f":"Data!$E178*VLOOKUP(Data!$F178,tblXrate[],2,FALSE)","v":3205.4250037396623},"Reporting Analyst Team Lead","Analyst","USA",{"$f":"VLOOKUP(Data!$J178,tblCountries[[Actual]:[Mapping]],2,FALSE)","v":"India"},"All the 8 hours baby, all the 8!",null,"USA"]
[null,"ID0214","2012-05-26T00:54:56",41000,41000,"USD",{"$f":"Data!$E179*VLOOKUP(Data!$F179,tblXrate[],2,FALSE)","v":60000},"Operations Expert","Manager","USA",{"$f":"VLOOKUP(Data!$J179,tblCountries[[Actual]:[Mapping]],2,FALSE)","v":"USA"},"All the 8 hours baby, all the 8!",null,"USA"]
[null,"ID0215","2012-05-26T00:55:06",100000,100000,"USD",{"$f":"Data!$E180*VLOOKUP(Data!$F180,tblXrate[],2,FALSE)","v":60000},"Director of Finance","CXO or Top Mgmt.","USA",{"$f":"VLOOKUP(Data!$J180,tblCountries[[Actual]:[Mapping]],2,FALSE)","v":"USA"},"4 to 6 hours a day",null,"USA"]
[null,"ID0216","2012-05-26T00:55:50",42140,42140,"USD",{"$f":"Data!$E181*VLOOKUP(Data!$F181,tblXrate[],2,FALSE)","v":65000},"Information Analyst II","Analyst","USA",{"$f":"VLOOKUP(Data!$J181,tblCountries[[Actual]:[Mapping]],2,FALSE)","v":"USA"},"4 to 6 hours a day",null,"USA"]
[null,"ID0217","2012-05-26T00:56:06",80000,80000,"USD",{"$f":"Data!$E182*VLOOKUP(Data!$F182,tblXrate[],2,FALSE)","v":11000},"Marketing Analyst","Analyst","USA",{"$f":"VLOOKUP(Data!$J182,tblCountries[[Actual]:[Mapping]],2,FALSE)","v":"India"},"4 to 6 hours a day",null,"USA"]
[null,"ID0218","2012-05-26T00:56:37",41600,41600,"USD",{"$f":"Data!$E183*VLOOKUP(Data!$F183,tblXrate[],2,FALSE)","v":40000},"Project Manager","Manager","USA",{"$f":"VLOOKUP(Data!$J183,tblCountries[[Actual]:[Mapping]],2,FALSE)","v":"USA"},"4 to 6 hours a day",null,"USA"]
[null,"ID0219","2012-05-26T00:56:37","45k",45000,"USD",{"$f":"Data!$E184*VLOOKUP(Data!$F184,tblXrate[],2,FALSE)","v":80000},"Accounting Assistant","Accountant","USA",{"$f":"VLOOKUP(Data!$J184,tblCountries[[Actual]:[Mapping]],2,FALSE)","v":"USA"},"2 to 3 hours per day",null,"USA"]
[null,"ID0221","2012-05-26T00:57:21","INR 500000",500000,"INR",{"$f":"Data!$E185*VLOOKUP(Data!$F185,tblXrate[],2,FALSE)","v":20000},"Project Manager","Manager","India",{"$f":"VLOOKUP(Data!$J185,tblCountries[[Actual]:[Mapping]],2,FALSE)","v":"Canada"},"4 to 6 hours a day",null,"India"]
[null,"ID0222","2012-05-26T00:57:35","INR 350k",350000,"INR",{"$f":"Data!$E186*VLOOKUP(Data!$F186,tblXrate[],2,FALSE)","v":6410.8500074793246},"Jr. Executive Finance","Accountant","India",{"$f":"VLOOKUP(Data!$J186,tblCountries[[Actual]:[Mapping]],2,FALSE)","v":"India"},"4 to 6 hours a day",null,"India"]
[null,"ID0223","2012-05-26T00:57:44",72500,72500,"USD",{"$f":"Data!$E187*VLOOKUP(Data!$F187,tblXrate[],2,FALSE)","v":7123.1666749770275},"Assistant Controller","Controller","USA",{"$f":"VLOOKUP(Data!$J187,tblCountries[[Actual]:[Mapping]],2,FALSE)","v":"India"},"4 to 6 hours a day",null,"USA"]
[null,"ID0225","2012-05-26T00:58:03",480000,480000,"INR",{"$f":"Data!$E188*VLOOKUP(Data!$F188,tblXrate[],2,FALSE)","v":5000},"Cash Officer","Manager","India",{"$f":"VLOOKUP(Data!$J188,tblCountries[[Actual]:[Mapping]],2,FALSE)","v":"India"},"4 to 6 hours a day",null,"India"]
[null,"ID0226","2012-05-26T00:58:05",80000,80000,"USD",{"$f":"Data!$E189*VLOOKUP(Data!$F189,tblXrate[],2,FALSE)","v":7479.3250087258784},"Senior Analyst","Analyst","USA",{"$f":"VLOOKUP(Data!$J189,tblCountries[[Actual]:[Mapping]],2,FALSE)","v":"India"},"4 to 6 hours a day",null,"USA"]
[null,"ID0227","2012-05-26T00:58:06",50000,50000,"USD",{"$f":"Data!$E190*VLOOKUP(Data!$F190,tblXrate[],2,FALSE)","v":3000},"Project Manager","Manager","USA",{"$f":"VLOOKUP(Data!$J190,tblCountries[[Actual]:[Mapping]],2,FALSE)","v":"Cambodia"},"4 to 6 hours a day",null,"USA"]
[null,"ID0228","2012-05-26T00:58:10",45000,45000,"CAD",{"$f":"Data!$E191*VLOOKUP(Data!$F191,tblXrate[],2,FALSE)","v":15000},"Technical support specialist","Specialist","Canada",{"$f":"VLOOKUP(Data!$J191,tblCountries[[Actual]:[Mapping]],2,FALSE)","v":"Lithuania"},"1 or 2 hours a day",null,"Canada"]
[null,"ID0229","2012-05-26T00:58:22",43000,43000,"GBP",{"$f":"Data!$E192*VLOOKUP(Data!$F192,tblXrate[],2,FALSE)","v":9600},"ServiceDesk Supervisor","Manager","UK",{"$f":"VLOOKUP(Data!$J192,tblCountries[[Actual]:[Mapping]],2,FALSE)","v":"South Africa"},"2 to 3 hours per day",null,"UK"]
[null,"ID0230","2012-05-26T00:58:56",200000,200000,"INR",{"$f":"Data!$E193*VLOOKUP(Data!$F193,tblXrate[],2,FALSE)","v":4800},"medical biller","Analyst","India",{"$f":"VLOOKUP(Data!$J193,tblCountries[[Actual]:[Mapping]],2,FALSE)","v":"Bhutan"},"1 or 2 hours a day",null,"India"]
[null,"ID0231","2012-05-26T00:59:03",65000,65000,"USD",{"$f":"Data!$E194*VLOOKUP(Data!$F194,tblXrate[],2,FALSE)","v":14960},"Sr. Strategic Development Specialist","Specialist","USA",{"$f":"VLOOKUP(Data!$J194,tblCountries[[Actual]:[Mapping]],2,FALSE)","v":"Saudi Arabia"},"2 to 3 hours per day",null,"USA"]
[null,"ID0232","2012-05-26T00:59:09",114000,114000,"USD",{"$f":"Data!$E195*VLOOKUP(Data!$F195,tblXrate[],2,FALSE)","v":16337.518501630093},"Director","CXO or Top Mgmt.","USA",{"$f":"VLOOKUP(Data!$J195,tblCountries[[Actual]:[Mapping]],2,FALSE)","v":"South Africa"},"2 to 3 hours per day",null,"USA"]
[null,"ID0233","2012-05-26T00:59:27",95000,95000,"USD",{"$f":"Data!$E196*VLOOKUP(Data!$F196,tblXrate[],2,FALSE)","v":20000},"VP - Procurment","CXO or Top Mgmt.","USA",{"$f":"VLOOKUP(Data!$J196,tblCountries[[Actual]:[Mapping]],2,FALSE)","v":"Zambia"},"4 to 6 hours a day",null,"USA"]
[null,"ID0234","2012-05-26T01:00:51","52500.00 USD",52500,"USD",{"$f":"Data!$E197*VLOOKUP(Data!$F197,tblXrate[],2,FALSE)","v":15206.427249917633},"HRIS Analyst","Analyst","USA",{"$f":"VLOOKUP(Data!$J197,tblCountries[[Actual]:[Mapping]],2,FALSE)","v":"malaysia"},"4 to 6 hours a day",null,"USA"]
[null,"ID0235","2012-05-26T01:01:03",45000,45000,"GBP",{"$f":"Data!$E198*VLOOKUP(Data!$F198,tblXrate[],2,FALSE)","v":5120.2912876821438},"Procurement manager","Manager","UK",{"$f":"VLOOKUP(Data!$J198,tblCountries[[Actual]:[Mapping]],2,FALSE)","v":"Philippines"},"2 to 3 hours per day",null,"UK"]
[null,"ID0236","2012-05-26T01:01:32",60000,60000,"USD",{"$f":"Data!$E199*VLOOKUP(Data!$F199,tblXrate[],2,FALSE)","v":58799.349940520107},"Energy Analyst","Analyst","USA",{"$f":"VLOOKUP(Data!$J199,tblCountries[[Actual]:[Mapping]],2,FALSE)","v":"Dubai"},"4 to 6 hours a day",null,"USA"]
[null,"ID0237","2012-05-26T01:02:04",65250,65250,"USD",{"$f":"Data!$E200*VLOOKUP(Data!$F200,tblXrate[],2,FALSE)","v":5082.6943786459069},"Accountant","Accountant","USA",{"$f":"VLOOKUP(Data!$J200,tblCountries[[Actual]:[Mapping]],2,FALSE)","v":"Indonesia"},"4 to 6 hours a day",null,"USA"]
[null,"ID0238","2012-05-26T01:02:07",1200000,1200000,"INR",{"$f":"Data!$E201*VLOOKUP(Data!$F201,tblXrate[],2,FALSE)","v":7261.724659606657},"Branch head -sales","Manager","India",{"$f":"VLOOKUP(Data!$J201,tblCountries[[Actual]:[Mapping]],2,FALSE)","v":"Mongolia"},"2 to 3 hours per day",null,"India"]
[null,"ID0239","2012-05-26T01:02:10",100000,100000,"CAD",{"$f":"Data!$E202*VLOOKUP(Data!$F202,tblXrate[],2,FALSE)","v":11404.820437438224},"retail buyer","Manager","Canada",{"$f":"VLOOKUP(Data!$J202,tblCountries[[Actual]:[Mapping]],2,FALSE)","v":"malaysia"},"2 to 3 hours per day",null,"Canada"]
[null,"ID0241","2012-05-26T01:02:21",73000,73000,"USD",{"$f":"Data!$E203*VLOOKUP(Data!$F203,tblXrate[],2,FALSE)","v":3000},"Financial Analyst","Analyst","USA",{"$f":"VLOOKUP(Data!$J203,tblCountries[[Actual]:[Mapping]],2,FALSE)","v":"Sri Lanka"},"4 to 6 hours a day",null,"USA"]
[null,"ID0242","2012-05-26T01:02:47",50000,50000,"USD",{"$f":"Data!$E204*VLOOKUP(Data!$F204,tblXrate[],2,FALSE)","v":41000},"data analyst","Analyst","USA",{"$f":"VLOOKUP(Data!$J204,tblCountries[[Actual]:[Mapping]],2,FALSE)","v":"Japan"},"All the 8 hours baby, all the 8!",null,"USA"]
[null,"ID0243","2012-05-26T01:02:51",79000,79000,"USD",{"$f":"Data!$E205*VLOOKUP(Data!$F205,tblXrate[],2,FALSE)","v":32187.34988380854},"Director of Finance and Accounting","Accountant","USA",{"$f":"VLOOKUP(Data!$J205,tblCountries[[Actual]:[Mapping]],2,FALSE)","v":"South Africa"},"2 to 3 hours per day",null,"USA"]
[null,"ID0244","2012-05-26T01:03:07",90000,90000,"USD",{"$f":"Data!$E206*VLOOKUP(Data!$F206,tblXrate[],2,FALSE)","v":9509.8988293070688},"Manager Business Control","Manager","USA",{"$f":"VLOOKUP(Data!$J206,tblCountries[[Actual]:[Mapping]],2,FALSE)","v":"South Africa"},"4 to 6 hours a day",null,"USA"]
[null,"ID0245","2012-05-26T01:03:28",70000,70000,"USD",{"$f":"Data!$E207*VLOOKUP(Data!$F207,tblXrate[],2,FALSE)","v":9600},"Manager Pricing","Manager","USA",{"$f":"VLOOKUP(Data!$J207,tblCountries[[Actual]:[Mapping]],2,FALSE)","v":"Bolivia"},"2 to 3 hours per day",null,"USA"]
[null,"ID0246","2012-05-26T01:03:34",65000,65000,"CAD",{"$f":"Data!$E208*VLOOKUP(Data!$F208,tblXrate[],2,FALSE)","v":11000},"Insurance Manager","Manager","Canada",{"$f":"VLOOKUP(Data!$J208,tblCountries[[Actual]:[Mapping]],2,FALSE)","v":"Mexico"},"4 to 6 hours a day",null,"Canada"]
[null,"ID0247","2012-05-26T01:03:52",80000,80000,"USD",{"$f":"Data!$E209*VLOOKUP(Data!$F209,tblXrate[],2,FALSE)","v":33600},"Analyst","Analyst","USA",{"$f":"VLOOKUP(Data!$J209,tblCountries[[Actual]:[Mapping]],2,FALSE)","v":"Singapore"},"4 to 6 hours a day",null,"USA"]
[null,"ID0248","2012-05-26T01:03:54",140000,140000,"USD",{"$f":"Data!$E210*VLOOKUP(Data!$F210,tblXrate[],2,FALSE)","v":33600},"Manager","Manager","USA",{"$f":"VLOOKUP(Data!$J210,tblCountries[[Actual]:[Mapping]],2,FALSE)","v":"Singapore"},"4 to 6 hours a day",null,"USA"]
[null,"ID0250","2012-05-26T01:04:17",20000,20000,"USD",{"$f":"Data!$E211*VLOOKUP(Data!$F211,tblXrate[],2,FALSE)","v":10150.512511842264},"category manager","Manager","India",{"$f":"VLOOKUP(Data!$J211,tblCountries[[Actual]:[Mapping]],2,FALSE)","v":"India"},"4 to 6 hours a day",null,"India"]
[null,"ID0251","2012-05-26T01:04:50",47700,47700,"USD",{"$f":"Data!$E212*VLOOKUP(Data!$F212,tblXrate[],2,FALSE)","v":13500},"Customer Operations Analyst","Analyst","USA",{"$f":"VLOOKUP(Data!$J212,tblCountries[[Actual]:[Mapping]],2,FALSE)","v":"India"},"4 to 6 hours a day",null,"USA"]
[null,"ID0252","2012-05-26T01:05:14",25000,25000,"USD",{"$f":"Data!$E213*VLOOKUP(Data!$F213,tblXrate[],2,FALSE)","v":95871.50770184776},"Team Lead","Manager","India",{"$f":"VLOOKUP(Data!$J213,tblCountries[[Actual]:[Mapping]],2,FALSE)","v":"Australia"},"1 or 2 hours a day",null,"India"]
[null,"ID0253","2012-05-26T01:05:18",52500,52500,"USD",{"$f":"Data!$E214*VLOOKUP(Data!$F214,tblXrate[],2,FALSE)","v":6232.7708406048987},"Analyst","Analyst","USA",{"$f":"VLOOKUP(Data!$J214,tblCountries[[Actual]:[Mapping]],2,FALSE)","v":"India"},"4 to 6 hours a day",null,"USA"]
[null,"ID0254","2012-05-26T01:05:27",40000,40000,"USD",{"$f":"Data!$E215*VLOOKUP(Data!$F215,tblXrate[],2,FALSE)","v":4451.9791718606421},"Business Analyst","Analyst","USA",{"$f":"VLOOKUP(Data!$J215,tblCountries[[Actual]:[Mapping]],2,FALSE)","v":"India"},"All the 8 hours baby, all the 8!",null,"USA"]
[null,"ID0255","2012-05-26T01:06:02","$31,000 USD",31000,"USD",{"$f":"Data!$E216*VLOOKUP(Data!$F216,tblXrate[],2,FALSE)","v":7123.1666749770275},"Site Technician","Analyst","USA",{"$f":"VLOOKUP(Data!$J216,tblCountries[[Actual]:[Mapping]],2,FALSE)","v":"India"},"4 to 6 hours a day",null,"USA"]
[null,"ID0256","2012-05-26T01:06:12",4390,52680,"GBP",{"$f":"Data!$E217*VLOOKUP(Data!$F217,tblXrate[],2,FALSE)","v":5698.5333399816218},"Excel Consultant","Consultant","UK",{"$f":"VLOOKUP(Data!$J217,tblCountries[[Actual]:[Mapping]],2,FALSE)","v":"India"},"All the 8 hours baby, all the 8!",null,"UK"]
[null,"ID0257","2012-05-26T01:06:31",130000,130000,"USD",{"$f":"Data!$E218*VLOOKUP(Data!$F218,tblXrate[],2,FALSE)","v":68000},"Senior Project Manager","Manager","USA",{"$f":"VLOOKUP(Data!$J218,tblCountries[[Actual]:[Mapping]],2,FALSE)","v":"USA"},"4 to 6 hours a day",null,"USA"]
[null,"ID0258","2012-05-26T01:06:38","Rs 470000",470000,"INR",{"$f":"Data!$E219*VLOOKUP(Data!$F219,tblXrate[],2,FALSE)","v":45000},"Web Statistics Analyst","Analyst","India",{"$f":"VLOOKUP(Data!$J219,tblCountries[[Actual]:[Mapping]],2,FALSE)","v":"USA"},"All the 8 hours baby, all the 8!",null,"India"]
[null,"ID0259","2012-05-26T01:07:02",51000,51000,"USD",{"$f":"Data!$E220*VLOOKUP(Data!$F220,tblXrate[],2,FALSE)","v":70000},"Business Data Analyst I","Analyst","USA",{"$f":"VLOOKUP(Data!$J220,tblCountries[[Actual]:[Mapping]],2,FALSE)","v":"USA"},"2 to 3 hours per day",null,"USA"]
[null,"ID0260","2012-05-26T01:07:18","Â£60000",60000,"GBP",{"$f":"Data!$E221*VLOOKUP(Data!$F221,tblXrate[],2,FALSE)","v":65000},"Decision Analyst & Modeller","Analyst","UK",{"$f":"VLOOKUP(Data!$J221,tblCountries[[Actual]:[Mapping]],2,FALSE)","v":"USA"},"All the 8 hours baby, all the 8!",null,"UK"]
[null,"ID0261","2012-05-26T01:07:42",1920000,1920000,"INR",{"$f":"Data!$E222*VLOOKUP(Data!$F222,tblXrate[],2,FALSE)","v":7123.1666749770275},"Project Manager","Manager","India",{"$f":"VLOOKUP(Data!$J222,tblCountries[[Actual]:[Mapping]],2,FALSE)","v":"India"},"2 to 3 hours per day",null,"India"]
[null,"ID0262","2012-05-26T01:08:00",28000,28000,"GBP",{"$f":"Data!$E223*VLOOKUP(Data!$F223,tblXrate[],2,FALSE)","v":7479.3250087258784},"Ops Adminstrator","Analyst","UK",{"$f":"VLOOKUP(Data!$J223,tblCountries[[Actual]:[Mapping]],2,FALSE)","v":"India"},"All the 8 hours baby, all the 8!",null,"UK"]
[null,"ID0263","2012-05-26T01:08:04",73000,73000,"USD",{"$f":"Data!$E224*VLOOKUP(Data!$F224,tblXrate[],2,FALSE)","v":2849.2666699908109},"Sr. Global marketing Specialist","Specialist","USA",{"$f":"VLOOKUP(Data!$J224,tblCountries[[Actual]:[Mapping]],2,FALSE)","v":"India"},"4 to 6 hours a day",null,"USA"]
[null,"ID0264","2012-05-26T01:08:19",62400,62400,"USD",{"$f":"Data!$E225*VLOOKUP(Data!$F225,tblXrate[],2,FALSE)","v":39000},"financial accountant","Accountant","USA",{"$f":"VLOOKUP(Data!$J225,tblCountries[[Actual]:[Mapping]],2,FALSE)","v":"USA"},"All the 8 hours baby, all the 8!",null,"USA"]
[null,"ID0266","2012-05-26T01:08:35",54000,54000,"USD",{"$f":"Data!$E226*VLOOKUP(Data!$F226,tblXrate[],2,FALSE)","v":3561.5833374885137},"Anaylst","Manager","USA",{"$f":"VLOOKUP(Data!$J226,tblCountries[[Actual]:[Mapping]],2,FALSE)","v":"India"},"All the 8 hours baby, all the 8!",null,"USA"]
[null,"ID0267","2012-05-26T01:08:39","rs 2.76 lakhs per year",276000,"INR",{"$f":"Data!$E227*VLOOKUP(Data!$F227,tblXrate[],2,FALSE)","v":10684.750012465542},"analyst","Analyst","India",{"$f":"VLOOKUP(Data!$J227,tblCountries[[Actual]:[Mapping]],2,FALSE)","v":"India"},"All the 8 hours baby, all the 8!",null,"India"]
[null,"ID0268","2012-05-26T01:08:42","$77,000 USD",77000,"USD",{"$f":"Data!$E228*VLOOKUP(Data!$F228,tblXrate[],2,FALSE)","v":14246.333349954055},"senior accounting coordinator","Accountant","USA",{"$f":"VLOOKUP(Data!$J228,tblCountries[[Actual]:[Mapping]],2,FALSE)","v":"India"},"4 to 6 hours a day",null,"USA"]
[null,"ID0269","2012-05-26T01:09:01",76000,76000,"USD",{"$f":"Data!$E229*VLOOKUP(Data!$F229,tblXrate[],2,FALSE)","v":8547.8000099724322},"Demand Planning Mgr","Manager","USA",{"$f":"VLOOKUP(Data!$J229,tblCountries[[Actual]:[Mapping]],2,FALSE)","v":"India"},"All the 8 hours baby, all the 8!",null,"USA"]
[null,"ID0270","2012-05-26T01:09:32",103000,103000,"USD",{"$f":"Data!$E230*VLOOKUP(Data!$F230,tblXrate[],2,FALSE)","v":5400},"VP / Credit Administrator","CXO or Top Mgmt.","USA",{"$f":"VLOOKUP(Data!$J230,tblCountries[[Actual]:[Mapping]],2,FALSE)","v":"India"},"2 to 3 hours per day",null,"USA"]
[null,"ID0272","2012-05-26T01:09:56",40000,40000,"USD",{"$f":"Data!$E231*VLOOKUP(Data!$F231,tblXrate[],2,FALSE)","v":16917.52085307044},"Analyst 2","Analyst","USA",{"$f":"VLOOKUP(Data!$J231,tblCountries[[Actual]:[Mapping]],2,FALSE)","v":"India"},"4 to 6 hours a day",null,"USA"]
[null,"ID0273","2012-05-26T01:10:20",80000,80000,"USD",{"$f":"Data!$E232*VLOOKUP(Data!$F232,tblXrate[],2,FALSE)","v":3561.5833374885137},"VP","CXO or Top Mgmt.","USA",{"$f":"VLOOKUP(Data!$J232,tblCountries[[Actual]:[Mapping]],2,FALSE)","v":"India"},"2 to 3 hours per day",null,"USA"]
[null,"ID0274","2012-05-26T01:10:24",55000,55000,"USD",{"$f":"Data!$E233*VLOOKUP(Data!$F233,tblXrate[],2,FALSE)","v":4095.8208381117906},"data analyst","Analyst","USA",{"$f":"VLOOKUP(Data!$J233,tblCountries[[Actual]:[Mapping]],2,FALSE)","v":"India"},"All the 8 hours baby, all the 8!",null,"USA"]
[null,"ID0275","2012-05-26T01:10:55",99000,99000,"USD",{"$f":"Data!$E234*VLOOKUP(Data!$F234,tblXrate[],2,FALSE)","v":4914.9850057341491},"Business Analyst","Analyst","USA",{"$f":"VLOOKUP(Data!$J234,tblCountries[[Actual]:[Mapping]],2,FALSE)","v":"Pakistan"},"2 to 3 hours per day",null,"USA"]
[null,"ID0277","2012-05-26T01:11:12",75000,75000,"USD",{"$f":"Data!$E235*VLOOKUP(Data!$F235,tblXrate[],2,FALSE)","v":3917.7416712373652},"financial analyst","Analyst","USA",{"$f":"VLOOKUP(Data!$J235,tblCountries[[Actual]:[Mapping]],2,FALSE)","v":"India"},"4 to 6 hours a day",null,"USA"]
[null,"ID0278","2012-05-26T01:11:54",80000,80000,"USD",{"$f":"Data!$E236*VLOOKUP(Data!$F236,tblXrate[],2,FALSE)","v":2136.9500024931081},"Enterprise Performance Metrics Manager","Manager","USA",{"$f":"VLOOKUP(Data!$J236,tblCountries[[Actual]:[Mapping]],2,FALSE)","v":"India"},"2 to 3 hours per day",null,"USA"]
[null,"ID0279","2012-05-26T01:12:41",20000,20000,"USD",{"$f":"Data!$E237*VLOOKUP(Data!$F237,tblXrate[],2,FALSE)","v":5342.3750062327708},"Analyst","Analyst","India",{"$f":"VLOOKUP(Data!$J237,tblCountries[[Actual]:[Mapping]],2,FALSE)","v":"India"},"All the 8 hours baby, all the 8!",null,"India"]
[null,"ID0280","2012-05-26T01:13:50",40000,40000,"USD",{"$f":"Data!$E238*VLOOKUP(Data!$F238,tblXrate[],2,FALSE)","v":130000},"Business Analyst","Analyst","USA",{"$f":"VLOOKUP(Data!$J238,tblCountries[[Actual]:[Mapping]],2,FALSE)","v":"Australia"},"All the 8 hours baby, all the 8!",null,"USA"]
[null,"ID0281","2012-05-26T01:14:27",46000,46000,"USD",{"$f":"Data!$E239*VLOOKUP(Data!$F239,tblXrate[],2,FALSE)","v":4273.9000049862161},"University Relations Intern","Analyst","USA",{"$f":"VLOOKUP(Data!$J239,tblCountries[[Actual]:[Mapping]],2,FALSE)","v":"India"},"All the 8 hours baby, all the 8!",null,"USA"]
[null,"ID0283","2012-05-26T01:15:05",70000,70000,"USD",{"$f":"Data!$E240*VLOOKUP(Data!$F240,tblXrate[],2,FALSE)","v":8975.1900104710548},"Engineering Tech Sr.","Engineer","USA",{"$f":"VLOOKUP(Data!$J240,tblCountries[[Actual]:[Mapping]],2,FALSE)","v":"India"},"All the 8 hours baby, all the 8!",null,"USA"]
[null,"ID0285","2012-05-26T01:15:25",15000,15000,"USD",{"$f":"Data!$E241*VLOOKUP(Data!$F241,tblXrate[],2,FALSE)","v":15500},"moneymaker","Manager","USA",{"$f":"VLOOKUP(Data!$J241,tblCountries[[Actual]:[Mapping]],2,FALSE)","v":"India"},"2 to 3 hours per day",null,"USA"]
[null,"ID0286","2012-05-26T01:16:18","INR 15,00,000",1500000,"INR",{"$f":"Data!$E242*VLOOKUP(Data!$F242,tblXrate[],2,FALSE)","v":12821.700014958649},"Consultant","Consultant","India",{"$f":"VLOOKUP(Data!$J242,tblCountries[[Actual]:[Mapping]],2,FALSE)","v":"India"},"All the 8 hours baby, all the 8!",null,"India"]
[null,"ID0288","2012-05-26T01:17:50",22000,22000,"USD",{"$f":"Data!$E243*VLOOKUP(Data!$F243,tblXrate[],2,FALSE)","v":8903.9583437212841},"MIS","Reporting","India",{"$f":"VLOOKUP(Data!$J243,tblCountries[[Actual]:[Mapping]],2,FALSE)","v":"India"},"All the 8 hours baby, all the 8!",null,"India"]
[null,"ID0289","2012-05-26T01:17:56",68000,68000,"USD",{"$f":"Data!$E244*VLOOKUP(Data!$F244,tblXrate[],2,FALSE)","v":15136.729184326183},"management accountant","Manager","USA",{"$f":"VLOOKUP(Data!$J244,tblCountries[[Actual]:[Mapping]],2,FALSE)","v":"India"},"All the 8 hours baby, all the 8!",null,"USA"]
[null,"ID0290","2012-05-26T01:17:57",97000,97000,"USD",{"$f":"Data!$E245*VLOOKUP(Data!$F245,tblXrate[],2,FALSE)","v":23150.291693675339},"business analyst","Analyst","USA",{"$f":"VLOOKUP(Data!$J245,tblCountries[[Actual]:[Mapping]],2,FALSE)","v":"India"},"All the 8 hours baby, all the 8!",null,"USA"]
[null,"ID0291","2012-05-26T01:18:35","Â£31000",31000,"GBP",{"$f":"Data!$E246*VLOOKUP(Data!$F246,tblXrate[],2,FALSE)","v":12465.541681209797},"Telecoms Engineer","Engineer","UK",{"$f":"VLOOKUP(Data!$J246,tblCountries[[Actual]:[Mapping]],2,FALSE)","v":"India"},"2 to 3 hours per day",null,"UK"]
[null,"ID0292","2012-05-26T01:18:49",65000,65000,"USD",{"$f":"Data!$E247*VLOOKUP(Data!$F247,tblXrate[],2,FALSE)","v":24000},"Software Support","Analyst","USA",{"$f":"VLOOKUP(Data!$J247,tblCountries[[Actual]:[Mapping]],2,FALSE)","v":"India"},"4 to 6 hours a day",null,"USA"]
[null,"ID0294","2012-05-26T01:19:09","4.5 lakh INR",450000,"INR",{"$f":"Data!$E248*VLOOKUP(Data!$F248,tblXrate[],2,FALSE)","v":60000},"Business Analyst","Analyst","India",{"$f":"VLOOKUP(Data!$J248,tblCountries[[Actual]:[Mapping]],2,FALSE)","v":"USA"},"4 to 6 hours a day",null,"India"]
[null,"ID0295","2012-05-26T01:19:09",50000,50000,"USD",{"$f":"Data!$E249*VLOOKUP(Data!$F249,tblXrate[],2,FALSE)","v":63234.398696963413},"Mathematical Data Analyist","Analyst","USA",{"$f":"VLOOKUP(Data!$J249,tblCountries[[Actual]:[Mapping]],2,FALSE)","v":"Australia"},"All the 8 hours baby, all the 8!",null,"USA"]
[null,"ID0296","2012-05-26T01:19:22",45000,45000,"USD",{"$f":"Data!$E250*VLOOKUP(Data!$F250,tblXrate[],2,FALSE)","v":45000},"sales support","Analyst","USA",{"$f":"VLOOKUP(Data!$J250,tblCountries[[Actual]:[Mapping]],2,FALSE)","v":"USA"},"4 to 6 hours a day",null,"USA"]
[null,"ID0297","2012-05-26T01:19:37","Rs.1.8 lakhs ",180000,"INR",{"$f":"Data!$E251*VLOOKUP(Data!$F251,tblXrate[],2,FALSE)","v":6499.8895909165376},"Administrative Officer","Manager","India",{"$f":"VLOOKUP(Data!$J251,tblCountries[[Actual]:[Mapping]],2,FALSE)","v":"India"},"4 to 6 hours a day",null,"India"]
[null,"ID0298","2012-05-26T01:20:01",60000,60000,"USD",{"$f":"Data!$E252*VLOOKUP(Data!$F252,tblXrate[],2,FALSE)","v":28000},"IS Manager","Manager","USA",{"$f":"VLOOKUP(Data!$J252,tblCountries[[Actual]:[Mapping]],2,FALSE)","v":"India"},"All the 8 hours baby, all the 8!",null,"USA"]
[null,"ID0299","2012-05-26T01:20:46",31000,31000,"USD",{"$f":"Data!$E253*VLOOKUP(Data!$F253,tblXrate[],2,FALSE)","v":3561.5833374885137},"Support Specialist ","Specialist","USA",{"$f":"VLOOKUP(Data!$J253,tblCountries[[Actual]:[Mapping]],2,FALSE)","v":"India"},"2 to 3 hours per day",null,"USA"]
[null,"ID0300","2012-05-26T01:21:06",75000,75000,"USD",{"$f":"Data!$E254*VLOOKUP(Data!$F254,tblXrate[],2,FALSE)","v":4273.9000049862161},"FA","Analyst","USA",{"$f":"VLOOKUP(Data!$J254,tblCountries[[Actual]:[Mapping]],2,FALSE)","v":"India"},"4 to 6 hours a day",null,"USA"]
[null,"ID0301","2012-05-26T01:22:09",16000,16000,"USD",{"$f":"Data!$E255*VLOOKUP(Data!$F255,tblXrate[],2,FALSE)","v":4451.9791718606421},"VP of Finance","CXO or Top Mgmt.","USA",{"$f":"VLOOKUP(Data!$J255,tblCountries[[Actual]:[Mapping]],2,FALSE)","v":"India"},"1 or 2 hours a day",null,"USA"]
[null,"ID0302","2012-05-26T01:22:22","36,000 USD",36000,"USD",{"$f":"Data!$E256*VLOOKUP(Data!$F256,tblXrate[],2,FALSE)","v":50815.977559664309},"PRODUCTION ASSISTANT","Analyst","USA",{"$f":"VLOOKUP(Data!$J256,tblCountries[[Actual]:[Mapping]],2,FALSE)","v":"Netherlands"},"All the 8 hours baby, all the 8!",null,"USA"]
[null,"ID0303","2012-05-26T01:22:40",42000,42000,"CAD",{"$f":"Data!$E257*VLOOKUP(Data!$F257,tblXrate[],2,FALSE)","v":69213.140283018583},"Financial Analyst","Analyst","Canada",{"$f":"VLOOKUP(Data!$J257,tblCountries[[Actual]:[Mapping]],2,FALSE)","v":"UK"},"All the 8 hours baby, all the 8!",null,"Canada"]
[null,"ID0304","2012-05-26T01:22:45",53000,53000,"USD",{"$f":"Data!$E258*VLOOKUP(Data!$F258,tblXrate[],2,FALSE)","v":3205.4250037396623},"Data Analyst","Analyst","USA",{"$f":"VLOOKUP(Data!$J258,tblCountries[[Actual]:[Mapping]],2,FALSE)","v":"India"},"4 to 6 hours a day",null,"USA"]
[null,"ID0306","2012-05-26T01:22:56",67000,67000,"USD",{"$f":"Data!$E259*VLOOKUP(Data!$F259,tblXrate[],2,FALSE)","v":39404.456801682099},"HR Analyst","Analyst","USA",{"$f":"VLOOKUP(Data!$J259,tblCountries[[Actual]:[Mapping]],2,FALSE)","v":"UK"},"4 to 6 hours a day",null,"USA"]
[null,"ID0307","2012-05-26T01:23:21",12000,12000,"USD",{"$f":"Data!$E260*VLOOKUP(Data!$F260,tblXrate[],2,FALSE)","v":8903.9583437212841},"Analyst","Analyst","India",{"$f":"VLOOKUP(Data!$J260,tblCountries[[Actual]:[Mapping]],2,FALSE)","v":"India"},"All the 8 hours baby, all the 8!",null,"India"]
[null,"ID0308","2012-05-26T01:23:43",85000,85000,"USD",{"$f":"Data!$E261*VLOOKUP(Data!$F261,tblXrate[],2,FALSE)","v":13355.937515581925},"Plant Controller","Controller","USA",{"$f":"VLOOKUP(Data!$J261,tblCountries[[Actual]:[Mapping]],2,FALSE)","v":"India"},"All the 8 hours baby, all the 8!",null,"USA"]
[null,"ID0309","2012-05-26T01:23:50",200000,200000,"EUR",{"$f":"Data!$E262*VLOOKUP(Data!$F262,tblXrate[],2,FALSE)","v":30000},"consultant bi","Reporting","The netherlands",{"$f":"VLOOKUP(Data!$J262,tblCountries[[Actual]:[Mapping]],2,FALSE)","v":"India"},"All the 8 hours baby, all the 8!",null,"Netherlands"]
[null,"ID0310","2012-05-26T01:23:57",40000,40000,"USD",{"$f":"Data!$E263*VLOOKUP(Data!$F263,tblXrate[],2,FALSE)","v":50000},"Royalties Coordinator","Manager","USA",{"$f":"VLOOKUP(Data!$J263,tblCountries[[Actual]:[Mapping]],2,FALSE)","v":"USA"},"4 to 6 hours a day",null,"USA"]
[null,"ID0311","2012-05-26T01:24:03","Â£20000/year but i work part time 30h/week",20000,"GBP",{"$f":"Data!$E264*VLOOKUP(Data!$F264,tblXrate[],2,FALSE)","v":7123.1666749770275},"Graduate Structural Engineer","Engineer","UK",{"$f":"VLOOKUP(Data!$J264,tblCountries[[Actual]:[Mapping]],2,FALSE)","v":"India"},"1 or 2 hours a day",null,"UK"]
[null,"ID0312","2012-05-26T01:25:05",41000,41000,"USD",{"$f":"Data!$E265*VLOOKUP(Data!$F265,tblXrate[],2,FALSE)","v":3561.5833374885137},"Operations Analyst","Analyst","USA",{"$f":"VLOOKUP(Data!$J265,tblCountries[[Actual]:[Mapping]],2,FALSE)","v":"India"},"4 to 6 hours a day",null,"USA"]
[null,"ID0313","2012-05-26T01:25:06",1400000,1400000,"INR",{"$f":"Data!$E266*VLOOKUP(Data!$F266,tblXrate[],2,FALSE)","v":5342.3750062327708},"Marketing","Manager","India",{"$f":"VLOOKUP(Data!$J266,tblCountries[[Actual]:[Mapping]],2,FALSE)","v":"India"},"1 or 2 hours a day",null,"India"]
[null,"ID0314","2012-05-26T01:25:30",125000,125000,"USD",{"$f":"Data!$E267*VLOOKUP(Data!$F267,tblXrate[],2,FALSE)","v":33000},"Finance, Manager ","Manager","USA",{"$f":"VLOOKUP(Data!$J267,tblCountries[[Actual]:[Mapping]],2,FALSE)","v":"USA"},"4 to 6 hours a day",null,"USA"]
[null,"ID0315","2012-05-26T01:26:26",60000,60000,"CAD",{"$f":"Data!$E268*VLOOKUP(Data!$F268,tblXrate[],2,FALSE)","v":14000},"Sr. Business Analyst","Analyst","Canada",{"$f":"VLOOKUP(Data!$J268,tblCountries[[Actual]:[Mapping]],2,FALSE)","v":"India"},"All the 8 hours baby, all the 8!",null,"Canada"]
[null,"ID0317","2012-05-26T01:26:52",70000,70000,"USD",{"$f":"Data!$E269*VLOOKUP(Data!$F269,tblXrate[],2,FALSE)","v":12821.700014958649},"Analyst","Analyst","USA",{"$f":"VLOOKUP(Data!$J269,tblCountries[[Actual]:[Mapping]],2,FALSE)","v":"India"},"2 to 3 hours per day",null,"USA"]
[null,"ID0318","2012-05-26T01:27:03",400000,400000,"USD",{"$f":"Data!$E270*VLOOKUP(Data!$F270,tblXrate[],2,FALSE)","v":74300},"Financial Specialist","Specialist","USA",{"$f":"VLOOKUP(Data!$J270,tblCountries[[Actual]:[Mapping]],2,FALSE)","v":"USA"},"All the 8 hours baby, all the 8!",null,"USA"]
[null,"ID0319","2012-05-26T01:27:26",55,55000,"USD",{"$f":"Data!$E271*VLOOKUP(Data!$F271,tblXrate[],2,FALSE)","v":22000},"Business Analyst","Analyst","USA",{"$f":"VLOOKUP(Data!$J271,tblCountries[[Actual]:[Mapping]],2,FALSE)","v":"USA"},"4 to 6 hours a day",null,"USA"]
[null,"ID0320","2012-05-26T01:27:29",60000,60000,"USD",{"$f":"Data!$E272*VLOOKUP(Data!$F272,tblXrate[],2,FALSE)","v":49168.076151516347},"Management Analyst","Analyst","USA",{"$f":"VLOOKUP(Data!$J272,tblCountries[[Actual]:[Mapping]],2,FALSE)","v":"Canada"},"4 to 6 hours a day",null,"USA"]
[null,"ID0321","2012-05-26T01:27:44","INR 1000000",1000000,"INR",{"$f":"Data!$E273*VLOOKUP(Data!$F273,tblXrate[],2,FALSE)","v":3561.5833374885137},"Manager","Manager","India",{"$f":"VLOOKUP(Data!$J273,tblCountries[[Actual]:[Mapping]],2,FALSE)","v":"India"},"4 to 6 hours a day",null,"India"]
[null,"ID0323","2012-05-26T01:28:37",137500,137500,"USD",{"$f":"Data!$E274*VLOOKUP(Data!$F274,tblXrate[],2,FALSE)","v":55166.239522354947},"director of analytics","Analyst","USA",{"$f":"VLOOKUP(Data!$J274,tblCountries[[Actual]:[Mapping]],2,FALSE)","v":"UK"},"4 to 6 hours a day",null,"USA"]
[null,"ID0325","2012-05-26T01:29:37","Â£29000",29000,"GBP",{"$f":"Data!$E275*VLOOKUP(Data!$F275,tblXrate[],2,FALSE)","v":31523.565441345683},"ICT Technical Analyst","Analyst","UK",{"$f":"VLOOKUP(Data!$J275,tblCountries[[Actual]:[Mapping]],2,FALSE)","v":"UK"},"4 to 6 hours a day",null,"UK"]
[null,"ID0326","2012-05-26T01:30:12",47000,47000,"USD",{"$f":"Data!$E276*VLOOKUP(Data!$F276,tblXrate[],2,FALSE)","v":12000},"Sourcing Specialist","Specialist","USA",{"$f":"VLOOKUP(Data!$J276,tblCountries[[Actual]:[Mapping]],2,FALSE)","v":"India"},"4 to 6 hours a day",null,"USA"]
[null,"ID0327","2012-05-26T01:30:39",65000,65000,"USD",{"$f":"Data!$E277*VLOOKUP(Data!$F277,tblXrate[],2,FALSE)","v":3360},"business analyst","Analyst","USA",{"$f":"VLOOKUP(Data!$J277,tblCountries[[Actual]:[Mapping]],2,FALSE)","v":"India"},"All the 8 hours baby, all the 8!",null,"USA"]
[null,"ID0329","2012-05-26T01:31:26",92000,92000,"USD",{"$f":"Data!$E278*VLOOKUP(Data!$F278,tblXrate[],2,FALSE)","v":49000},"Sales Analytics Manager","Manager","USA",{"$f":"VLOOKUP(Data!$J278,tblCountries[[Actual]:[Mapping]],2,FALSE)","v":"USA"},"4 to 6 hours a day",null,"USA"]
[null,"ID0331","2012-05-26T01:31:58",108000,108000,"USD",{"$f":"Data!$E279*VLOOKUP(Data!$F279,tblXrate[],2,FALSE)","v":59000},"Database Architect","Manager","USA",{"$f":"VLOOKUP(Data!$J279,tblCountries[[Actual]:[Mapping]],2,FALSE)","v":"USA"},"2 to 3 hours per day",null,"USA"]
[null,"ID0332","2012-05-26T01:32:08",61000,61000,"USD",{"$f":"Data!$E280*VLOOKUP(Data!$F280,tblXrate[],2,FALSE)","v":75000},"Data Analyst","Analyst","USA",{"$f":"VLOOKUP(Data!$J280,tblCountries[[Actual]:[Mapping]],2,FALSE)","v":"USA"},"1 or 2 hours a day",null,"USA"]
[null,"ID0333","2012-05-26T01:32:14","CAD 65000",65000,"CAD",{"$f":"Data!$E281*VLOOKUP(Data!$F281,tblXrate[],2,FALSE)","v":2671.1875031163854},"Product developer","Manager","CANADA",{"$f":"VLOOKUP(Data!$J281,tblCountries[[Actual]:[Mapping]],2,FALSE)","v":"India"},"2 to 3 hours per day",null,"Canada"]
[null,"ID0334","2012-05-26T01:32:26",50000,50000,"USD",{"$f":"Data!$E282*VLOOKUP(Data!$F282,tblXrate[],2,FALSE)","v":61194.579384158147},"Supply Chain Analyst","Analyst","USA",{"$f":"VLOOKUP(Data!$J282,tblCountries[[Actual]:[Mapping]],2,FALSE)","v":"Australia"},"All the 8 hours baby, all the 8!",null,"USA"]
[null,"ID0335","2012-05-26T01:33:03",150000,150000,"USD",{"$f":"Data!$E283*VLOOKUP(Data!$F283,tblXrate[],2,FALSE)","v":21903.737525554359},"financial planning","Accountant","USA",{"$f":"VLOOKUP(Data!$J283,tblCountries[[Actual]:[Mapping]],2,FALSE)","v":"India"},"All the 8 hours baby, all the 8!",null,"USA"]
[null,"ID0336","2012-05-26T01:33:37","400000 INR",400000,"INR",{"$f":"Data!$E284*VLOOKUP(Data!$F284,tblXrate[],2,FALSE)","v":20122.945856810104},"Test Analyst","Analyst","India",{"$f":"VLOOKUP(Data!$J284,tblCountries[[Actual]:[Mapping]],2,FALSE)","v":"India"},"4 to 6 hours a day",null,"India"]
[null,"ID0338","2012-05-26T01:34:56",45000,45000,"USD",{"$f":"Data!$E285*VLOOKUP(Data!$F285,tblXrate[],2,FALSE)","v":52500},"QC Fabrication Inspector","Specialist","USA",{"$f":"VLOOKUP(Data!$J285,tblCountries[[Actual]:[Mapping]],2,FALSE)","v":"USA"},"4 to 6 hours a day",null,"USA"]
[null,"ID0339","2012-05-26T01:35:02",135000,135000,"USD",{"$f":"Data!$E286*VLOOKUP(Data!$F286,tblXrate[],2,FALSE)","v":42556.81334581667},"Manager of Trade Investment & Analysis","Manager","USA",{"$f":"VLOOKUP(Data!$J286,tblCountries[[Actual]:[Mapping]],2,FALSE)","v":"UK"},"All the 8 hours baby, all the 8!",null,"USA"]
[null,"ID0340","2012-05-26T01:35:18","30000 Rs",360000,"INR",{"$f":"Data!$E287*VLOOKUP(Data!$F287,tblXrate[],2,FALSE)","v":42556.81334581667},"Business Analysit","Analyst","India",{"$f":"VLOOKUP(Data!$J287,tblCountries[[Actual]:[Mapping]],2,FALSE)","v":"UK"},"2 to 3 hours per day",null,"India"]
[null,"ID0341","2012-05-26T01:35:35",29000,29000,"USD",{"$f":"Data!$E288*VLOOKUP(Data!$F288,tblXrate[],2,FALSE)","v":2400},"Assistant Outside Plant Project Manager","Manager","USA",{"$f":"VLOOKUP(Data!$J288,tblCountries[[Actual]:[Mapping]],2,FALSE)","v":"India"},"4 to 6 hours a day",null,"USA"]
[null,"ID0342","2012-05-26T01:37:33",13000,13000,"USD",{"$f":"Data!$E289*VLOOKUP(Data!$F289,tblXrate[],2,FALSE)","v":7123.1666749770275},"operation-manager","Manager","India",{"$f":"VLOOKUP(Data!$J289,tblCountries[[Actual]:[Mapping]],2,FALSE)","v":"India"},"All the 8 hours baby, all the 8!",null,"India"]
[null,"ID0343","2012-05-26T01:38:06","63000 USD",63000,"USD",{"$f":"Data!$E290*VLOOKUP(Data!$F290,tblXrate[],2,FALSE)","v":87000},"Sales Analyst","Analyst","USA",{"$f":"VLOOKUP(Data!$J290,tblCountries[[Actual]:[Mapping]],2,FALSE)","v":"USA"},"All the 8 hours baby, all the 8!",null,"USA"]
[null,"ID0344","2012-05-26T01:38:06",95000,95000,"USD",{"$f":"Data!$E291*VLOOKUP(Data!$F291,tblXrate[],2,FALSE)","v":85000},"Senior Financial Analyst","Analyst","USA",{"$f":"VLOOKUP(Data!$J291,tblCountries[[Actual]:[Mapping]],2,FALSE)","v":"USA"},"4 to 6 hours a day",null,"USA"]
[null,"ID0346","2012-05-26T01:38:51","100,000 US$ equiv",100000,"USD",{"$f":"Data!$E292*VLOOKUP(Data!$F292,tblXrate[],2,FALSE)","v":4800},"Senior Data Analyst","Analyst","UK",{"$f":"VLOOKUP(Data!$J292,tblCountries[[Actual]:[Mapping]],2,FALSE)","v":"India"},"4 to 6 hours a day",null,"UK"]
[null,"ID0347","2012-05-26T01:39:37","3.8 k",3800,"USD",{"$f":"Data!$E293*VLOOKUP(Data!$F293,tblXrate[],2,FALSE)","v":60000},"MIS EXCUTIVE","Reporting","India",{"$f":"VLOOKUP(Data!$J293,tblCountries[[Actual]:[Mapping]],2,FALSE)","v":"USA"},"4 to 6 hours a day",null,"India"]
[null,"ID0349","2012-05-26T01:40:18",56000,56000,"CAD",{"$f":"Data!$E294*VLOOKUP(Data!$F294,tblXrate[],2,FALSE)","v":64254.308353366054},"Online Analyst","Analyst","Canada",{"$f":"VLOOKUP(Data!$J294,tblCountries[[Actual]:[Mapping]],2,FALSE)","v":"Australia"},"4 to 6 hours a day",null,"Canada"]
[null,"ID0350","2012-05-26T01:40:28",53000,53000,"USD",{"$f":"Data!$E295*VLOOKUP(Data!$F295,tblXrate[],2,FALSE)","v":77819.106783521114},"General Manager","Manager","USA",{"$f":"VLOOKUP(Data!$J295,tblCountries[[Actual]:[Mapping]],2,FALSE)","v":"Australia"},"2 to 3 hours per day",null,"USA"]
[null,"ID0351","2012-05-26T01:40:51",130000,130000,"USD",{"$f":"Data!$E296*VLOOKUP(Data!$F296,tblXrate[],2,FALSE)","v":4451.9791718606421},"Sr Staff Engineer","Engineer","USA",{"$f":"VLOOKUP(Data!$J296,tblCountries[[Actual]:[Mapping]],2,FALSE)","v":"India"},"4 to 6 hours a day",null,"USA"]
[null,"ID0352","2012-05-26T01:41:32","3,70,000",370000,"INR",{"$f":"Data!$E297*VLOOKUP(Data!$F297,tblXrate[],2,FALSE)","v":39404.456801682099},"Senior Design Associate","Analyst","India",{"$f":"VLOOKUP(Data!$J297,tblCountries[[Actual]:[Mapping]],2,FALSE)","v":"UK"},"All the 8 hours baby, all the 8!",null,"India"]
[null,"ID0353","2012-05-26T01:41:53",160000,160000,"CAD",{"$f":"Data!$E298*VLOOKUP(Data!$F298,tblXrate[],2,FALSE)","v":5000},"Consultant","Consultant","Canada",{"$f":"VLOOKUP(Data!$J298,tblCountries[[Actual]:[Mapping]],2,FALSE)","v":"India"},"2 to 3 hours per day",null,"Canada"]
[null,"ID0354","2012-05-26T01:41:54",44200,44200,"USD",{"$f":"Data!$E299*VLOOKUP(Data!$F299,tblXrate[],2,FALSE)","v":75000},"Planning and Analysis Supervisor","Analyst","USA",{"$f":"VLOOKUP(Data!$J299,tblCountries[[Actual]:[Mapping]],2,FALSE)","v":"USA"},"All the 8 hours baby, all the 8!",null,"USA"]
[null,"ID0355","2012-05-26T01:42:07",56000,56000,"USD",{"$f":"Data!$E300*VLOOKUP(Data!$F300,tblXrate[],2,FALSE)","v":3205.4250037396623},"asset manager","Manager","USA",{"$f":"VLOOKUP(Data!$J300,tblCountries[[Actual]:[Mapping]],2,FALSE)","v":"India"},"2 to 3 hours per day",null,"USA"]
[null,"ID0356","2012-05-26T01:42:27",72500,72500,"USD",{"$f":"Data!$E301*VLOOKUP(Data!$F301,tblXrate[],2,FALSE)","v":40000},"Transportation Engineer","Engineer","USA",{"$f":"VLOOKUP(Data!$J301,tblCountries[[Actual]:[Mapping]],2,FALSE)","v":"USA"},"2 to 3 hours per day",null,"USA"]
[null,"ID0357","2012-05-26T01:42:31",75000,75000,"CAD",{"$f":"Data!$E302*VLOOKUP(Data!$F302,tblXrate[],2,FALSE)","v":48000},"web marketing analyst","Analyst","canada",{"$f":"VLOOKUP(Data!$J302,tblCountries[[Actual]:[Mapping]],2,FALSE)","v":"Singapore"},"4 to 6 hours a day",null,"Canada"]
[null,"ID0358","2012-05-26T01:42:53","170000 usd",170000,"USD",{"$f":"Data!$E303*VLOOKUP(Data!$F303,tblXrate[],2,FALSE)","v":148284.35006969364},"RS","Analyst","UK",{"$f":"VLOOKUP(Data!$J303,tblCountries[[Actual]:[Mapping]],2,FALSE)","v":"Brazil"},"Excel ?!? What Excel?",null,"UK"]
[null,"ID0359","2012-05-26T01:43:48",68000,68000,"USD",{"$f":"Data!$E304*VLOOKUP(Data!$F304,tblXrate[],2,FALSE)","v":25560},"Project Manager","Manager","USA",{"$f":"VLOOKUP(Data!$J304,tblCountries[[Actual]:[Mapping]],2,FALSE)","v":"Saudi Arabia"},"2 to 3 hours per day",null,"USA"]
[null,"ID0360","2012-05-26T01:44:59",75000,75000,"USD",{"$f":"Data!$E305*VLOOKUP(Data!$F305,tblXrate[],2,FALSE)","v":80289.244544269619},"Sr. Financial Analyst","Analyst","USA",{"$f":"VLOOKUP(Data!$J305,tblCountries[[Actual]:[Mapping]],2,FALSE)","v":"France"},"All the 8 hours baby, all the 8!",null,"USA"]
[null,"ID0361","2012-05-26T01:45:50","62500.00 USD",62500,"USD",{"$f":"Data!$E306*VLOOKUP(Data!$F306,tblXrate[],2,FALSE)","v":53356.776437647524},"Director of Payroll","CXO or Top Mgmt.","USA",{"$f":"VLOOKUP(Data!$J306,tblCountries[[Actual]:[Mapping]],2,FALSE)","v":"Germany"},"All the 8 hours baby, all the 8!",null,"USA"]
[null,"ID0362","2012-05-26T01:45:58",25000,25000,"USD",{"$f":"Data!$E307*VLOOKUP(Data!$F307,tblXrate[],2,FALSE)","v":36000},"Manager","Manager","India",{"$f":"VLOOKUP(Data!$J307,tblCountries[[Actual]:[Mapping]],2,FALSE)","v":"malaysia"},"4 to 6 hours a day",null,"India"]
[null,"ID0365","2012-05-26T01:49:19",85000,85000,"USD",{"$f":"Data!$E308*VLOOKUP(Data!$F308,tblXrate[],2,FALSE)","v":12000},"Sr. Financial Analyst","Analyst","USA",{"$f":"VLOOKUP(Data!$J308,tblCountries[[Actual]:[Mapping]],2,FALSE)","v":"Asia"},"4 to 6 hours a day",null,"USA"]
[null,"ID0366","2012-05-26T01:49:55",43000,43000,"GBP",{"$f":"Data!$E309*VLOOKUP(Data!$F309,tblXrate[],2,FALSE)","v":1805.7739622442759},"Commercial Manager","Manager","UK",{"$f":"VLOOKUP(Data!$J309,tblCountries[[Actual]:[Mapping]],2,FALSE)","v":"Sri Lanka"},"4 to 6 hours a day",null,"UK"]
[null,"ID0367","2012-05-26T01:49:56",89000,89000,"USD",{"$f":"Data!$E310*VLOOKUP(Data!$F310,tblXrate[],2,FALSE)","v":37612.869087708088},"Quality Assurance Officer","Manager","USA",{"$f":"VLOOKUP(Data!$J310,tblCountries[[Actual]:[Mapping]],2,FALSE)","v":"South Africa"},"4 to 6 hours a day",null,"USA"]
[null,"ID0369","2012-05-26T01:50:28",47500,47500,"USD",{"$f":"Data!$E311*VLOOKUP(Data!$F311,tblXrate[],2,FALSE)","v":12000},"Supervisor, Contracts, Rebates, Chargebacks and Returns","Manager","USA",{"$f":"VLOOKUP(Data!$J311,tblCountries[[Actual]:[Mapping]],2,FALSE)","v":"iran"},"All the 8 hours baby, all the 8!",null,"USA"]
[null,"ID0370","2012-05-26T01:50:30",130000,130000,"USD",{"$f":"Data!$E312*VLOOKUP(Data!$F312,tblXrate[],2,FALSE)","v":15404.364569961488},"Project Manager","Manager","USA",{"$f":"VLOOKUP(Data!$J312,tblCountries[[Actual]:[Mapping]],2,FALSE)","v":"Republica Dominicana"},"2 to 3 hours per day",null,"USA"]
[null,"ID0371","2012-05-26T01:50:56",18000,18000,"USD",{"$f":"Data!$E313*VLOOKUP(Data!$F313,tblXrate[],2,FALSE)","v":19055.991584874118},"ceo","CXO or Top Mgmt.","India",{"$f":"VLOOKUP(Data!$J313,tblCountries[[Actual]:[Mapping]],2,FALSE)","v":"italy"},"2 to 3 hours per day",null,"India"]
[null,"ID0372","2012-05-26T01:50:59","480000 Rs.",480000,"INR",{"$f":"Data!$E314*VLOOKUP(Data!$F314,tblXrate[],2,FALSE)","v":90198.36016840415},"System Manager","Manager","India",{"$f":"VLOOKUP(Data!$J314,tblCountries[[Actual]:[Mapping]],2,FALSE)","v":"Germany"},"1 or 2 hours a day",null,"India"]
[null,"ID0373","2012-05-26T01:51:24",41932,41932,"USD",{"$f":"Data!$E315*VLOOKUP(Data!$F315,tblXrate[],2,FALSE)","v":11518.711713336908},"Buyer","Manager","USA",{"$f":"VLOOKUP(Data!$J315,tblCountries[[Actual]:[Mapping]],2,FALSE)","v":"Hungary"},"2 to 3 hours per day",null,"USA"]
[null,"ID0375","2012-05-26T01:52:04",194000,194000,"USD",{"$f":"Data!$E316*VLOOKUP(Data!$F316,tblXrate[],2,FALSE)","v":19008.034062397041},"director","CXO or Top Mgmt.","USA",{"$f":"VLOOKUP(Data!$J316,tblCountries[[Actual]:[Mapping]],2,FALSE)","v":"malaysia"},"2 to 3 hours per day",null,"USA"]
[null,"ID0376","2012-05-26T01:54:28",9000000,9000000,"INR",{"$f":"Data!$E317*VLOOKUP(Data!$F317,tblXrate[],2,FALSE)","v":17728},"Financial Analyst","Analyst","India",{"$f":"VLOOKUP(Data!$J317,tblCountries[[Actual]:[Mapping]],2,FALSE)","v":"Mexico"},"4 to 6 hours a day",null,"India"]
[null,"ID0377","2012-05-26T01:54:47","Rs. 500000",500000,"INR",{"$f":"Data!$E318*VLOOKUP(Data!$F318,tblXrate[],2,FALSE)","v":4019},"Owner","Manager","India",{"$f":"VLOOKUP(Data!$J318,tblCountries[[Actual]:[Mapping]],2,FALSE)","v":"Philippines"},"2 to 3 hours per day",null,"India"]
[null,"ID0378","2012-05-26T01:57:23",80000,80000,"CAD",{"$f":"Data!$E319*VLOOKUP(Data!$F319,tblXrate[],2,FALSE)","v":86000},"Senior Business Analyst","Analyst","Canada",{"$f":"VLOOKUP(Data!$J319,tblCountries[[Actual]:[Mapping]],2,FALSE)","v":"Philippines"},"4 to 6 hours a day",null,"Canada"]
[null,"ID0380","2012-05-26T01:58:19","Â£60000",60000,"GBP",{"$f":"Data!$E320*VLOOKUP(Data!$F320,tblXrate[],2,FALSE)","v":50815.977559664309},"Managing Director","CXO or Top Mgmt.","UK",{"$f":"VLOOKUP(Data!$J320,tblCountries[[Actual]:[Mapping]],2,FALSE)","v":"Germany"},"2 to 3 hours per day",null,"UK"]
[null,"ID0381","2012-05-26T01:58:42",95000,95000,"USD",{"$f":"Data!$E321*VLOOKUP(Data!$F321,tblXrate[],2,FALSE)","v":18000},"Senior Financial Analyst","Analyst","USA",{"$f":"VLOOKUP(Data!$J321,tblCountries[[Actual]:[Mapping]],2,FALSE)","v":"UAE"},"All the 8 hours baby, all the 8!",null,"USA"]
[null,"ID0382","2012-05-26T01:59:21","INR 5,40,000",540000,"INR",{"$f":"Data!$E322*VLOOKUP(Data!$F322,tblXrate[],2,FALSE)","v":91468.759607395754},"Senior Billing Engineer","Engineer","India",{"$f":"VLOOKUP(Data!$J322,tblCountries[[Actual]:[Mapping]],2,FALSE)","v":"Croatia"},"4 to 6 hours a day",null,"India"]
[null,"ID0383","2012-05-26T01:59:40",48000,48000,"USD",{"$f":"Data!$E323*VLOOKUP(Data!$F323,tblXrate[],2,FALSE)","v":20640},"Quality Analyst","Analyst","USA",{"$f":"VLOOKUP(Data!$J323,tblCountries[[Actual]:[Mapping]],2,FALSE)","v":"Singapore"},"1 or 2 hours a day",null,"USA"]
[null,"ID0384","2012-05-26T01:59:45","46000 usd",46000,"USD",{"$f":"Data!$E324*VLOOKUP(Data!$F324,tblXrate[],2,FALSE)","v":2953.8461538461538},"Financial analyst","Analyst","USA",{"$f":"VLOOKUP(Data!$J324,tblCountries[[Actual]:[Mapping]],2,FALSE)","v":"Ethiopia"},"4 to 6 hours a day",null,"USA"]
[null,"ID0386","2012-05-26T02:00:04","Rs 6.2 lakhs",620000,"INR",{"$f":"Data!$E325*VLOOKUP(Data!$F325,tblXrate[],2,FALSE)","v":8547.8000099724322},"assistant manager (finance)","Manager","India",{"$f":"VLOOKUP(Data!$J325,tblCountries[[Actual]:[Mapping]],2,FALSE)","v":"India"},"1 or 2 hours a day",null,"India"]
[null,"ID0387","2012-05-26T02:00:10","Â£28000",28000,"GBP",{"$f":"Data!$E326*VLOOKUP(Data!$F326,tblXrate[],2,FALSE)","v":11575.14584683767},"Central Services Manager","Manager","UK",{"$f":"VLOOKUP(Data!$J326,tblCountries[[Actual]:[Mapping]],2,FALSE)","v":"India"},"2 to 3 hours per day",null,"UK"]
[null,"ID0388","2012-05-26T02:00:14",47000,47000,"USD",{"$f":"Data!$E327*VLOOKUP(Data!$F327,tblXrate[],2,FALSE)","v":3205.4250037396623},"Trainer ","Manager","USA",{"$f":"VLOOKUP(Data!$J327,tblCountries[[Actual]:[Mapping]],2,FALSE)","v":"India"},"2 to 3 hours per day",null,"USA"]
[null,"ID0389","2012-05-26T02:00:42",44000,44000,"USD",{"$f":"Data!$E328*VLOOKUP(Data!$F328,tblXrate[],2,FALSE)","v":2136.9500024931081},"continuous improvement team member","Analyst","USA",{"$f":"VLOOKUP(Data!$J328,tblCountries[[Actual]:[Mapping]],2,FALSE)","v":"India"},"2 to 3 hours per day",null,"USA"]
[null,"ID0390","2012-05-26T02:00:46",55000,55000,"USD",{"$f":"Data!$E329*VLOOKUP(Data!$F329,tblXrate[],2,FALSE)","v":3739.6625043629392},"Accountant","Accountant","USA",{"$f":"VLOOKUP(Data!$J329,tblCountries[[Actual]:[Mapping]],2,FALSE)","v":"India"},"4 to 6 hours a day",null,"USA"]
[null,"ID0392","2012-05-26T02:01:07",50000,50000,"USD",{"$f":"Data!$E330*VLOOKUP(Data!$F330,tblXrate[],2,FALSE)","v":4451.9791718606421},"IR Manager","Manager","USA",{"$f":"VLOOKUP(Data!$J330,tblCountries[[Actual]:[Mapping]],2,FALSE)","v":"India"},"2 to 3 hours per day",null,"USA"]
[null,"ID0393","2012-05-26T02:01:31","7,50,000 INR",750000,"INR",{"$f":"Data!$E331*VLOOKUP(Data!$F331,tblXrate[],2,FALSE)","v":44000},"Business Analyst","Analyst","India",{"$f":"VLOOKUP(Data!$J331,tblCountries[[Actual]:[Mapping]],2,FALSE)","v":"USA"},"1 or 2 hours a day",null,"India"]
[null,"ID0395","2012-05-26T02:03:35",45880,45880,"USD",{"$f":"Data!$E332*VLOOKUP(Data!$F332,tblXrate[],2,FALSE)","v":50000},"Campus Budget Officer","Manager","USA",{"$f":"VLOOKUP(Data!$J332,tblCountries[[Actual]:[Mapping]],2,FALSE)","v":"USA"},"All the 8 hours baby, all the 8!",null,"USA"]
[null,"ID0396","2012-05-26T02:03:45",70000,70000,"USD",{"$f":"Data!$E333*VLOOKUP(Data!$F333,tblXrate[],2,FALSE)","v":4200},"Management Ananlyst","Manager","USA",{"$f":"VLOOKUP(Data!$J333,tblCountries[[Actual]:[Mapping]],2,FALSE)","v":"India"},"4 to 6 hours a day",null,"USA"]
[null,"ID0397","2012-05-26T02:04:01",100000,100000,"USD",{"$f":"Data!$E334*VLOOKUP(Data!$F334,tblXrate[],2,FALSE)","v":79552.953199405587},"Sales Operations Analyst","Analyst","USA",{"$f":"VLOOKUP(Data!$J334,tblCountries[[Actual]:[Mapping]],2,FALSE)","v":"Australia"},"All the 8 hours baby, all the 8!",null,"USA"]
[null,"ID0399","2012-05-26T02:05:06",85000,85000,"USD",{"$f":"Data!$E335*VLOOKUP(Data!$F335,tblXrate[],2,FALSE)","v":4000},"ENGINEER","Engineer","USA",{"$f":"VLOOKUP(Data!$J335,tblCountries[[Actual]:[Mapping]],2,FALSE)","v":"India"},"2 to 3 hours per day",null,"USA"]
[null,"ID0400","2012-05-26T02:05:49",47000,47000,"USD",{"$f":"Data!$E336*VLOOKUP(Data!$F336,tblXrate[],2,FALSE)","v":8369.7208430980063},"Sr Management Analytst 2","Manager","USA",{"$f":"VLOOKUP(Data!$J336,tblCountries[[Actual]:[Mapping]],2,FALSE)","v":"India"},"4 to 6 hours a day",null,"USA"]
[null,"ID0401","2012-05-26T02:05:58",40000,40000,"USD",{"$f":"Data!$E337*VLOOKUP(Data!$F337,tblXrate[],2,FALSE)","v":13000},"Accounting Manager","Manager","USA",{"$f":"VLOOKUP(Data!$J337,tblCountries[[Actual]:[Mapping]],2,FALSE)","v":"India"},"2 to 3 hours per day",null,"USA"]
[null,"ID0402","2012-05-26T02:06:38",30000,30000,"USD",{"$f":"Data!$E338*VLOOKUP(Data!$F338,tblXrate[],2,FALSE)","v":4451.9791718606421},"ceo","CXO or Top Mgmt.","India",{"$f":"VLOOKUP(Data!$J338,tblCountries[[Actual]:[Mapping]],2,FALSE)","v":"India"},"2 to 3 hours per day",null,"India"]
[null,"ID0403","2012-05-26T02:06:56",72000,72000,"CAD",{"$f":"Data!$E339*VLOOKUP(Data!$F339,tblXrate[],2,FALSE)","v":12821.700014958649},"Controller","Controller","Canada",{"$f":"VLOOKUP(Data!$J339,tblCountries[[Actual]:[Mapping]],2,FALSE)","v":"India"},"4 to 6 hours a day",null,"Canada"]
[null,"ID0404","2012-05-26T02:07:28",34000,34000,"USD",{"$f":"Data!$E340*VLOOKUP(Data!$F340,tblXrate[],2,FALSE)","v":8547.8000099724322},"Information Research Technician II","Analyst","USA",{"$f":"VLOOKUP(Data!$J340,tblCountries[[Actual]:[Mapping]],2,FALSE)","v":"India"},"4 to 6 hours a day",null,"USA"]
[null,"ID0405","2012-05-26T02:07:49",52000,52000,"USD",{"$f":"Data!$E341*VLOOKUP(Data!$F341,tblXrate[],2,FALSE)","v":7123.1666749770275},"Data Analyst","Analyst","USA",{"$f":"VLOOKUP(Data!$J341,tblCountries[[Actual]:[Mapping]],2,FALSE)","v":"India"},"4 to 6 hours a day",null,"USA"]
[null,"ID0406","2012-05-26T02:08:10",300000,300000,"INR",{"$f":"Data!$E342*VLOOKUP(Data!$F342,tblXrate[],2,FALSE)","v":3205.4250037396623},"Sr. Systems Engineer","Engineer","India",{"$f":"VLOOKUP(Data!$J342,tblCountries[[Actual]:[Mapping]],2,FALSE)","v":"India"},"1 or 2 hours a day",null,"India"]
[null,"ID0407","2012-05-26T02:09:57",400000,400000,"INR",{"$f":"Data!$E343*VLOOKUP(Data!$F343,tblXrate[],2,FALSE)","v":41000},"Analyst","Analyst","India",{"$f":"VLOOKUP(Data!$J343,tblCountries[[Actual]:[Mapping]],2,FALSE)","v":"USA"},"4 to 6 hours a day",null,"India"]
[null,"ID0409","2012-05-26T02:11:40","Â£35000",35000,"GBP",{"$f":"Data!$E344*VLOOKUP(Data!$F344,tblXrate[],2,FALSE)","v":5342.3750062327708},"Mgmt Accountant","Accountant","UK",{"$f":"VLOOKUP(Data!$J344,tblCountries[[Actual]:[Mapping]],2,FALSE)","v":"India"},"4 to 6 hours a day",null,"UK"]
[null,"ID0410","2012-05-26T02:12:58",60000,60000,"USD",{"$f":"Data!$E345*VLOOKUP(Data!$F345,tblXrate[],2,FALSE)","v":4273.9000049862161},"Sr financial analyst ","Analyst","USA",{"$f":"VLOOKUP(Data!$J345,tblCountries[[Actual]:[Mapping]],2,FALSE)","v":"India"},"4 to 6 hours a day",null,"USA"]
[null,"ID0413","2012-05-26T02:14:29",56000,56000,"USD",{"$f":"Data!$E346*VLOOKUP(Data!$F346,tblXrate[],2,FALSE)","v":10684.750012465542},"Staff assistant ","Analyst","USA",{"$f":"VLOOKUP(Data!$J346,tblCountries[[Actual]:[Mapping]],2,FALSE)","v":"India"},"4 to 6 hours a day",null,"USA"]
[null,"ID0414","2012-05-26T02:14:48",52000,52000,"USD",{"$f":"Data!$E347*VLOOKUP(Data!$F347,tblXrate[],2,FALSE)","v":6410.8500074793246},"Sr. Accountant","Accountant","USA",{"$f":"VLOOKUP(Data!$J347,tblCountries[[Actual]:[Mapping]],2,FALSE)","v":"India"},"4 to 6 hours a day",null,"USA"]
[null,"ID0415","2012-05-26T02:15:19",51613,51613,"USD",{"$f":"Data!$E348*VLOOKUP(Data!$F348,tblXrate[],2,FALSE)","v":40000},"Air Planning Analyst","Analyst","USA",{"$f":"VLOOKUP(Data!$J348,tblCountries[[Actual]:[Mapping]],2,FALSE)","v":"USA"},"All the 8 hours baby, all the 8!",null,"USA"]
[null,"ID0417","2012-05-26T02:17:18",56000,56000,"USD",{"$f":"Data!$E349*VLOOKUP(Data!$F349,tblXrate[],2,FALSE)","v":50815.977559664309},"financial management consultant","Manager","USA",{"$f":"VLOOKUP(Data!$J349,tblCountries[[Actual]:[Mapping]],2,FALSE)","v":"Netherlands"},"All the 8 hours baby, all the 8!",null,"USA"]
[null,"ID0418","2012-05-26T02:17:38","US$115000",115000,"USD",{"$f":"Data!$E350*VLOOKUP(Data!$F350,tblXrate[],2,FALSE)","v":4457.9172610556352},"Consultant","Consultant","USA",{"$f":"VLOOKUP(Data!$J350,tblCountries[[Actual]:[Mapping]],2,FALSE)","v":"Pakistan"},"2 to 3 hours per day",null,"USA"]
[null,"ID0419","2012-05-26T02:18:03","Â£66000",66000,"GBP",{"$f":"Data!$E351*VLOOKUP(Data!$F351,tblXrate[],2,FALSE)","v":2564.3400029917298},"IT Project Manager, EMEA","Manager","UK",{"$f":"VLOOKUP(Data!$J351,tblCountries[[Actual]:[Mapping]],2,FALSE)","v":"India"},"1 or 2 hours a day",null,"UK"]
[null,"ID0420","2012-05-26T02:19:12","INR 200000",200000,"INR",{"$f":"Data!$E352*VLOOKUP(Data!$F352,tblXrate[],2,FALSE)","v":70000},"Consultant","Consultant","India",{"$f":"VLOOKUP(Data!$J352,tblCountries[[Actual]:[Mapping]],2,FALSE)","v":"USA"},"1 or 2 hours a day",null,"India"]
[null,"ID0421","2012-05-26T02:19:48",72000,72000,"USD",{"$f":"Data!$E353*VLOOKUP(Data!$F353,tblXrate[],2,FALSE)","v":10684.750012465542},"IS Director","CXO or Top Mgmt.","USA",{"$f":"VLOOKUP(Data!$J353,tblCountries[[Actual]:[Mapping]],2,FALSE)","v":"India"},"4 to 6 hours a day",null,"USA"]
[null,"ID0422","2012-05-26T02:19:52",90000,90000,"USD",{"$f":"Data!$E354*VLOOKUP(Data!$F354,tblXrate[],2,FALSE)","v":57000},"Financial Analyst","Analyst","USA",{"$f":"VLOOKUP(Data!$J354,tblCountries[[Actual]:[Mapping]],2,FALSE)","v":"USA"},"All the 8 hours baby, all the 8!",null,"USA"]
[null,"ID0425","2012-05-26T02:22:17","250000 to 270000",250000,"USD",{"$f":"Data!$E355*VLOOKUP(Data!$F355,tblXrate[],2,FALSE)","v":95279.957924370581},"consultant","Consultant","USA",{"$f":"VLOOKUP(Data!$J355,tblCountries[[Actual]:[Mapping]],2,FALSE)","v":"Netherlands"},"All the 8 hours baby, all the 8!",null,"USA"]
[null,"ID0427","2012-05-26T02:25:10","20000 RS",240000,"INR",{"$f":"Data!$E356*VLOOKUP(Data!$F356,tblXrate[],2,FALSE)","v":66294.12766617132},"WFM Team Lead","Manager","India",{"$f":"VLOOKUP(Data!$J356,tblCountries[[Actual]:[Mapping]],2,FALSE)","v":"Australia"},"All the 8 hours baby, all the 8!",null,"India"]
[null,"ID0428","2012-05-26T02:27:50","US $30,000.00 ",30000,"USD",{"$f":"Data!$E357*VLOOKUP(Data!$F357,tblXrate[],2,FALSE)","v":53035.30213293706},"Supervisor","Manager","USA",{"$f":"VLOOKUP(Data!$J357,tblCountries[[Actual]:[Mapping]],2,FALSE)","v":"Australia"},"2 to 3 hours per day",null,"USA"]
[null,"ID0430","2012-05-26T02:31:24",24,24000,"USD",{"$f":"Data!$E358*VLOOKUP(Data!$F358,tblXrate[],2,FALSE)","v":34417.653306061438},"engineer","Engineer","USA",{"$f":"VLOOKUP(Data!$J358,tblCountries[[Actual]:[Mapping]],2,FALSE)","v":"Canada"},"1 or 2 hours a day",null,"USA"]
[null,"ID0431","2012-05-26T02:33:00",60000,60000,"USD",{"$f":"Data!$E359*VLOOKUP(Data!$F359,tblXrate[],2,FALSE)","v":15000},"Planner","Manager","USA",{"$f":"VLOOKUP(Data!$J359,tblCountries[[Actual]:[Mapping]],2,FALSE)","v":"India"},"4 to 6 hours a day",null,"USA"]
[null,"ID0432","2012-05-26T02:33:06",76600,76600,"USD",{"$f":"Data!$E360*VLOOKUP(Data!$F360,tblXrate[],2,FALSE)","v":3184.2266150397395},"Analyst","Analyst","USA",{"$f":"VLOOKUP(Data!$J360,tblCountries[[Actual]:[Mapping]],2,FALSE)","v":"Pakistan"},"2 to 3 hours per day",null,"USA"]
[null,"ID0433","2012-05-26T02:33:10","Â£65000",65000,"GBP",{"$f":"Data!$E361*VLOOKUP(Data!$F361,tblXrate[],2,FALSE)","v":3205.4250037396623},"Financial Controller","Controller","UK",{"$f":"VLOOKUP(Data!$J361,tblCountries[[Actual]:[Mapping]],2,FALSE)","v":"India"},"2 to 3 hours per day",null,"UK"]
[null,"ID0435","2012-05-26T02:34:37",90000,90000,"USD",{"$f":"Data!$E362*VLOOKUP(Data!$F362,tblXrate[],2,FALSE)","v":50995.482820131787},"senior analyst","Analyst","USA",{"$f":"VLOOKUP(Data!$J362,tblCountries[[Actual]:[Mapping]],2,FALSE)","v":"Australia"},"1 or 2 hours a day",null,"USA"]
[null,"ID0437","2012-05-26T02:35:11",75000,75000,"USD",{"$f":"Data!$E363*VLOOKUP(Data!$F363,tblXrate[],2,FALSE)","v":2493.1083362419595},"Financial Analys","Analyst","USA",{"$f":"VLOOKUP(Data!$J363,tblCountries[[Actual]:[Mapping]],2,FALSE)","v":"India"},"4 to 6 hours a day",null,"USA"]
[null,"ID0438","2012-05-26T02:37:50",72000,72000,"USD",{"$f":"Data!$E364*VLOOKUP(Data!$F364,tblXrate[],2,FALSE)","v":47285.348162018527},"Sr. Information Systems Analyst","Analyst","USA",{"$f":"VLOOKUP(Data!$J364,tblCountries[[Actual]:[Mapping]],2,FALSE)","v":"UK"},"2 to 3 hours per day",null,"USA"]
[null,"ID0439","2012-05-26T02:38:34",65000,65000,"USD",{"$f":"Data!$E365*VLOOKUP(Data!$F365,tblXrate[],2,FALSE)","v":3500},"Senior Claims Analyst","Analyst","USA",{"$f":"VLOOKUP(Data!$J365,tblCountries[[Actual]:[Mapping]],2,FALSE)","v":"Pakistan"},"4 to 6 hours a day",null,"USA"]
[null,"ID0440","2012-05-26T02:39:56",120000,120000,"USD",{"$f":"Data!$E366*VLOOKUP(Data!$F366,tblXrate[],2,FALSE)","v":60000},"Director","CXO or Top Mgmt.","USA",{"$f":"VLOOKUP(Data!$J366,tblCountries[[Actual]:[Mapping]],2,FALSE)","v":"USA"},"1 or 2 hours a day",null,"USA"]
[null,"ID0441","2012-05-26T02:40:39","INR 40L",4000000,"INR",{"$f":"Data!$E367*VLOOKUP(Data!$F367,tblXrate[],2,FALSE)","v":81600},"Sr Mgr Finance","Accountant","India",{"$f":"VLOOKUP(Data!$J367,tblCountries[[Actual]:[Mapping]],2,FALSE)","v":"UK"},"All the 8 hours baby, all the 8!",null,"India"]
[null,"ID0442","2012-05-26T02:42:20","Rs. 300000",300000,"INR",{"$f":"Data!$E368*VLOOKUP(Data!$F368,tblXrate[],2,FALSE)","v":50437.70470615309},"Web Portal Manager","Manager","India",{"$f":"VLOOKUP(Data!$J368,tblCountries[[Actual]:[Mapping]],2,FALSE)","v":"UK"},"4 to 6 hours a day",null,"India"]
[null,"ID0443","2012-05-26T02:43:21",1100000,1100000,"INR",{"$f":"Data!$E369*VLOOKUP(Data!$F369,tblXrate[],2,FALSE)","v":46300.583387350678},"manager - MIS & operations planning","Manager","India",{"$f":"VLOOKUP(Data!$J369,tblCountries[[Actual]:[Mapping]],2,FALSE)","v":"India"},"4 to 6 hours a day",null,"India"]
[null,"ID0444","2012-05-26T02:46:18",80000,80000,"USD",{"$f":"Data!$E370*VLOOKUP(Data!$F370,tblXrate[],2,FALSE)","v":43000},"web analyst","Analyst","USA",{"$f":"VLOOKUP(Data!$J370,tblCountries[[Actual]:[Mapping]],2,FALSE)","v":"Australia"},"4 to 6 hours a day",null,"USA"]
[null,"ID0445","2012-05-26T02:46:56","INR 30,00,000",3000000,"INR",{"$f":"Data!$E371*VLOOKUP(Data!$F371,tblXrate[],2,FALSE)","v":8000},"Management Consultant","Manager","India",{"$f":"VLOOKUP(Data!$J371,tblCountries[[Actual]:[Mapping]],2,FALSE)","v":"India"},"4 to 6 hours a day",null,"India"]
[null,"ID0446","2012-05-26T02:48:32",110000,110000,"CAD",{"$f":"Data!$E372*VLOOKUP(Data!$F372,tblXrate[],2,FALSE)","v":70928.022243027779},"Continuos improvment","Controller","Canad",{"$f":"VLOOKUP(Data!$J372,tblCountries[[Actual]:[Mapping]],2,FALSE)","v":"UK"},"2 to 3 hours per day",null,"Canada"]
[null,"ID0447","2012-05-26T02:49:24",51000,51000,"USD",{"$f":"Data!$E373*VLOOKUP(Data!$F373,tblXrate[],2,FALSE)","v":4897.177089046706},"Direct marketing manager","Manager","USA",{"$f":"VLOOKUP(Data!$J373,tblCountries[[Actual]:[Mapping]],2,FALSE)","v":"India"},"2 to 3 hours per day",null,"USA"]
[null,"ID0448","2012-05-26T02:50:16","5000 $",5000,"USD",{"$f":"Data!$E374*VLOOKUP(Data!$F374,tblXrate[],2,FALSE)","v":28492.66669990811},"mis","Reporting","India",{"$f":"VLOOKUP(Data!$J374,tblCountries[[Actual]:[Mapping]],2,FALSE)","v":"India"},"4 to 6 hours a day",null,"India"]
[null,"ID0449","2012-05-26T02:53:29",74000,74000,"USD",{"$f":"Data!$E375*VLOOKUP(Data!$F375,tblXrate[],2,FALSE)","v":5342.3750062327708},"Engineer","Engineer","USA",{"$f":"VLOOKUP(Data!$J375,tblCountries[[Actual]:[Mapping]],2,FALSE)","v":"India"},"4 to 6 hours a day",null,"USA"]
[null,"ID0450","2012-05-26T02:53:48","Â£60000",60000,"GBP",{"$f":"Data!$E376*VLOOKUP(Data!$F376,tblXrate[],2,FALSE)","v":16027.125018698311},"Excel Consultant","Consultant","UK",{"$f":"VLOOKUP(Data!$J376,tblCountries[[Actual]:[Mapping]],2,FALSE)","v":"India"},"4 to 6 hours a day",null,"UK"]
[null,"ID0451","2012-05-26T02:55:27",50000,50000,"USD",{"$f":"Data!$E377*VLOOKUP(Data!$F377,tblXrate[],2,FALSE)","v":60000},"Wine Analyst","Analyst","USA",{"$f":"VLOOKUP(Data!$J377,tblCountries[[Actual]:[Mapping]],2,FALSE)","v":"USA"},"4 to 6 hours a day",null,"USA"]
[null,"ID0452","2012-05-26T02:55:29","500000 rupees",500000,"INR",{"$f":"Data!$E378*VLOOKUP(Data!$F378,tblXrate[],2,FALSE)","v":25000},"Business Analyst","Analyst","India",{"$f":"VLOOKUP(Data!$J378,tblCountries[[Actual]:[Mapping]],2,FALSE)","v":"India"},"4 to 6 hours a day",null,"India"]
[null,"ID0454","2012-05-26T02:57:47",900000,900000,"INR",{"$f":"Data!$E379*VLOOKUP(Data!$F379,tblXrate[],2,FALSE)","v":5000},"Regional Manager","Manager","India",{"$f":"VLOOKUP(Data!$J379,tblCountries[[Actual]:[Mapping]],2,FALSE)","v":"India"},"1 or 2 hours a day",null,"India"]
[null,"ID0456","2012-05-26T03:01:42",60000,60000,"USD",{"$f":"Data!$E380*VLOOKUP(Data!$F380,tblXrate[],2,FALSE)","v":9545.0433444692171},"Finalcial Reporting Analyst","Analyst","USA",{"$f":"VLOOKUP(Data!$J380,tblCountries[[Actual]:[Mapping]],2,FALSE)","v":"India"},"All the 8 hours baby, all the 8!",null,"USA"]
[null,"ID0457","2012-05-26T03:02:42","800000 rupees",800000,"INR",{"$f":"Data!$E381*VLOOKUP(Data!$F381,tblXrate[],2,FALSE)","v":34000},"Partner","CXO or Top Mgmt.","India",{"$f":"VLOOKUP(Data!$J381,tblCountries[[Actual]:[Mapping]],2,FALSE)","v":"India"},"All the 8 hours baby, all the 8!",null,"India"]
[null,"ID0458","2012-05-26T03:03:09",80000,80000,"USD",{"$f":"Data!$E382*VLOOKUP(Data!$F382,tblXrate[],2,FALSE)","v":30000},"operations tech","Manager","USA",{"$f":"VLOOKUP(Data!$J382,tblCountries[[Actual]:[Mapping]],2,FALSE)","v":"India"},"1 or 2 hours a day",null,"USA"]
[null,"ID0459","2012-05-26T03:03:29","Â£38000",38000,"GBP",{"$f":"Data!$E383*VLOOKUP(Data!$F383,tblXrate[],2,FALSE)","v":17807.916687442568},"Commercial Accountant","Accountant","UK",{"$f":"VLOOKUP(Data!$J383,tblCountries[[Actual]:[Mapping]],2,FALSE)","v":"India"},"4 to 6 hours a day",null,"UK"]
[null,"ID0460","2012-05-26T03:04:06","52,000 Cdn",52000,"CAD",{"$f":"Data!$E384*VLOOKUP(Data!$F384,tblXrate[],2,FALSE)","v":65889.291743537498},"Office Manager","Manager","Canada",{"$f":"VLOOKUP(Data!$J384,tblCountries[[Actual]:[Mapping]],2,FALSE)","v":"India"},"4 to 6 hours a day",null,"Canada"]
[null,"ID0461","2012-05-26T03:06:16",125000,125000,"USD",{"$f":"Data!$E385*VLOOKUP(Data!$F385,tblXrate[],2,FALSE)","v":100000},"Prod Mgr","Manager","USA",{"$f":"VLOOKUP(Data!$J385,tblCountries[[Actual]:[Mapping]],2,FALSE)","v":"USA"},"2 to 3 hours per day",null,"USA"]
[null,"ID0462","2012-05-26T03:06:37",52000,52000,"USD",{"$f":"Data!$E386*VLOOKUP(Data!$F386,tblXrate[],2,FALSE)","v":17807.916687442568},"Graphics/Web Document Designer","Analyst","USA",{"$f":"VLOOKUP(Data!$J386,tblCountries[[Actual]:[Mapping]],2,FALSE)","v":"India"},"2 to 3 hours per day",null,"USA"]
[null,"ID0463","2012-05-26T03:07:46",45000,45000,"USD",{"$f":"Data!$E387*VLOOKUP(Data!$F387,tblXrate[],2,FALSE)","v":2225.989585930321},"Analyst","Analyst","USA",{"$f":"VLOOKUP(Data!$J387,tblCountries[[Actual]:[Mapping]],2,FALSE)","v":"India"},"4 to 6 hours a day",null,"USA"]
[null,"ID0464","2012-05-26T03:08:28",25000,25000,"GBP",{"$f":"Data!$E388*VLOOKUP(Data!$F388,tblXrate[],2,FALSE)","v":8013.5625093491553},"Analyst","Analyst","UK",{"$f":"VLOOKUP(Data!$J388,tblCountries[[Actual]:[Mapping]],2,FALSE)","v":"India"},"4 to 6 hours a day",null,"UK"]
[null,"ID0465","2012-05-26T03:09:43",60000,60000,"USD",{"$f":"Data!$E389*VLOOKUP(Data!$F389,tblXrate[],2,FALSE)","v":45000},"Business intelligence manager","Manager","USA",{"$f":"VLOOKUP(Data!$J389,tblCountries[[Actual]:[Mapping]],2,FALSE)","v":"USA"},"All the 8 hours baby, all the 8!",null,"USA"]
[null,"ID0466","2012-05-26T03:09:49","CDN $70,000",70000,"CAD",{"$f":"Data!$E390*VLOOKUP(Data!$F390,tblXrate[],2,FALSE)","v":7123.1666749770275},"Program Manager","Manager","Canada",{"$f":"VLOOKUP(Data!$J390,tblCountries[[Actual]:[Mapping]],2,FALSE)","v":"India"},"1 or 2 hours a day",null,"Canada"]
[null,"ID0468","2012-05-26T03:11:44",87000,87000,"CAD",{"$f":"Data!$E391*VLOOKUP(Data!$F391,tblXrate[],2,FALSE)","v":65000},"Business Manager","Manager","Canada",{"$f":"VLOOKUP(Data!$J391,tblCountries[[Actual]:[Mapping]],2,FALSE)","v":"USA"},"4 to 6 hours a day",null,"Canada"]
[null,"ID0469","2012-05-26T03:13:13",125000,125000,"INR",{"$f":"Data!$E392*VLOOKUP(Data!$F392,tblXrate[],2,FALSE)","v":8903.9583437212841},"clerk","Analyst","India",{"$f":"VLOOKUP(Data!$J392,tblCountries[[Actual]:[Mapping]],2,FALSE)","v":"India"},"4 to 6 hours a day",null,"India"]
[null,"ID0470","2012-05-26T03:14:44",150000,150000,"USD",{"$f":"Data!$E393*VLOOKUP(Data!$F393,tblXrate[],2,FALSE)","v":7497.1329254133216},"CFO","CXO or Top Mgmt.","USA",{"$f":"VLOOKUP(Data!$J393,tblCountries[[Actual]:[Mapping]],2,FALSE)","v":"India"},"2 to 3 hours per day",null,"USA"]
[null,"ID0471","2012-05-26T03:15:01",50000,50000,"USD",{"$f":"Data!$E394*VLOOKUP(Data!$F394,tblXrate[],2,FALSE)","v":36000},"Researcher & Data Analyst","Analyst","USA",{"$f":"VLOOKUP(Data!$J394,tblCountries[[Actual]:[Mapping]],2,FALSE)","v":"USA"},"4 to 6 hours a day",null,"USA"]
[null,"ID0472","2012-05-26T03:15:04",70000,70000,"USD",{"$f":"Data!$E395*VLOOKUP(Data!$F395,tblXrate[],2,FALSE)","v":4594.4425053601826},"Analyst","Analyst","USA",{"$f":"VLOOKUP(Data!$J395,tblCountries[[Actual]:[Mapping]],2,FALSE)","v":"India"},"4 to 6 hours a day",null,"USA"]
[null,"ID0473","2012-05-26T03:15:30","Â£28500",28500,"GBP",{"$f":"Data!$E396*VLOOKUP(Data!$F396,tblXrate[],2,FALSE)","v":30000},"Data Quality & Analysis Manager","Manager","UK",{"$f":"VLOOKUP(Data!$J396,tblCountries[[Actual]:[Mapping]],2,FALSE)","v":"USA"},"2 to 3 hours per day",null,"UK"]
[null,"ID0474","2012-05-26T03:15:50",20000,20000,"USD",{"$f":"Data!$E397*VLOOKUP(Data!$F397,tblXrate[],2,FALSE)","v":35148.775467100437},"Specialist","Specialist","India",{"$f":"VLOOKUP(Data!$J397,tblCountries[[Actual]:[Mapping]],2,FALSE)","v":"UK"},"4 to 6 hours a day",null,"India"]
[null,"ID0477","2012-05-26T03:17:19",1250000,1250000,"CAD",{"$f":"Data!$E398*VLOOKUP(Data!$F398,tblXrate[],2,FALSE)","v":76702.198796365497},"Account Executive","Accountant","Canada",{"$f":"VLOOKUP(Data!$J398,tblCountries[[Actual]:[Mapping]],2,FALSE)","v":"Canada"},"4 to 6 hours a day",null,"Canada"]
[null,"ID0478","2012-05-26T03:19:00",30000,30000,"USD",{"$f":"Data!$E399*VLOOKUP(Data!$F399,tblXrate[],2,FALSE)","v":45000},"video production","Analyst","USA",{"$f":"VLOOKUP(Data!$J399,tblCountries[[Actual]:[Mapping]],2,FALSE)","v":"USA"},"Excel ?!? What Excel?",null,"USA"]
[null,"ID0480","2012-05-26T03:21:55",92000,92000,"USD",{"$f":"Data!$E400*VLOOKUP(Data!$F400,tblXrate[],2,FALSE)","v":9972.4333449678379},"principal engineer","Engineer","USA",{"$f":"VLOOKUP(Data!$J400,tblCountries[[Actual]:[Mapping]],2,FALSE)","v":"India"},"1 or 2 hours a day",null,"USA"]
[null,"ID0481","2012-05-26T03:22:33",52000,52000,"USD",{"$f":"Data!$E401*VLOOKUP(Data!$F401,tblXrate[],2,FALSE)","v":8013.5625093491553},"budget analyst","Analyst","USA",{"$f":"VLOOKUP(Data!$J401,tblCountries[[Actual]:[Mapping]],2,FALSE)","v":"India"},"4 to 6 hours a day",null,"USA"]
[null,"ID0482","2012-05-26T03:23:51","US$169,000",169000,"USD",{"$f":"Data!$E402*VLOOKUP(Data!$F402,tblXrate[],2,FALSE)","v":12465.541681209797},"Category Director (Marketing)","CXO or Top Mgmt.","USA",{"$f":"VLOOKUP(Data!$J402,tblCountries[[Actual]:[Mapping]],2,FALSE)","v":"India"},"2 to 3 hours per day",null,"USA"]
[null,"ID0486","2012-05-26T03:30:42","GB Sterling 59k",59000,"GBP",{"$f":"Data!$E403*VLOOKUP(Data!$F403,tblXrate[],2,FALSE)","v":4000},"Health and safety advisor","Consultant","UK",{"$f":"VLOOKUP(Data!$J403,tblCountries[[Actual]:[Mapping]],2,FALSE)","v":"India"},"2 to 3 hours per day",null,"UK"]
[null,"ID0487","2012-05-26T03:31:34",50000,50000,"USD",{"$f":"Data!$E404*VLOOKUP(Data!$F404,tblXrate[],2,FALSE)","v":62000},"Workforce Analyst","Analyst","USA",{"$f":"VLOOKUP(Data!$J404,tblCountries[[Actual]:[Mapping]],2,FALSE)","v":"USA"},"4 to 6 hours a day",null,"USA"]
[null,"ID0488","2012-05-26T03:32:13",65000,65000,"USD",{"$f":"Data!$E405*VLOOKUP(Data!$F405,tblXrate[],2,FALSE)","v":63519.971949580387},"Business Systems Analyst","Analyst","USA",{"$f":"VLOOKUP(Data!$J405,tblCountries[[Actual]:[Mapping]],2,FALSE)","v":"Germany"},"2 to 3 hours per day",null,"USA"]
[null,"ID0489","2012-05-26T03:32:53",46000,46000,"CAD",{"$f":"Data!$E406*VLOOKUP(Data!$F406,tblXrate[],2,FALSE)","v":4500},"Sr. Marketing Solutions Analyst","Analyst","Canada",{"$f":"VLOOKUP(Data!$J406,tblCountries[[Actual]:[Mapping]],2,FALSE)","v":"Indonesia"},"All the 8 hours baby, all the 8!",null,"Canada"]
[null,"ID0490","2012-05-26T03:33:32",55000,55000,"USD",{"$f":"Data!$E407*VLOOKUP(Data!$F407,tblXrate[],2,FALSE)","v":10000},"Analyst","Analyst","USA",{"$f":"VLOOKUP(Data!$J407,tblCountries[[Actual]:[Mapping]],2,FALSE)","v":"Viet Nam"},"2 to 3 hours per day",null,"USA"]
[null,"ID0491","2012-05-26T03:34:04","20000 US$",20000,"USD",{"$f":"Data!$E408*VLOOKUP(Data!$F408,tblXrate[],2,FALSE)","v":19055.991584874118},"Consultant","Consultant","India",{"$f":"VLOOKUP(Data!$J408,tblCountries[[Actual]:[Mapping]],2,FALSE)","v":"Slovenia"},"2 to 3 hours per day",null,"India"]
[null,"ID0492","2012-05-26T03:34:15",6000,6000,"USD",{"$f":"Data!$E409*VLOOKUP(Data!$F409,tblXrate[],2,FALSE)","v":45000},"MIS","Reporting","India",{"$f":"VLOOKUP(Data!$J409,tblCountries[[Actual]:[Mapping]],2,FALSE)","v":"Singapore"},"All the 8 hours baby, all the 8!",null,"India"]
[null,"ID0493","2012-05-26T03:37:33",190000,190000,"GBP",{"$f":"Data!$E410*VLOOKUP(Data!$F410,tblXrate[],2,FALSE)","v":76223.966339496474},"Managing Partner","CXO or Top Mgmt.","UK",{"$f":"VLOOKUP(Data!$J410,tblCountries[[Actual]:[Mapping]],2,FALSE)","v":"Finland"},"4 to 6 hours a day",null,"UK"]
[null,"ID0494","2012-05-26T03:37:46",28164,28164,"GBP",{"$f":"Data!$E411*VLOOKUP(Data!$F411,tblXrate[],2,FALSE)","v":41000},"Administration Officer","Manager","UK",{"$f":"VLOOKUP(Data!$J411,tblCountries[[Actual]:[Mapping]],2,FALSE)","v":"Israel"},"4 to 6 hours a day",null,"UK"]
[null,"ID0495","2012-05-26T03:40:26",40000,40000,"USD",{"$f":"Data!$E412*VLOOKUP(Data!$F412,tblXrate[],2,FALSE)","v":45734.379803697877},"BAS","Analyst","USA",{"$f":"VLOOKUP(Data!$J412,tblCountries[[Actual]:[Mapping]],2,FALSE)","v":"Ireland"},"2 to 3 hours per day",null,"USA"]
[null,"ID0497","2012-05-26T03:49:21","200000 Rupees",200000,"INR",{"$f":"Data!$E413*VLOOKUP(Data!$F413,tblXrate[],2,FALSE)","v":13000},"chemist","Analyst","India",{"$f":"VLOOKUP(Data!$J413,tblCountries[[Actual]:[Mapping]],2,FALSE)","v":"Brazil"},"2 to 3 hours per day",null,"India"]
[null,"ID0498","2012-05-26T03:50:24",84000,84000,"USD",{"$f":"Data!$E414*VLOOKUP(Data!$F414,tblXrate[],2,FALSE)","v":31200},"Senior Analyst","Analyst","USA",{"$f":"VLOOKUP(Data!$J414,tblCountries[[Actual]:[Mapping]],2,FALSE)","v":"Brazil"},"All the 8 hours baby, all the 8!",null,"USA"]
[null,"ID0499","2012-05-26T03:52:24",33000,33000,"GBP",{"$f":"Data!$E415*VLOOKUP(Data!$F415,tblXrate[],2,FALSE)","v":59819.107020370408},"LOGISTIC MANAGER","Manager","UK",{"$f":"VLOOKUP(Data!$J415,tblCountries[[Actual]:[Mapping]],2,FALSE)","v":"New Zealand"},"4 to 6 hours a day",null,"UK"]
[null,"ID0500","2012-05-26T03:53:29","Rs. 7,20,000/-",720000,"INR",{"$f":"Data!$E416*VLOOKUP(Data!$F416,tblXrate[],2,FALSE)","v":100800},"Manager Finance","Manager","India",{"$f":"VLOOKUP(Data!$J416,tblCountries[[Actual]:[Mapping]],2,FALSE)","v":"Oman"},"2 to 3 hours per day",null,"India"]
[null,"ID0501","2012-05-26T04:00:21",68500,68500,"CAD",{"$f":"Data!$E417*VLOOKUP(Data!$F417,tblXrate[],2,FALSE)","v":5342.3750062327708},"Financial Analyst","Analyst","Canada",{"$f":"VLOOKUP(Data!$J417,tblCountries[[Actual]:[Mapping]],2,FALSE)","v":"India"},"4 to 6 hours a day",null,"Canada"]
[null,"ID0503","2012-05-26T04:01:59",58000,58000,"GBP",{"$f":"Data!$E418*VLOOKUP(Data!$F418,tblXrate[],2,FALSE)","v":10200},"Business Modeller","Manager","UK",{"$f":"VLOOKUP(Data!$J418,tblCountries[[Actual]:[Mapping]],2,FALSE)","v":"India"},"All the 8 hours baby, all the 8!",null,"UK"]
[null,"ID0504","2012-05-26T04:03:33",77000,77000,"USD",{"$f":"Data!$E419*VLOOKUP(Data!$F419,tblXrate[],2,FALSE)","v":5787.5729234188348},"Senior Financial Analyst","Analyst","USA",{"$f":"VLOOKUP(Data!$J419,tblCountries[[Actual]:[Mapping]],2,FALSE)","v":"India"},"All the 8 hours baby, all the 8!",null,"USA"]
[null,"ID0505","2012-05-26T04:05:08",100000,100000,"USD",{"$f":"Data!$E420*VLOOKUP(Data!$F420,tblXrate[],2,FALSE)","v":2671.1875031163854},"Analyst","Analyst","USA",{"$f":"VLOOKUP(Data!$J420,tblCountries[[Actual]:[Mapping]],2,FALSE)","v":"India"},"4 to 6 hours a day",null,"USA"]
[null,"ID0508","2012-05-26T04:13:54","Rs 6L",600000,"INR",{"$f":"Data!$E421*VLOOKUP(Data!$F421,tblXrate[],2,FALSE)","v":3739.6625043629392},"Business Co ordinator","Manager","India",{"$f":"VLOOKUP(Data!$J421,tblCountries[[Actual]:[Mapping]],2,FALSE)","v":"India"},"4 to 6 hours a day",null,"India"]
[null,"ID0509","2012-05-26T04:14:27",8400,8400,"USD",{"$f":"Data!$E422*VLOOKUP(Data!$F422,tblXrate[],2,FALSE)","v":49500},"Manager","Manager","India",{"$f":"VLOOKUP(Data!$J422,tblCountries[[Actual]:[Mapping]],2,FALSE)","v":"USA"},"4 to 6 hours a day",null,"India"]
[null,"ID0510","2012-05-26T04:16:16","Rs 500000",500000,"INR",{"$f":"Data!$E423*VLOOKUP(Data!$F423,tblXrate[],2,FALSE)","v":11000},"duty manager","Manager","India",{"$f":"VLOOKUP(Data!$J423,tblCountries[[Actual]:[Mapping]],2,FALSE)","v":"Sri Lanka"},"2 to 3 hours per day",null,"India"]
[null,"ID0512","2012-05-26T04:18:15",65000,65000,"USD",{"$f":"Data!$E424*VLOOKUP(Data!$F424,tblXrate[],2,FALSE)","v":36000},"Retail Store Manager","Manager","USA",{"$f":"VLOOKUP(Data!$J424,tblCountries[[Actual]:[Mapping]],2,FALSE)","v":"UAE"},"All the 8 hours baby, all the 8!",null,"USA"]
[null,"ID0513","2012-05-26T04:19:05","Â£16400",16400,"GBP",{"$f":"Data!$E425*VLOOKUP(Data!$F425,tblXrate[],2,FALSE)","v":18000},"Job Build analyst","Analyst","UK",{"$f":"VLOOKUP(Data!$J425,tblCountries[[Actual]:[Mapping]],2,FALSE)","v":"India"},"4 to 6 hours a day",null,"UK"]
[null,"ID0514","2012-05-26T04:20:17",78000,78000,"GBP",{"$f":"Data!$E426*VLOOKUP(Data!$F426,tblXrate[],2,FALSE)","v":54000},"Associate","Analyst","UK",{"$f":"VLOOKUP(Data!$J426,tblCountries[[Actual]:[Mapping]],2,FALSE)","v":"USA"},"1 or 2 hours a day",null,"UK"]
[null,"ID0515","2012-05-26T04:25:24",76000,76000,"USD",{"$f":"Data!$E427*VLOOKUP(Data!$F427,tblXrate[],2,FALSE)","v":75000},"Accounting Manager","Manager","USA",{"$f":"VLOOKUP(Data!$J427,tblCountries[[Actual]:[Mapping]],2,FALSE)","v":"USA"},"2 to 3 hours per day",null,"USA"]
[null,"ID0516","2012-05-26T04:26:10","$150000pa",150000,"USD",{"$f":"Data!$E428*VLOOKUP(Data!$F428,tblXrate[],2,FALSE)","v":4273.9000049862161},"Consultant","Consultant","USA",{"$f":"VLOOKUP(Data!$J428,tblCountries[[Actual]:[Mapping]],2,FALSE)","v":"India"},"All the 8 hours baby, all the 8!",null,"USA"]
[null,"ID0517","2012-05-26T04:27:12",54000,54000,"USD",{"$f":"Data!$E429*VLOOKUP(Data!$F429,tblXrate[],2,FALSE)","v":160000},"Business Analyst","Analyst","USA",{"$f":"VLOOKUP(Data!$J429,tblCountries[[Actual]:[Mapping]],2,FALSE)","v":"USA"},"4 to 6 hours a day",null,"USA"]
[null,"ID0519","2012-05-26T04:33:27",61000,61000,"USD",{"$f":"Data!$E430*VLOOKUP(Data!$F430,tblXrate[],2,FALSE)","v":61000},"Senior Accountant","Accountant","USA",{"$f":"VLOOKUP(Data!$J430,tblCountries[[Actual]:[Mapping]],2,FALSE)","v":"USA"},"4 to 6 hours a day",null,"USA"]
[null,"ID0520","2012-05-26T04:34:41",70000,70000,"USD",{"$f":"Data!$E431*VLOOKUP(Data!$F431,tblXrate[],2,FALSE)","v":54084.883766667976},"Metrics Analyst","Analyst","USA",{"$f":"VLOOKUP(Data!$J431,tblCountries[[Actual]:[Mapping]],2,FALSE)","v":"Canada"},"All the 8 hours baby, all the 8!",null,"USA"]
[null,"ID0521","2012-05-26T04:36:43",15000,15000,"USD",{"$f":"Data!$E432*VLOOKUP(Data!$F432,tblXrate[],2,FALSE)","v":7123.1666749770275},"Asst.Manager","Manager","India",{"$f":"VLOOKUP(Data!$J432,tblCountries[[Actual]:[Mapping]],2,FALSE)","v":"India"},"4 to 6 hours a day",null,"India"]
[null,"ID0522","2012-05-26T04:39:11",87550,87550,"CAD",{"$f":"Data!$E433*VLOOKUP(Data!$F433,tblXrate[],2,FALSE)","v":2671.1875031163854},"Manager","Manager","Canada",{"$f":"VLOOKUP(Data!$J433,tblCountries[[Actual]:[Mapping]],2,FALSE)","v":"India"},"4 to 6 hours a day",null,"Canada"]
[null,"ID0523","2012-05-26T04:40:36",72600,72600,"USD",{"$f":"Data!$E434*VLOOKUP(Data!$F434,tblXrate[],2,FALSE)","v":7693.0200089751897},"Accounting Operations Manager","Manager","USA",{"$f":"VLOOKUP(Data!$J434,tblCountries[[Actual]:[Mapping]],2,FALSE)","v":"India"},"2 to 3 hours per day",null,"USA"]
[null,"ID0524","2012-05-26T04:41:20",100000,100000,"USD",{"$f":"Data!$E435*VLOOKUP(Data!$F435,tblXrate[],2,FALSE)","v":4451.9791718606421},"Director","CXO or Top Mgmt.","USA",{"$f":"VLOOKUP(Data!$J435,tblCountries[[Actual]:[Mapping]],2,FALSE)","v":"India"},"2 to 3 hours per day",null,"USA"]
[null,"ID0525","2012-05-26T04:44:26",104000,104000,"USD",{"$f":"Data!$E436*VLOOKUP(Data!$F436,tblXrate[],2,FALSE)","v":4957.7240057840108},"Vice President, Analyst","Analyst","USA",{"$f":"VLOOKUP(Data!$J436,tblCountries[[Actual]:[Mapping]],2,FALSE)","v":"India"},"4 to 6 hours a day",null,"USA"]
[null,"ID0526","2012-05-26T04:48:35",600000,600000,"INR",{"$f":"Data!$E437*VLOOKUP(Data!$F437,tblXrate[],2,FALSE)","v":40958.208381117904},"Project Manager","Manager","India",{"$f":"VLOOKUP(Data!$J437,tblCountries[[Actual]:[Mapping]],2,FALSE)","v":"India"},"4 to 6 hours a day",null,"India"]
[null,"ID0527","2012-05-26T04:48:54",200000,200000,"USD",{"$f":"Data!$E438*VLOOKUP(Data!$F438,tblXrate[],2,FALSE)","v":7301.2458418514525},"COO","CXO or Top Mgmt.","USA",{"$f":"VLOOKUP(Data!$J438,tblCountries[[Actual]:[Mapping]],2,FALSE)","v":"India"},"2 to 3 hours per day",null,"USA"]
[null,"ID0528","2012-05-26T04:50:21","EUR 49248",49248,"EUR",{"$f":"Data!$E439*VLOOKUP(Data!$F439,tblXrate[],2,FALSE)","v":10684.750012465542},"Financial Advisor","Accountant","Netherlands",{"$f":"VLOOKUP(Data!$J439,tblCountries[[Actual]:[Mapping]],2,FALSE)","v":"India"},"All the 8 hours baby, all the 8!",null,"Netherlands"]
[null,"ID0529","2012-05-26T04:50:47",36500,36500,"GBP",{"$f":"Data!$E440*VLOOKUP(Data!$F440,tblXrate[],2,FALSE)","v":116637.19213297902},"Production Manager","Manager","UK",{"$f":"VLOOKUP(Data!$J440,tblCountries[[Actual]:[Mapping]],2,FALSE)","v":"UK"},"2 to 3 hours per day",null,"UK"]
[null,"ID0530","2012-05-26T05:00:21",82300,82300,"USD",{"$f":"Data!$E441*VLOOKUP(Data!$F441,tblXrate[],2,FALSE)","v":16000},"Manager - Finance","Manager","USA",{"$f":"VLOOKUP(Data!$J441,tblCountries[[Actual]:[Mapping]],2,FALSE)","v":"India"},"2 to 3 hours per day",null,"USA"]
[null,"ID0531","2012-05-26T05:04:49",95000,95000,"USD",{"$f":"Data!$E442*VLOOKUP(Data!$F442,tblXrate[],2,FALSE)","v":12465.541681209797},"Process Design Consultant","Consultant","USA",{"$f":"VLOOKUP(Data!$J442,tblCountries[[Actual]:[Mapping]],2,FALSE)","v":"India"},"4 to 6 hours a day",null,"USA"]
[null,"ID0532","2012-05-26T05:07:30",140000,140000,"GBP",{"$f":"Data!$E443*VLOOKUP(Data!$F443,tblXrate[],2,FALSE)","v":30232},"vba specialist","Specialist","UK",{"$f":"VLOOKUP(Data!$J443,tblCountries[[Actual]:[Mapping]],2,FALSE)","v":"USA"},"All the 8 hours baby, all the 8!",null,"UK"]
[null,"ID0534","2012-05-26T05:15:54",60000,60000,"AUD",{"$f":"Data!$E444*VLOOKUP(Data!$F444,tblXrate[],2,FALSE)","v":40067.812546745779},"Analyst","Analyst","Australia",{"$f":"VLOOKUP(Data!$J444,tblCountries[[Actual]:[Mapping]],2,FALSE)","v":"India"},"2 to 3 hours per day",null,"Australia"]
[null,"ID0537","2012-05-26T05:20:43",50000,50000,"USD",{"$f":"Data!$E445*VLOOKUP(Data!$F445,tblXrate[],2,FALSE)","v":98336.152303032693},"Research Assistant","Analyst","USA",{"$f":"VLOOKUP(Data!$J445,tblCountries[[Actual]:[Mapping]],2,FALSE)","v":"Canada"},"2 to 3 hours per day",null,"USA"]
[null,"ID0538","2012-05-26T05:23:20","73,000 GBP",73000,"GBP",{"$f":"Data!$E446*VLOOKUP(Data!$F446,tblXrate[],2,FALSE)","v":13100},"Finance Manager","Manager","UK",{"$f":"VLOOKUP(Data!$J446,tblCountries[[Actual]:[Mapping]],2,FALSE)","v":"India"},"4 to 6 hours a day",null,"UK"]
[null,"ID0540","2012-05-26T05:27:14",46000,46000,"USD",{"$f":"Data!$E447*VLOOKUP(Data!$F447,tblXrate[],2,FALSE)","v":11575.14584683767},"Research Analyst","Analyst","USA",{"$f":"VLOOKUP(Data!$J447,tblCountries[[Actual]:[Mapping]],2,FALSE)","v":"India"},"2 to 3 hours per day",null,"USA"]
[null,"ID0541","2012-05-26T05:27:37","PKR 50,000",600000,"PKR",{"$f":"Data!$E448*VLOOKUP(Data!$F448,tblXrate[],2,FALSE)","v":10684.750012465542},"Trainer","Consultant","Pakistan",{"$f":"VLOOKUP(Data!$J448,tblCountries[[Actual]:[Mapping]],2,FALSE)","v":"India"},"4 to 6 hours a day",null,"Pakistan"]
[null,"ID0543","2012-05-26T05:28:46",85000,85000,"AUD",{"$f":"Data!$E449*VLOOKUP(Data!$F449,tblXrate[],2,FALSE)","v":43600},"Business analyst","Analyst","Australia",{"$f":"VLOOKUP(Data!$J449,tblCountries[[Actual]:[Mapping]],2,FALSE)","v":"USA"},"4 to 6 hours a day",null,"Australia"]
[null,"ID0544","2012-05-26T05:29:55",450000,450000,"INR",{"$f":"Data!$E450*VLOOKUP(Data!$F450,tblXrate[],2,FALSE)","v":10684.750012465542},"deputy manager","Manager","India",{"$f":"VLOOKUP(Data!$J450,tblCountries[[Actual]:[Mapping]],2,FALSE)","v":"India"},"All the 8 hours baby, all the 8!",null,"India"]
[null,"ID0545","2012-05-26T05:29:58",43000,43000,"USD",{"$f":"Data!$E451*VLOOKUP(Data!$F451,tblXrate[],2,FALSE)","v":8903.9583437212841},"Accountant","Accountant","USA",{"$f":"VLOOKUP(Data!$J451,tblCountries[[Actual]:[Mapping]],2,FALSE)","v":"India"},"All the 8 hours baby, all the 8!",null,"USA"]
[null,"ID0547","2012-05-26T05:31:06",55000,55000,"USD",{"$f":"Data!$E452*VLOOKUP(Data!$F452,tblXrate[],2,FALSE)","v":2136.9500024931081},"Marketing","Analyst","USA",{"$f":"VLOOKUP(Data!$J452,tblCountries[[Actual]:[Mapping]],2,FALSE)","v":"India"},"2 to 3 hours per day",null,"USA"]
[null,"ID0548","2012-05-26T05:31:25","Rs. 500000",500000,"INR",{"$f":"Data!$E453*VLOOKUP(Data!$F453,tblXrate[],2,FALSE)","v":17807.916687442568},"Research Associate","Analyst","India",{"$f":"VLOOKUP(Data!$J453,tblCountries[[Actual]:[Mapping]],2,FALSE)","v":"India"},"All the 8 hours baby, all the 8!",null,"India"]
[null,"ID0549","2012-05-26T05:33:43",45000,45000,"USD",{"$f":"Data!$E454*VLOOKUP(Data!$F454,tblXrate[],2,FALSE)","v":16350},"Reports Coordinator","Reporting","USA",{"$f":"VLOOKUP(Data!$J454,tblCountries[[Actual]:[Mapping]],2,FALSE)","v":"India"},"All the 8 hours baby, all the 8!",null,"USA"]
[null,"ID0550","2012-05-26T05:35:00",50000,50000,"USD",{"$f":"Data!$E455*VLOOKUP(Data!$F455,tblXrate[],2,FALSE)","v":18698.312521814696},"Quality Compliance Manager","Manager","USA",{"$f":"VLOOKUP(Data!$J455,tblCountries[[Actual]:[Mapping]],2,FALSE)","v":"India"},"4 to 6 hours a day",null,"USA"]
[null,"ID0551","2012-05-26T05:44:42","80,000 USD",80000,"USD",{"$f":"Data!$E456*VLOOKUP(Data!$F456,tblXrate[],2,FALSE)","v":8000},"Cost Analyst","Analyst","USA",{"$f":"VLOOKUP(Data!$J456,tblCountries[[Actual]:[Mapping]],2,FALSE)","v":"India"},"All the 8 hours baby, all the 8!",null,"USA"]
[null,"ID0552","2012-05-26T05:46:02",67000,67000,"USD",{"$f":"Data!$E457*VLOOKUP(Data!$F457,tblXrate[],2,FALSE)","v":66294.12766617132},"Management Analyst","Analyst","USA",{"$f":"VLOOKUP(Data!$J457,tblCountries[[Actual]:[Mapping]],2,FALSE)","v":"Australia"},"4 to 6 hours a day",null,"USA"]
[null,"ID0554","2012-05-26T05:48:10",120000,120000,"USD",{"$f":"Data!$E458*VLOOKUP(Data!$F458,tblXrate[],2,FALSE)","v":50995.482820131787},"Director","CXO or Top Mgmt.","USA",{"$f":"VLOOKUP(Data!$J458,tblCountries[[Actual]:[Mapping]],2,FALSE)","v":"Australia"},"4 to 6 hours a day",null,"USA"]
[null,"ID0555","2012-05-26T05:48:12","Â£20000",20000,"GBP",{"$f":"Data!$E459*VLOOKUP(Data!$F459,tblXrate[],2,FALSE)","v":122389.15876831629},"IT Consultant","Consultant","UK",{"$f":"VLOOKUP(Data!$J459,tblCountries[[Actual]:[Mapping]],2,FALSE)","v":"Australia"},"4 to 6 hours a day",null,"UK"]
[null,"ID0556","2012-05-26T05:50:21",77000,77000,"AUD",{"$f":"Data!$E460*VLOOKUP(Data!$F460,tblXrate[],2,FALSE)","v":10150.512511842264},"Intelligence Analyst","Analyst","Australia",{"$f":"VLOOKUP(Data!$J460,tblCountries[[Actual]:[Mapping]],2,FALSE)","v":"India"},"2 to 3 hours per day",null,"Australia"]
[null,"ID0557","2012-05-26T05:50:23",60000,60000,"USD",{"$f":"Data!$E461*VLOOKUP(Data!$F461,tblXrate[],2,FALSE)","v":10800},"Marketing Specialist","Specialist","USA",{"$f":"VLOOKUP(Data!$J461,tblCountries[[Actual]:[Mapping]],2,FALSE)","v":"Pakistan"},"1 or 2 hours a day",null,"USA"]
[null,"ID0558","2012-05-26T05:50:26",35000,35000,"USD",{"$f":"Data!$E462*VLOOKUP(Data!$F462,tblXrate[],2,FALSE)","v":7123.1666749770275},"Analyst","Analyst","USA",{"$f":"VLOOKUP(Data!$J462,tblCountries[[Actual]:[Mapping]],2,FALSE)","v":"India"},"2 to 3 hours per day",null,"USA"]
[null,"ID0002","2012-05-25T03:13:13","15000 usd",15000,"USD",{"$f":"Data!$E1533*VLOOKUP(Data!$F1533,tblXrate[],2,FALSE)","v":70928.022243027779},"cost control","Controller","europe/Croatia","Other Countries","All the 8 hours baby, all the 8!",null,"Croatia"]
[null,"ID0006","2012-05-25T03:28:28",41731,41731,"USD",{"$f":"Data!$E1534*VLOOKUP(Data!$F1534,tblXrate[],2,FALSE)","v":60000},"Analyst","Analyst","Iceland","Other Countries","All the 8 hours baby, all the 8!",null,"Iceland"]
[null,"ID0007","2012-05-25T03:33:51",145000,145000,"EUR",{"$f":"Data!$E1535*VLOOKUP(Data!$F1535,tblXrate[],2,FALSE)","v":65250},"senior project manager","Manager","Germany","Other Countries","1 or 2 hours a day",null,"Germany"]
[null,"ID0008","2012-05-25T03:36:37",12000,12000,"USD",{"$f":"Data!$E1536*VLOOKUP(Data!$F1536,tblXrate[],2,FALSE)","v":21369.500024931083},"Assistant SP&A","Analyst","Ukraine","Other Countries","All the 8 hours baby, all the 8!",null,"Ukraine"]
[null,"ID0009","2012-05-25T03:37:17","44000 $",44000,"USD",{"$f":"Data!$E1537*VLOOKUP(Data!$F1537,tblXrate[],2,FALSE)","v":98336.152303032693},"CFO","CXO or Top Mgmt.","Portugal","Other Countries","1 or 2 hours a day",null,"Portugal"]
[null,"ID0011","2012-05-25T03:43:45","â‚¬ 51650",51650,"EUR",{"$f":"Data!$E1538*VLOOKUP(Data!$F1538,tblXrate[],2,FALSE)","v":73000},"Training Specialist","Specialist","Ireland","Other Countries","2 to 3 hours per day",null,"Ireland"]
[null,"ID0012","2012-05-25T03:43:56",14000,14000,"USD",{"$f":"Data!$E1539*VLOOKUP(Data!$F1539,tblXrate[],2,FALSE)","v":50000},"quality engineer","Engineer","Hungary","Other Countries","4 to 6 hours a day",null,"Hungary"]
[null,"ID0017","2012-05-25T04:10:11",107000,107000,"USD",{"$f":"Data!$E1540*VLOOKUP(Data!$F1540,tblXrate[],2,FALSE)","v":79000},"Business Development","Manager","Switzerland","Other Countries","4 to 6 hours a day",null,"Switzerland"]
[null,"ID0018","2012-05-25T04:10:44",45000,45000,"USD",{"$f":"Data!$E1541*VLOOKUP(Data!$F1541,tblXrate[],2,FALSE)","v":90000},"Excel Report Writer","Reporting","South Africa","Other Countries","All the 8 hours baby, all the 8!",null,"South Africa"]
[null,"ID0028","2012-05-25T04:48:33",2700,32400,"EUR",{"$f":"Data!$E1542*VLOOKUP(Data!$F1542,tblXrate[],2,FALSE)","v":70000},"Project Leader","Manager","Belgium","Other Countries","4 to 6 hours a day",null,"Belgium"]
[null,"ID0031","2012-05-25T04:55:48",41000,41000,"USD",{"$f":"Data!$E1543*VLOOKUP(Data!$F1543,tblXrate[],2,FALSE)","v":63918.498996971248},"Chief of the department of public budget analisis and forecasting","Manager","Russia","Other Countries","All the 8 hours baby, all the 8!",null,"Russia"]
[null,"ID0035","2012-05-25T05:01:09","1600 $",19200,"USD",{"$f":"Data!$E1544*VLOOKUP(Data!$F1544,tblXrate[],2,FALSE)","v":80000},"Analyst","Analyst","Poland","Other Countries","2 to 3 hours per day",null,"Poland"]
[null,"ID0050","2012-05-25T06:04:57","100000 USD",100000,"USD",{"$f":"Data!$E1545*VLOOKUP(Data!$F1545,tblXrate[],2,FALSE)","v":140000},"Seinor Financial Analyst","Analyst","Germany","Other Countries","All the 8 hours baby, all the 8!",null,"Germany"]
[null,"ID0053","2012-05-25T06:09:44","2000 Euros",24000,"EUR",{"$f":"Data!$E1546*VLOOKUP(Data!$F1546,tblXrate[],2,FALSE)","v":20000},"PPC Manager","Manager","Germany","Other Countries","All the 8 hours baby, all the 8!",null,"Germany"]
[null,"ID0058","2012-05-25T06:49:25",49000,49000,"EUR",{"$f":"Data!$E1547*VLOOKUP(Data!$F1547,tblXrate[],2,FALSE)","v":47700},"Project leader","Manager","France","Other Countries","2 to 3 hours per day",null,"France"]
[null,"ID0063","2012-05-25T07:15:12",61000,61000,"USD",{"$f":"Data!$E1548*VLOOKUP(Data!$F1548,tblXrate[],2,FALSE)","v":25000},"Coordinator Of Costa and Buget","Manager","Brasil","Other Countries","All the 8 hours baby, all the 8!",null,"Brasil"]
[null,"ID0064","2012-05-25T07:18:53",43000,43000,"EUR",{"$f":"Data!$E1549*VLOOKUP(Data!$F1549,tblXrate[],2,FALSE)","v":52500},"SAP consultant","Consultant","FR","Other Countries","4 to 6 hours a day",null,"France"]
[null,"ID0070","2012-05-25T07:47:00",100000,100000,"USD",{"$f":"Data!$E1550*VLOOKUP(Data!$F1550,tblXrate[],2,FALSE)","v":40000},"Mngr MI","Manager","RSA","Other Countries","4 to 6 hours a day",null,"South Africa"]
[null,"ID0074","2012-05-25T23:01:20",2785,33420,"USD",{"$f":"Data!$E1551*VLOOKUP(Data!$F1551,tblXrate[],2,FALSE)","v":31000},"Process Flow Coordinator","Manager","United Arab Emirates","Other Countries","All the 8 hours baby, all the 8!",null,"UAE"]
[null,"ID0079","2012-05-25T23:20:46","Us$ 18000",18000,"USD",{"$f":"Data!$E1552*VLOOKUP(Data!$F1552,tblXrate[],2,FALSE)","v":83033.071372504521},"Operational Analyst","Analyst","Saudi Arabia","Other Countries","All the 8 hours baby, all the 8!",null,"Saudi Arabia"]
[null,"ID0081","2012-05-25T23:33:15",26000,26000,"USD",{"$f":"Data!$E1553*VLOOKUP(Data!$F1553,tblXrate[],2,FALSE)","v":130000},"Marketing Analyst","Analyst","Panama","Other Countries","All the 8 hours baby, all the 8!",null,"Panama"]
[null,"ID0086","2012-05-26T00:11:21","US $ 31330.00",31330,"USD",{"$f":"Data!$E1554*VLOOKUP(Data!$F1554,tblXrate[],2,FALSE)","v":8369.7208430980063},"VBA Analyst","Analyst","Brazil","Other Countries","All the 8 hours baby, all the 8!",null,"Brazil"]
[null,"ID0103","2012-05-26T00:40:48",21000,21000,"USD",{"$f":"Data!$E1555*VLOOKUP(Data!$F1555,tblXrate[],2,FALSE)","v":51000},"IT support","Analyst","arabian Gulf","Other Countries","1 or 2 hours a day",null,"arabian Gulf"]
[null,"ID0105","2012-05-26T00:40:52",19200,19200,"USD",{"$f":"Data!$E1556*VLOOKUP(Data!$F1556,tblXrate[],2,FALSE)","v":94570.696324037053},"Sr Administrative Assistant","Analyst","Mexico","Other Countries","4 to 6 hours a day",null,"Mexico"]
[null,"ID0109","2012-05-26T00:41:06",35000,35000,"EUR",{"$f":"Data!$E1557*VLOOKUP(Data!$F1557,tblXrate[],2,FALSE)","v":34191.200039889729},"Project manager","Manager","Greece","Other Countries","4 to 6 hours a day",null,"Greece"]
[null,"ID0115","2012-05-26T00:41:30",4000,48000,"USD",{"$f":"Data!$E1558*VLOOKUP(Data!$F1558,tblXrate[],2,FALSE)","v":44132.991617883956},"Asst.Manager Finance","Manager","UAE","Other Countries","2 to 3 hours per day",null,"UAE"]
[null,"ID0117","2012-05-26T00:41:35",85000,85000,"USD",{"$f":"Data!$E1559*VLOOKUP(Data!$F1559,tblXrate[],2,FALSE)","v":73000},"Financial Controller","Controller","UAE","Other Countries","4 to 6 hours a day",null,"UAE"]
[null,"ID0119","2012-05-26T00:41:38",2000,24000,"USD",{"$f":"Data!$E1560*VLOOKUP(Data!$F1560,tblXrate[],2,FALSE)","v":62400},"Researcher","Manager","Colombia","Other Countries","All the 8 hours baby, all the 8!",null,"Colombia"]
[null,"ID0129","2012-05-26T00:42:32","36000 usd",36000,"USD",{"$f":"Data!$E1561*VLOOKUP(Data!$F1561,tblXrate[],2,FALSE)","v":54000},"senior accountant","Accountant","Turkey","Other Countries","4 to 6 hours a day",null,"Turkey"]
[null,"ID0150","2012-05-26T00:44:23",50000,50000,"USD",{"$f":"Data!$E1562*VLOOKUP(Data!$F1562,tblXrate[],2,FALSE)","v":4914.9850057341491},"Business Operations Reporting Analyst","Analyst","Mexico","Other Countries","All the 8 hours baby, all the 8!",null,"Mexico"]
[null,"ID0155","2012-05-26T00:45:11",15500,15500,"USD",{"$f":"Data!$E1563*VLOOKUP(Data!$F1563,tblXrate[],2,FALSE)","v":77000},"Proces auditor","Accountant","Mexico","Other Countries","All the 8 hours baby, all the 8!",null,"Mexico"]
[null,"ID0167","2012-05-26T00:47:57",145000,145000,"USD",{"$f":"Data!$E1564*VLOOKUP(Data!$F1564,tblXrate[],2,FALSE)","v":76000},"Financialcontroller","Controller","Switzerland","Other Countries","All the 8 hours baby, all the 8!",null,"Switzerland"]
[null,"ID0208","2012-05-26T00:54:14","â‚¬ 50000",50000,"EUR",{"$f":"Data!$E1565*VLOOKUP(Data!$F1565,tblXrate[],2,FALSE)","v":103000},"Data Analyst","Analyst","Ireland","Other Countries","4 to 6 hours a day",null,"Ireland"]
[null,"ID0213","2012-05-26T00:54:46",27000,27000,"USD",{"$f":"Data!$E1566*VLOOKUP(Data!$F1566,tblXrate[],2,FALSE)","v":40000},"Innovation Analyst","Analyst","Singapore","Other Countries","All the 8 hours baby, all the 8!",null,"Singapore"]
[null,"ID0220","2012-05-26T00:56:54",78000,78000,"USD",{"$f":"Data!$E1567*VLOOKUP(Data!$F1567,tblXrate[],2,FALSE)","v":80000},"Tax Professional","Accountant","Bermuda","Other Countries","4 to 6 hours a day",null,"Bermuda"]
[null,"ID0224","2012-05-26T00:57:52","US$ 138K",138000,"USD",{"$f":"Data!$E1568*VLOOKUP(Data!$F1568,tblXrate[],2,FALSE)","v":55000},"Project engineer","Engineer","Thailand","Other Countries","4 to 6 hours a day",null,"Thailand"]
[null,"ID0240","2012-05-26T01:02:16","1000 â‚¬",12000,"EUR",{"$f":"Data!$E1569*VLOOKUP(Data!$F1569,tblXrate[],2,FALSE)","v":99000},"HR Specialist","Specialist","Portugal","Other Countries","All the 8 hours baby, all the 8!",null,"Portugal"]
[null,"ID0249","2012-05-26T01:04:13","US$ 96k",96000,"USD",{"$f":"Data!$E1570*VLOOKUP(Data!$F1570,tblXrate[],2,FALSE)","v":75000},"Freellance","Consultant","Poland","Other Countries","2 to 3 hours per day",null,"Poland"]
[null,"ID0265","2012-05-26T01:08:21",2300,27600,"USD",{"$f":"Data!$E1571*VLOOKUP(Data!$F1571,tblXrate[],2,FALSE)","v":80000},"Software Consultant","Consultant","Singapore","Other Countries","All the 8 hours baby, all the 8!",null,"Singapore"]
[null,"ID0271","2012-05-26T01:09:34",7600,7600,"USD",{"$f":"Data!$E1572*VLOOKUP(Data!$F1572,tblXrate[],2,FALSE)","v":20000},"DP specialist","Specialist","Ukraine","Other Countries","1 or 2 hours a day",null,"Ukraine"]
[null,"ID0276","2012-05-26T01:10:56","35,000 Philippine Peso",420000,"PHP",{"$f":"Data!$E1573*VLOOKUP(Data!$F1573,tblXrate[],2,FALSE)","v":40000},"Global Problem Management - IT","Manager","Philippines","Other Countries","4 to 6 hours a day",null,"Philippines"]
[null,"ID0282","2012-05-26T01:14:55",14000,14000,"USD",{"$f":"Data!$E1574*VLOOKUP(Data!$F1574,tblXrate[],2,FALSE)","v":46000},"Auxiliar Administrativo","Analyst","Brazil","Other Countries","1 or 2 hours a day",null,"Brazil"]
[null,"ID0284","2012-05-26T01:15:12","36000 $",36000,"USD",{"$f":"Data!$E1575*VLOOKUP(Data!$F1575,tblXrate[],2,FALSE)","v":70000},"Senior Specialist","Specialist","Russia","Other Countries","4 to 6 hours a day",null,"Russia"]
[null,"ID0287","2012-05-26T01:17:11","AED100000",100000,"AED",{"$f":"Data!$E1576*VLOOKUP(Data!$F1576,tblXrate[],2,FALSE)","v":15000},"Accountant","Accountant","Dubai","Other Countries","4 to 6 hours a day",null,"Dubai"]
[null,"ID0293","2012-05-26T01:18:58",3600,43200,"USD",{"$f":"Data!$E1577*VLOOKUP(Data!$F1577,tblXrate[],2,FALSE)","v":26711.875031163851},"Projects Planner","Manager","Saudi Arabia","Other Countries","4 to 6 hours a day",null,"Saudi Arabia"]
[null,"ID0305","2012-05-26T01:22:48","65000 euro",65000,"EUR",{"$f":"Data!$E1578*VLOOKUP(Data!$F1578,tblXrate[],2,FALSE)","v":22000},"controller","Controller","germany","Other Countries","All the 8 hours baby, all the 8!",null,"Germany"]
[null,"ID0316","2012-05-26T01:26:37","150000 MXN",150000,"MXN",{"$f":"Data!$E1579*VLOOKUP(Data!$F1579,tblXrate[],2,FALSE)","v":68000},"Information Analyst","Analyst","Mexico","Other Countries","All the 8 hours baby, all the 8!",null,"Mexico"]
[null,"ID0322","2012-05-26T01:27:52",40000,40000,"USD",{"$f":"Data!$E1580*VLOOKUP(Data!$F1580,tblXrate[],2,FALSE)","v":97000},"Dp manager","Manager","Hungary","Other Countries","4 to 6 hours a day",null,"Hungary"]
[null,"ID0324","2012-05-26T01:29:32","US$ 4.545",4545,"USD",{"$f":"Data!$E1581*VLOOKUP(Data!$F1581,tblXrate[],2,FALSE)","v":48861.526434085805},"Supply Processes Analyst","Analyst","Brasil","Other Countries","All the 8 hours baby, all the 8!",null,"Brasil"]
[null,"ID0328","2012-05-26T01:30:56","PhP 456,000",456000,"PHP",{"$f":"Data!$E1582*VLOOKUP(Data!$F1582,tblXrate[],2,FALSE)","v":65000},"Reporting Shared Services Oferring Lead","Reporting","Philippines","Other Countries","4 to 6 hours a day",null,"Philippines"]
[null,"ID0330","2012-05-26T01:31:42","22000 usd",22000,"USD",{"$f":"Data!$E1583*VLOOKUP(Data!$F1583,tblXrate[],2,FALSE)","v":8013.5625093491553},"Product Manager Sr","Manager","Mexico","Other Countries","4 to 6 hours a day",null,"Mexico"]
[null,"ID0337","2012-05-26T01:33:45",150000,150000,"USD",{"$f":"Data!$E1584*VLOOKUP(Data!$F1584,tblXrate[],2,FALSE)","v":50000},"project manager, project finance consultant","Manager","Israel","Other Countries","4 to 6 hours a day",null,"Israel"]
[null,"ID0348","2012-05-26T01:40:05",950,11400,"USD",{"$f":"Data!$E1585*VLOOKUP(Data!$F1585,tblXrate[],2,FALSE)","v":45000},"Advisor","Consultant","Brazil","Other Countries","4 to 6 hours a day",null,"Brazil"]
[null,"ID0363","2012-05-26T01:46:24","480 000 SEK / 70000 US$",480000,"SEK",{"$f":"Data!$E1586*VLOOKUP(Data!$F1586,tblXrate[],2,FALSE)","v":3205.4250037396623},"IT consultant","Consultant","Sweden","Other Countries","1 or 2 hours a day",null,"Sweden"]
[null,"ID0368","2012-05-26T01:50:00",35000,35000,"USD",{"$f":"Data!$E1587*VLOOKUP(Data!$F1587,tblXrate[],2,FALSE)","v":60000},"Senior Treasury Analyst","Analyst","Brasil","Other Countries","All the 8 hours baby, all the 8!",null,"Brasil"]
[null,"ID0374","2012-05-26T01:52:01","2207,00",220700,"USD",{"$f":"Data!$E1588*VLOOKUP(Data!$F1588,tblXrate[],2,FALSE)","v":31000},"Consultant","Consultant","Brazil","Other Countries","All the 8 hours baby, all the 8!",null,"Brazil"]
[null,"ID0379","2012-05-26T01:57:40",1500,18000,"EUR",{"$f":"Data!$E1589*VLOOKUP(Data!$F1589,tblXrate[],2,FALSE)","v":75000},"marketing and sales ","Manager","Portugal","Other Countries","2 to 3 hours per day",null,"Portugal"]
[null,"ID0385","2012-05-26T01:59:48",15000,15000,"USD",{"$f":"Data!$E1590*VLOOKUP(Data!$F1590,tblXrate[],2,FALSE)","v":16000},"Economist","Reporting","Ukraine","Other Countries","2 to 3 hours per day",null,"Ukraine"]
[null,"ID0391","2012-05-26T02:00:54",12000,12000,"USD",{"$f":"Data!$E1591*VLOOKUP(Data!$F1591,tblXrate[],2,FALSE)","v":36000},"MIS Officer","Reporting","South Africa","Other Countries","4 to 6 hours a day",null,"South Africa"]
[null,"ID0394","2012-05-26T02:02:02","99147 $",99147,"USD",{"$f":"Data!$E1592*VLOOKUP(Data!$F1592,tblXrate[],2,FALSE)","v":41301.183967273726},"Chief Specialist of Economics & Planning","Specialist","Russia","Other Countries","4 to 6 hours a day",null,"Russia"]
[null,"ID0398","2012-05-26T02:04:05","120000 BDT",1440000,"BDT",{"$f":"Data!$E1593*VLOOKUP(Data!$F1593,tblXrate[],2,FALSE)","v":53000},"Computer Operator","Analyst","Bangladesh","Other Countries","2 to 3 hours per day",null,"Bangladesh"]
[null,"ID0408","2012-05-26T02:10:35",63586.95,63586,"USD",{"$f":"Data!$E1594*VLOOKUP(Data!$F1594,tblXrate[],2,FALSE)","v":67000},"Senior Purchasing Officer","Manager","United Arab Emriate","Other Countries","2 to 3 hours per day",null,"UAE"]
[null,"ID0411","2012-05-26T02:13:57",19200,19200,"USD",{"$f":"Data!$E1595*VLOOKUP(Data!$F1595,tblXrate[],2,FALSE)","v":12000},"Department Manager","Manager","Romania","Other Countries","All the 8 hours baby, all the 8!",null,"Romania"]
[null,"ID0412","2012-05-26T02:14:05","Â¢ 14.000.000,00",14000000,"COSTARICAN",{"$f":"Data!$E1596*VLOOKUP(Data!$F1596,tblXrate[],2,FALSE)","v":85000},"Businees Adminstratot","Analyst","Costa Rica","Other Countries","All the 8 hours baby, all the 8!",null,"Costa Rica"]
[null,"ID0416","2012-05-26T02:17:01",35000,35000,"USD",{"$f":"Data!$E1597*VLOOKUP(Data!$F1597,tblXrate[],2,FALSE)","v":254079.88779832155},"Credit Analyst","Analyst","Russia","Other Countries","4 to 6 hours a day",null,"Russia"]
[null,"ID0423","2012-05-26T02:20:15","8500 USD",8500,"USD",{"$f":"Data!$E1598*VLOOKUP(Data!$F1598,tblXrate[],2,FALSE)","v":40000},"Accounting Coordinator","Accountant","Romania","Other Countries","2 to 3 hours per day",null,"Romania"]
[null,"ID0424","2012-05-26T02:20:22",12000,12000,"USD",{"$f":"Data!$E1599*VLOOKUP(Data!$F1599,tblXrate[],2,FALSE)","v":31523.565441345683},"teacher","Analyst","iran","Other Countries","2 to 3 hours per day",null,"iran"]
[null,"ID0426","2012-05-26T02:24:24",5900,70800,"EUR",{"$f":"Data!$E1600*VLOOKUP(Data!$F1600,tblXrate[],2,FALSE)","v":41000},"Excel trainer","Analyst","Finland","Other Countries","All the 8 hours baby, all the 8!",null,"Finland"]
[null,"ID0429","2012-05-26T02:29:37","30000 $",30000,"USD",{"$f":"Data!$E1601*VLOOKUP(Data!$F1601,tblXrate[],2,FALSE)","v":24931.083362419595},"BI Developer","Reporting","Romania","Other Countries","1 or 2 hours a day",null,"Romania"]
[null,"ID0434","2012-05-26T02:34:00","US $6,629.00",6629,"USD",{"$f":"Data!$E1602*VLOOKUP(Data!$F1602,tblXrate[],2,FALSE)","v":125000},"Engineer","Engineer","Dominican Republic","Other Countries","All the 8 hours baby, all the 8!",null,"Dominican Republic"]
[null,"ID0436","2012-05-26T02:35:10",8500,8500,"USD",{"$f":"Data!$E1603*VLOOKUP(Data!$F1603,tblXrate[],2,FALSE)","v":59001.691381819612},"Assesor","Analyst","Colombia","Other Countries","1 or 2 hours a day",null,"Colombia"]
[null,"ID0453","2012-05-26T02:57:32",78000,78000,"USD",{"$f":"Data!$E1604*VLOOKUP(Data!$F1604,tblXrate[],2,FALSE)","v":70000},"FinanceManager","Manager","Somalia","Other Countries","4 to 6 hours a day",null,"Somalia"]
[null,"ID0455","2012-05-26T03:01:31","7500 USD",7500,"USD",{"$f":"Data!$E1605*VLOOKUP(Data!$F1605,tblXrate[],2,FALSE)","v":400000},"HR reporting analyst","Analyst","Romania","Other Countries","All the 8 hours baby, all the 8!",null,"Romania"]
[null,"ID0467","2012-05-26T03:11:21","5250 $",5250,"USD",{"$f":"Data!$E1606*VLOOKUP(Data!$F1606,tblXrate[],2,FALSE)","v":55000},"Treasure Specialist","Specialist","Republic of Georgia","Other Countries","4 to 6 hours a day",null,"Republic of Georgia"]
[null,"ID0476","2012-05-26T03:16:58",12000,12000,"USD",{"$f":"Data!$E1607*VLOOKUP(Data!$F1607,tblXrate[],2,FALSE)","v":60000},"Resource managment Analyst","Analyst","Estonia","Other Countries","All the 8 hours baby, all the 8!",null,"Estonia"]
[null,"ID0479","2012-05-26T03:21:26",2000,24000,"USD",{"$f":"Data!$E1608*VLOOKUP(Data!$F1608,tblXrate[],2,FALSE)","v":17807.916687442568},"engineer","Engineer","mozambique","Other Countries","2 to 3 hours per day",null,"mozambique"]
[null,"ID0484","2012-05-26T03:25:57",110000,110000,"USD",{"$f":"Data!$E1609*VLOOKUP(Data!$F1609,tblXrate[],2,FALSE)","v":137500},"Senior consultant accounting","Accountant","Norway","Other Countries","2 to 3 hours per day",null,"Norway"]
[null,"ID0485","2012-05-26T03:27:56","Zar 1080000",1080000,"ZAR",{"$f":"Data!$E1610*VLOOKUP(Data!$F1610,tblXrate[],2,FALSE)","v":45709.169889951241},"Finance manager","Manager","South africa","Other Countries","2 to 3 hours per day",null,"South Africa"]
[null,"ID0496","2012-05-26T03:48:42","USD 108,000",108000,"USD",{"$f":"Data!$E1611*VLOOKUP(Data!$F1611,tblXrate[],2,FALSE)","v":47000},"Manager","Manager","Norway","Other Countries","4 to 6 hours a day",null,"Norway"]
[null,"ID0502","2012-05-26T04:01:45","23000 USD",23000,"USD",{"$f":"Data!$E1612*VLOOKUP(Data!$F1612,tblXrate[],2,FALSE)","v":65000},"IT solutions coordinator","Manager","Hungary","Other Countries","4 to 6 hours a day",null,"Hungary"]
[null,"ID0506","2012-05-26T04:10:53",55500,55500,"USD",{"$f":"Data!$E1613*VLOOKUP(Data!$F1613,tblXrate[],2,FALSE)","v":92000},"Sr QS","Controller","UAE","Other Countries","4 to 6 hours a day",null,"UAE"]
[null,"ID0507","2012-05-26T04:12:16","15000 â‚¬",15000,"EUR",{"$f":"Data!$E1614*VLOOKUP(Data!$F1614,tblXrate[],2,FALSE)","v":108000},"Report Analyst","Analyst","Spain","Other Countries","All the 8 hours baby, all the 8!",null,"Spain"]
[null,"ID0511","2012-05-26T04:17:20",12000,12000,"USD",{"$f":"Data!$E1615*VLOOKUP(Data!$F1615,tblXrate[],2,FALSE)","v":61000},"Report Analyst","Analyst","Brazil","Other Countries","All the 8 hours baby, all the 8!",null,"Brazil"]
[null,"ID0518","2012-05-26T04:33:03","57000 USD",57000,"USD",{"$f":"Data!$E1616*VLOOKUP(Data!$F1616,tblXrate[],2,FALSE)","v":63918.498996971248},"project finance manager","Manager","israel","Other Countries","4 to 6 hours a day",null,"Israel"]
[null,"ID0533","2012-05-26T05:13:03",72000,72000,"USD",{"$f":"Data!$E1617*VLOOKUP(Data!$F1617,tblXrate[],2,FALSE)","v":50000},"Analytical Department Director ","Analyst","Russia","Other Countries","2 to 3 hours per day",null,"Russia"]
[null,"ID0535","2012-05-26T05:18:12","120k",120000,"USD",{"$f":"Data!$E1618*VLOOKUP(Data!$F1618,tblXrate[],2,FALSE)","v":150000},"manager","Manager","nz","Other Countries","2 to 3 hours per day",null,"New Zealand"]
[null,"ID0536","2012-05-26T05:18:27","US$95K",95000,"USD",{"$f":"Data!$E1619*VLOOKUP(Data!$F1619,tblXrate[],2,FALSE)","v":7123.1666749770275},"Director of Supply Chain","CXO or Top Mgmt.","Central America","Other Countries","2 to 3 hours per day",null,"Central America"]
[null,"ID0539","2012-05-26T05:24:16",50000,50000,"USD",{"$f":"Data!$E1620*VLOOKUP(Data!$F1620,tblXrate[],2,FALSE)","v":45000},"Excel professional","Analyst","self-employed","Other Countries","4 to 6 hours a day",null,"self-employed"]
[null,"ID0546","2012-05-26T05:30:12",1500,18000,"USD",{"$f":"Data!$E1621*VLOOKUP(Data!$F1621,tblXrate[],2,FALSE)","v":135000},"Engineer","Engineer","Brazil","Other Countries","4 to 6 hours a day",null,"Brazil"]
[null,"ID0553","2012-05-26T05:46:42",111000,111000,"USD",{"$f":"Data!$E1622*VLOOKUP(Data!$F1622,tblXrate[],2,FALSE)","v":6410.8500074793246},"Senior Financial Analyst","Analyst","Japan","Other Countries","All the 8 hours baby, all the 8!",null,"Japan"]
[null,"ID0559","2012-05-26T05:52:47",50000,50000,"EUR",{"$f":"Data!$E1623*VLOOKUP(Data!$F1623,tblXrate[],2,FALSE)","v":29000},"Proyect Manager","Manager","Panama","Other Countries","2 to 3 hours per day",null,"Panama"]
[]
[null,null,null,null,null,null,{"$f":"SUM(Data!$G$6:$G$1888)","v":93800888.515270099}]